<?xml version="1.0" standalone="no"?>
<!DOCTYPE svg PUBLIC "-//W3C//DTD SVG 20010904//EN"
 "http://www.w3.org/TR/2001/REC-SVG-20010904/DTD/svg10.dtd">
<svg version="1.0" xmlns="http://www.w3.org/2000/svg"
 width="339.000000pt" height="167.000000pt" viewBox="0 0 339.000000 167.000000"
 preserveAspectRatio="xMidYMid meet">

<g transform="translate(0.000000,167.000000) scale(0.100000,-0.100000)"
fill="#FFFFFF" stroke="none">
<path d="M2305 1471 c-54 -33 -78 -67 -83 -119 -6 -63 73 -535 97 -580 17 -32
58 -63 107 -81 78 -30 96 -95 48 -177 l-26 -45 8 -142 9 -142 82 -3 c128 -4
125 -9 121 167 -3 134 -5 149 -25 175 -49 62 -21 145 54 161 43 9 81 40 98 81
12 30 44 231 76 491 11 89 11 94 -12 140 -13 26 -39 58 -58 70 -33 22 -43 23
-250 23 -193 0 -219 -2 -246 -19z m265 -411 c0 -280 -1 -290 -19 -290 -19 0
-20 11 -23 278 -2 152 -1 283 1 290 2 6 12 12 22 12 18 0 19 -12 19 -290z
m-170 208 c5 -13 19 -93 30 -178 11 -85 25 -186 31 -224 10 -72 4 -94 -24 -83
-10 3 -19 31 -26 74 -39 248 -61 415 -56 423 11 18 35 11 45 -12z m345 13 c3
-5 -6 -90 -20 -188 -14 -98 -28 -198 -31 -223 -10 -77 -15 -90 -37 -90 -22 0
-21 14 3 205 4 39 14 116 21 173 11 96 25 132 49 132 5 0 11 -4 15 -9z"/>
<path d="M1127 1264 c-4 -4 -7 -42 -7 -84 0 -83 -13 -107 -72 -129 -31 -11
-37 -38 -12 -48 8 -3 26 0 40 7 16 9 28 10 34 4 6 -6 20 -63 31 -127 22 -134
34 -170 52 -165 19 7 20 50 3 135 -9 43 -18 102 -22 131 -6 49 -5 52 15 52 30
0 91 27 91 39 0 6 -20 11 -44 11 -58 0 -71 16 -62 83 4 28 7 61 9 72 1 15 -5
21 -23 23 -14 2 -29 0 -33 -4z"/>
<path d="M837 1234 c-4 -4 -7 -42 -7 -85 0 -74 -1 -78 -31 -103 -17 -14 -39
-26 -49 -26 -10 0 -22 -5 -25 -10 -4 -6 -24 9 -47 35 -38 43 -42 45 -93 45
-47 0 -56 -4 -79 -31 -14 -17 -26 -39 -26 -49 0 -28 -15 -32 -35 -10 -10 11
-33 23 -52 26 -51 10 -52 29 -2 80 38 38 41 46 29 58 -38 36 -211 61 -238 34
-18 -18 -15 -32 11 -43 19 -8 24 -22 33 -90 6 -44 19 -105 29 -135 12 -38 16
-73 12 -113 -6 -67 4 -77 50 -54 36 19 115 103 137 146 20 37 31 33 53 -20 22
-57 55 -79 117 -79 61 0 104 23 85 46 -8 10 -16 11 -30 3 -28 -14 -94 -8 -94
10 0 8 29 37 65 66 49 40 68 50 78 42 10 -7 24 -7 49 2 19 7 39 9 43 5 5 -5
19 -66 31 -137 23 -135 38 -171 60 -149 11 10 9 38 -9 145 -28 166 -28 167 3
167 34 0 75 20 75 37 0 11 -12 14 -47 12 l-48 -3 0 89 c0 83 -2 90 -20 93 -12
2 -24 0 -28 -4z m-503 -80 c22 -8 20 -30 -4 -54 -16 -16 -25 -18 -40 -10 -48
26 -8 84 44 64z m304 -140 c4 -30 -28 -64 -63 -67 -27 -2 -30 1 -33 31 -5 54
2 64 50 60 35 -2 44 -7 46 -24z m-248 -44 c29 -29 25 -55 -15 -98 -29 -31 -36
-34 -45 -22 -14 21 -33 118 -25 130 11 17 64 11 85 -10z"/>
<path d="M1550 1215 c-10 -12 -9 -24 8 -63 11 -26 25 -83 32 -127 6 -44 16
-90 21 -102 9 -25 38 -30 57 -11 15 15 16 64 2 73 -14 8 -13 91 2 118 6 12 28
42 49 66 21 24 36 47 33 52 -11 18 -47 8 -81 -22 l-35 -30 -19 30 c-20 33 -49
40 -69 16z"/>
<path d="M1351 1164 c-28 -23 -31 -31 -31 -83 0 -139 73 -215 175 -181 37 12
52 31 40 49 -4 7 -16 6 -36 -5 -36 -18 -68 -15 -83 8 -9 14 -6 21 14 35 54 38
100 86 100 105 0 11 -17 38 -39 59 -48 49 -93 53 -140 13z m113 -46 c13 -21 2
-43 -35 -70 -38 -28 -59 -15 -59 37 0 25 5 46 13 49 24 10 70 1 81 -16z"/>
<path d="M1567 732 c-10 -11 -17 -35 -17 -58 0 -49 -9 -60 -85 -112 -33 -22
-73 -54 -89 -71 -17 -17 -33 -31 -37 -31 -3 0 -14 20 -24 45 -26 69 -74 115
-119 115 -36 0 -38 -2 -73 -75 -44 -94 -41 -145 13 -205 62 -69 123 -61 164
20 23 44 32 44 55 0 24 -47 91 -80 160 -80 50 0 63 -4 87 -27 23 -22 32 -25
46 -16 20 13 20 14 -3 118 -16 73 -23 277 -13 365 2 20 -2 26 -23 28 -15 2
-32 -5 -42 -16z m-337 -224 c16 -17 20 -33 18 -67 -4 -56 -26 -73 -66 -51 -36
21 -42 75 -12 113 26 33 33 33 60 5z m304 10 c3 -7 7 -48 10 -90 6 -78 6 -78
-19 -78 -38 0 -75 21 -91 51 -20 40 -18 51 19 86 43 41 75 53 81 31z"/>
<path d="M491 695 c-33 -15 -34 -16 -28 -64 3 -27 18 -82 32 -122 40 -113 41
-124 11 -150 -36 -32 -33 -49 9 -49 40 0 57 -20 79 -94 21 -71 42 -98 73 -94
49 6 51 30 8 112 -39 72 -39 75 -21 94 10 11 35 23 56 27 42 7 66 27 54 46 -5
8 -27 10 -75 5 -62 -5 -69 -4 -79 14 -20 37 -60 174 -60 203 l0 29 80 -7 c82
-7 110 1 110 30 0 34 -182 48 -249 20z"/>
<path d="M861 532 c-42 -83 -47 -121 -23 -173 30 -67 61 -91 113 -87 38 3 47
8 72 44 43 61 47 119 12 189 -29 60 -63 85 -114 85 -27 0 -34 -7 -60 -58z
m112 -67 c30 -64 18 -105 -32 -105 -57 0 -80 64 -40 114 28 36 52 33 72 -9z"/>
</g>
</svg>
