<svg width="100" height="100" viewBox="0 0 100 100" fill="none" xmlns="http://www.w3.org/2000/svg">
<path d="M50 16.6667C54.4202 16.6667 58.6595 18.4226 61.7851 21.5482C64.9107 24.6738 66.6666 28.9131 66.6666 33.3333C66.6666 37.7536 64.9107 41.9928 61.7851 45.1184C58.6595 48.244 54.4202 50 50 50C45.5797 50 41.3405 48.244 38.2148 45.1184C35.0892 41.9928 33.3333 37.7536 33.3333 33.3333C33.3333 28.9131 35.0892 24.6738 38.2148 21.5482C41.3405 18.4226 45.5797 16.6667 50 16.6667ZM50 25C47.7898 25 45.6702 25.878 44.1074 27.4408C42.5446 29.0036 41.6666 31.1232 41.6666 33.3333C41.6666 35.5435 42.5446 37.6631 44.1074 39.2259C45.6702 40.7887 47.7898 41.6667 50 41.6667C52.2101 41.6667 54.3297 40.7887 55.8925 39.2259C57.4553 37.6631 58.3333 35.5435 58.3333 33.3333C58.3333 31.1232 57.4553 29.0036 55.8925 27.4408C54.3297 25.878 52.2101 25 50 25ZM50 54.1667C61.125 54.1667 83.3333 59.7083 83.3333 70.8333V83.3333H16.6666V70.8333C16.6666 59.7083 38.875 54.1667 50 54.1667ZM50 62.0833C37.625 62.0833 24.5833 68.1667 24.5833 70.8333V75.4167H75.4166V70.8333C75.4166 68.1667 62.375 62.0833 50 62.0833Z" fill="#FFFFFF"/>
</svg>
