<?xml version="1.0" encoding="UTF-8"?>
<svg id="a" data-name="Layer 1" xmlns="http://www.w3.org/2000/svg" viewBox="0 0 63.95 57.89">
  <path d="M8,45.85c2.01,.25,4.01,.49,6.36,.78v10.99C4.18,53.33-1.6,37.79,.39,27.09,3.25,11.76,15.47,.81,30.65,.04c14.38-.73,27.84,8.92,32.02,22.96,3.95,13.28-1.55,28.49-12.89,34.9v-11.25c2.23-.3,4.33-.59,6.44-.88,.03-.5,.06-1,.09-1.51-2.03-.42-4.06-.85-6.45-1.35-.22-.9-.51-2.11-.84-3.46H15.88c-1.17,1.46-1.93,3.09-3.2,3.79-1.35,.74-3.19,.58-4.82,.81,.05,.6,.09,1.2,.14,1.8Zm3.13-10.16c4.51,3.17,38.13,2.97,41.65-.37-2.88,0-4.92,.06-6.95-.01-2.73-.09-4.79-.74-7.4-2.54-3.02-2.08-9.92-2.28-12.55-.14-2.8,2.29-5.02,2.51-7.89,2.69-1.99,.12-3.98,.22-6.85,.37Zm20.76-7.02c-1.3-8.36,8.66-14.92,3.06-23-1.73,3.34-3.17,6.66-5.08,9.69-3.3,5.21-3.05,8.66,2.02,13.31Z"/>
</svg>