<?xml version="1.0" encoding="UTF-8"?>
<svg id="a" data-name="Layer 1" xmlns="http://www.w3.org/2000/svg" viewBox="0 0 359.68 359.42">
  <path d="M179.7,359.42c-31.19,0-62.38,0-93.57,0-6.43,0-8.14-1.72-8.14-8.21,0-12.98-.39-25.97,.1-38.92,.54-14.21-1.77-28.03-4.16-41.9-4.97-28.83-9.77-57.68-14.64-86.52-.04-.25-.06-.5-.07-.74-.16-4.13-2.02-6.18-6.27-7.62C18.9,164.01-2.54,131.23,.24,95.59,3.1,59.08,31.42,29.51,68.07,24.69c13.27-1.75,26.09-.1,38.49,4.79,2.2,.87,3.47,.69,5.16-1,37.9-37.94,98.17-37.97,136.01-.09,1.63,1.63,2.84,2.02,5.13,1.14,46.66-18,96.32,9.89,105.59,59.19,7.01,37.32-16.37,75.91-53.01,87.27-3,.93-4.26,2.23-4.79,5.45-4.74,28.99-9.71,57.94-14.61,86.91-1.35,7.98-2.71,15.95-4.02,23.94-.26,1.59-.41,3.21-.41,4.82-.03,18.22-.01,36.43-.02,54.65,0,5.73-1.91,7.66-7.57,7.66-31.44,0-62.88,0-94.32,0Zm42.1-71.94c.22-1.14,.47-1.98,.53-2.83,1.08-15.3,2.11-30.6,3.2-45.89,.7-9.82,1.41-19.65,2.23-29.46,.29-3.5,3.04-5.73,6.32-5.52,3.14,.2,5.44,2.58,5.56,5.92,.06,1.74-.04,3.49-.17,5.23-1.4,19.02-2.84,38.05-4.23,57.07-.37,5.06-.62,10.12-.93,15.39h36.18c1.72-10.15,3.45-20.31,5.17-30.47,4.63-27.37,9.4-54.71,13.79-82.12,.89-5.53,3.3-7.99,8.72-9.33,34.52-8.52,55.93-44.33,47.43-78.83-7.08-28.75-31.19-48.83-60.84-50.53-9.03-.52-17.8,.95-26.58,4.35,.84,1.34,1.47,2.36,2.12,3.38,5.29,8.23,9.33,17.02,11.89,26.47,.85,3.15-.76,6.28-3.56,7.35-3.05,1.16-6.38-.24-7.78-3.37-.46-1.01-.68-2.13-1.02-3.2C246.64,29.06,203.73,4.41,160.8,14.34c-15.36,3.55-28.68,10.92-39.87,22.02,.27,.46,.35,.74,.53,.88,.79,.6,1.63,1.14,2.42,1.75,20.4,15.56,31.19,36.1,31.91,61.81,.12,4.45-2.16,7.02-5.89,7.06-3.73,.04-5.84-2.42-6.08-6.93-.1-1.99-.31-3.98-.54-5.95-4.19-36.65-35.95-62.27-72.39-58.4C29.38,40.98,2.16,82.76,15.45,122.23c7.68,22.81,23.54,37.37,46.92,43.48,3.6,.94,6.57,2.19,7.27,6.39,5.5,32.9,11.04,65.8,16.58,98.69,.94,5.58,1.97,11.15,2.92,16.51h36.2c-1.19-16.7-2.37-33.1-3.53-49.51-.65-9.2-1.37-18.4-1.85-27.61-.2-3.79,2.34-6.34,5.78-6.42,3.29-.08,5.72,2.18,6.11,5.77,.27,2.48,.5,4.96,.67,7.45,1.34,19.15,2.65,38.31,3.99,57.46,.3,4.31,.71,8.62,1.06,12.82h36.23c0-3.8,0-7.29,0-10.78,0-17.97-.02-35.93,.01-53.9,0-4.88,3.44-7.95,7.56-6.69,3.34,1.02,4.42,3.55,4.41,6.94-.07,20.21-.03,40.42-.03,60.64,0,1.31,0,2.62,0,4.01h36.03Zm-131.69,59.72h179.23v-47.47H90.1v47.47Z"/>
</svg>