<?xml version="1.0" encoding="UTF-8"?>
<svg id="a" data-name="Layer 1" xmlns="http://www.w3.org/2000/svg" viewBox="0 0 97.33 11.75">
  <path d="M0,4.73c.37-.76,.64-1.58,1.12-2.27C2.24,.85,3.88,.11,5.82,0c.22-.01,.44,0,.67,0,28.13,0,56.27,0,84.4,0,2.99,0,5.2,1.4,6.07,3.83,1.37,3.87-1.22,7.66-5.4,7.9-.25,.01-.51,0-.76,0-28.1,0-56.2,0-84.31,0-2.63,0-4.68-.95-5.91-3.36C.35,7.95,.19,7.47,0,7.01c0-.76,0-1.52,0-2.28Z"/>
</svg>