{
  "id": "411287",
  "ldap": "regiao_dos_vales",
  "nome": "Ronda Alta",
  "tipo": "COOPERATIVA",
  "codigo": "0136",
  "pai": {
    "id": "5080799",
    "ldap": "sureg_regiao_vales",
    "nome": "SUREG Região dos Vales",
    "tipo": "URDC",
    "codigo": "0136",
    "pai": {
      "id": "3868259",
      "ldap": "central_rs",
      "nome": "Central Sicredi Sul/Sudeste",
      "tipo": "CENTRAL",
      "codigo": "CRS",
      "pai": null,
      "entidadePai": "sicredi",
      "tipoEntidadePai": "sistema"
    },
    "ebtidadePai": "central_rs",
    "tipoEntidadePai": "central"
  },
  "ebtidadePai": "sureg_regiao_vales",
  "tipoEntidadePai": "urdc"
}