Name,BirthDate,Age,Country,State,Sex,Equipment,Division,BodyweightKg,WeightClassKg,Squat1Kg,Squat2Kg,Squat3Kg,Best3SquatKg,Bench1Kg,Bench2Kg,Bench3Kg,Bench4Kg,Best3BenchKg,Deadlift1Kg,Deadlift2Kg,Deadlift3Kg,Best3DeadliftKg,TotalKg,Place,Event
Jacob Siebert,,31,USA,CA,M,Multi-ply,Open,135.71,110+,362.5,-382.5,-382.5,362.5,232.5,-242.5,-242.5,,232.5,250,270,-280,270,865,1,SBD
William Crozier,,30,Australia,,M,Wraps,Open,117.3,110+,350,370,385,385,205,220,-225,,220,350,370,380,380,985,3,SBD
Tyler Obringer,,27,USA,OH,M,Wraps,Open,159.48,110+,410,-435,435,435,227.5,-237.5,,,227.5,340,365,-372.5,365,1027.5,1,SBD
David Douglas,,32,USA,CA,M,Raw,Open,160.93,110+,330,355,367.5,367.5,247.5,260,277.5,,277.5,340,352.5,365,365,1010,2,SBD
Luke Dreier,,33,USA,IA,M,Wraps,Open,134.9,110+,340,365,-377.5,365,210,227.5,230,,230,330,350,360,360,955,5,SBD
Gabriel Vega,,23,USA,CA,M,Wraps,Open,119.75,110+,342.5,360,-365,360,182.5,190,197.5,,197.5,305,320,-330,320,877.5,7,SBD
Robert Dicochea,,31,USA,CA,M,Wraps,Open,162.39,110+,365,395,412.5,412.5,182.5,195,,,195,330,352.5,-380,352.5,960,4,SBD
Clayton Cox,,28,USA,CA,M,Wraps,Open,122.92,110+,310,327.5,-335,327.5,202.5,215,-220,,215,310,325,-327.5,325,867.5,8,SBD
Zachary Langdon,,30,USA,CA,M,Raw,Open,133.63,110+,300,322.5,-335,322.5,-200,207.5,-215,,207.5,330,352.5,-380,352.5,882.5,6,SBD
Jacob Lott,,25,USA,KS,M,Wraps,Open,125.46,110+,300,-317.5,-317.5,300,175,182.5,195,,195,317.5,335,-345,335,830,9,SBD
Ryan Sylva,,34,USA,MO,M,Raw,Open,124.19,110+,277.5,295,-305,295,195,205,-210,,205,287.5,305,317.5,317.5,817.5,10,SBD
Rob Flett,,24,UK,,M,Wraps,Open,123.56,110+,295,302.5,310,310,195,200,205,,205,275,290,300,300,815,11,SBD
Phillip Stevens,,42,USA,KS,M,Wraps,Open,124.1,110+,307.5,-327.5,327.5,327.5,155,160,,,160,-300,317.5,,317.5,805,12,SBD
Kasey Jacobsen,,24,USA,UT,M,Wraps,Open,118.57,110+,282.5,300,312.5,312.5,192.5,202.5,210,,210,237.5,255,272.5,272.5,795,14,SBD
Davy Capriles,,20,USA,CA,M,Raw,Open,127.82,110+,290,-320,-320,290,215,227.5,235,,235,275,-287.5,,275,800,13,SBD
Francisco Acosta,,29,USA,CA,M,Raw,Open,139.8,110+,265,287.5,297.5,297.5,175,197.5,-205,,197.5,265,290,295,295,790,15,SBD
Mason Clemens,,25,USA,CA,M,Wraps,Open,115.94,110+,255,267.5,272.5,272.5,160,170,-177.5,,170,275,280,-285,280,722.5,17,SBD
Andrew Sullivan,,20,USA,CA,M,Raw,Open,123.29,110+,247.5,260,272.5,272.5,167.5,177.5,182.5,,182.5,262.5,277.5,-295,277.5,732.5,16,SBD
Ethan Aboumrad,,20,USA,CA,M,Raw,Open,113.31,110+,220,232.5,250,250,152.5,162.5,182.5,,182.5,245,260,275,275,707.5,18,SBD
Josiah O'Brien,,29,USA,MO,M,Raw,Open,120.93,110+,102.5,125,142.5,142.5,185,197.5,-215,,197.5,295,320,342.5,342.5,682.5,19,SBD
Tee Goecke,,44,USA,CA,M,Wraps,Open,125.92,110+,-220,220,227.5,227.5,147.5,-150,150,,150,-200,200,205,205,582.5,20,SBD
Mark Wilson,,55,USA,CA,M,Raw,Open,126.82,110+,185,195,200,200,140,150,155,,155,185,190,,190,545,21,SBD
David DeOcampo,,28,USA,CA,M,Raw,Open,115.03,110+,170,190,200,200,110,115,125,,125,140,150,170,170,495,22,SBD
Cailer Woolam,,24,USA,TX,M,Raw,Open,97.89,110,285,307.5,,307.5,207.5,217.5,222.5,,222.5,410,432.5,,432.5,962.5,3,SBD
Andrew Herbert,,37,USA,CA,M,Wraps,Open,109.04,110,405,-427.5,427.5,427.5,200,212.5,215,,215,360,-375,-375,360,1002.5,1,SBD
Ranson Lee,,28,USA,NC,M,Wraps,Open,99.7,110,355,372.5,385,385,217.5,227.5,235,,235,315,332.5,347.5,347.5,967.5,2,SBD
Anthony Cooper #1,,24,UK,,M,Wraps,Open,105.87,110,340,370,377.5,377.5,230,240,250,,250,310,327.5,,327.5,955,4,SBD
Jeremy Avilla,,31,USA,CA,M,Raw,Open,99.61,110,295,,,295,182.5,200,-205,,200,365,385,,385,880,8,SBD
Justin Cherocci,,27,USA,MI,M,Wraps,Open,109.68,110,347.5,365,372.5,372.5,202.5,210,-215,,210,307.5,325,-335,325,907.5,5,SBD
Josh Caldwell,,27,USA,CA,M,Wraps,Open,108.5,110,345,370,-380,370,185,197.5,-207.5,,197.5,305,330,-340,330,897.5,6,SBD
Bryan Cain,,30,USA,WA,M,Wraps,Open,109.04,110,320,340,357.5,357.5,200,210,217.5,,217.5,300,320,-332.5,320,895,7,SBD
Edward Blair,,24,USA,IL,M,Wraps,Open,99.52,110,282.5,300,320,320,227.5,240,250,-260.5,250,272.5,285,292.5,292.5,862.5,9,SBD
Michael Greeno,,36,USA,KS,M,Wraps,Open,108.77,110,295,310,320,320,195,210,-220,,210,262.5,277.5,287.5,287.5,817.5,10,SBD
Louie Loniewski,,30,USA,WA,M,Wraps,Open,99.79,110,-307.5,307.5,-325,307.5,185,195,202.5,,202.5,262.5,272.5,282.5,282.5,792.5,12,SBD
Sean Reisner,,31,USA,OR,M,Wraps,Open,99.61,110,305,320,327.5,327.5,152.5,162.5,-167.5,,162.5,-282.5,282.5,290,290,780,13,SBD
Tony Montgomery,,33,USA,OR,M,Raw,Open,107.5,110,267.5,282.5,-292.5,282.5,200,215,-220,,215,290,300,,300,797.5,11,SBD
Dan Stephenson,,30,USA,WA,M,Wraps,Open,98.34,110,265,285,290,290,170,180,185,,185,272.5,285,-295,285,760,14,SBD
Will Parfet,,26,USA,CA,M,Raw,Open,98.16,110,210,222.5,230,230,160,172.5,180,,180,282.5,297.5,302.5,302.5,712.5,16,SBD
Kyle Sullivan,,30,USA,CA,M,Wraps,Open,96.52,110,220,230,237.5,237.5,167.5,177.5,185,,185,250,265,280,280,702.5,18,SBD
Aaron Nguyen,,25,USA,CA,M,Wraps,Open,108.95,110,242.5,250,255,255,177.5,185,-190,,185,255,265,277.5,277.5,717.5,15,SBD
Jacob McBride #1,,30,USA,CA,M,Raw,Open,96.98,110,222.5,230,232.5,232.5,140,147.5,155,,155,277.5,290,-297.5,290,677.5,21,SBD
Vincent Vitale,,35,USA,CA,M,Raw,Open,109.13,110,235,247.5,-257.5,247.5,172.5,-182.5,-182.5,,172.5,280,287.5,-295,287.5,707.5,17,SBD
Tim Payne,,33,USA,CA,M,Raw,Open,102.42,110,227.5,235,240,240,157.5,162.5,167.5,,167.5,275,285,,285,692.5,19,SBD
Garrett Berg,,29,USA,CA,M,Wraps,Open,108.14,110,240,250,260,260,145,152.5,160,,160,255,267.5,-280,267.5,687.5,20,SBD
Andrew DeSesa,,25,USA,CA,M,Raw,Open,108.68,110,185,-210,,185,155,-170,-175,,155,255,,,255,595,22,SBD
Jean-Luc Theriault,,26,USA,CA,M,Raw,Open,105.51,110,197.5,207.5,220,220,122.5,130,-135,,130,210,220,230,230,580,23,SBD
Joshua Riegler,,27,USA,CA,M,Raw,Open,98.25,110,165,177.5,185,185,-127.5,127.5,-135,,127.5,220,232.5,-242.5,232.5,545,24,SBD
Arturo Garcia,,34,USA,CA,M,Raw,Open,99.52,110,202.5,212.5,-220,212.5,110,120,125,,125,192.5,197.5,207.5,207.5,545,25,SBD
Ricardo Penate,,23,USA,CA,M,Raw,Open,99.43,110,170,180,187.5,187.5,117.5,120,,,120,192.5,207.5,220,220,527.5,26,SBD
Shawn Brock,,47,USA,CA,M,Raw,Open,94.35,110,142.5,147.5,155,155,102.5,110,-122.5,,110,180,187.5,195,195,460,28,SBD
Maurice Theriault,,21,USA,CA,M,Raw,Open,107.5,110,155,165,-175,165,100,-110,-110,,100,175,195,205,205,470,27,SBD
Gabriel Marin,,24,USA,CA,M,Raw,Open,98.79,110,195,200,-205,200,-150,-155,-155,,,235,242.5,250,250,,DQ,SBD
David Skolnik,,30,USA,CA,M,Raw,Open,94.26,110,,,,,132.5,137.5,145,,145,195,205,220,220,365,1,BD
Natashia Ernst,,24,USA,CA,F,Raw,Open,59.15,75,,,,,60,65,-72.5,,65,110,115,120,120,185,1,BD
Benjamin Kwok,,28,USA,CA,M,Raw,Open,87.36,90,,,,,132.5,142.5,147.5,,147.5,220,-232.5,-232.5,220,367.5,1,BD
Ray Gallegos,,50,USA,CA,M,Raw,Open,67.4,90,,,,,165,173,-177.5,,173,,,,,173,1,B
Sara Schiff,,44,USA,CA,F,Wraps,Open,106.05,75+,215,-230,230,230,125,132.5,137.5,,137.5,260,275,,275,642.5,1,SBD
Moriah Nakada,,25,USA,CA,F,Raw,Open,75.93,75+,130,140,150,150,85,97.5,-102.5,,97.5,147.5,160,170,170,417.5,2,SBD
Tina Michaud #1,,34,USA,CA,F,Wraps,Open,84.64,75+,142.5,150,-155,150,72.5,77.5,-80,,77.5,160,165,-170,165,392.5,3,SBD
Stacey Rohrer,,47,USA,CA,F,Raw,Open,77.93,75+,97.5,102.5,107.5,107.5,67.5,-75,-75,,67.5,147.5,157.5,162.5,162.5,337.5,5,SBD
Hope Graner,,33,USA,CA,F,Raw,Open,82.19,75+,115,127.5,-137.5,127.5,67.5,72.5,-75,,72.5,130,137.5,145,145,345,4,SBD
Kristy Hawkins,,39,USA,CA,F,Raw,Open,74.12,75,230,-245,-245,230,145,152.5,-156.5,,152.5,245,257.5,262.5,262.5,645,1,SBD
Blanca Villoch,,35,USA,FL,F,Wraps,Open,66.86,75,210,227.5,-232.5,227.5,97.5,105,107.5,,107.5,217.5,-232.5,232.5,232.5,567.5,4,SBD
Brianny Terry,,22,USA,WA,F,Wraps,Open,74.93,75,215,227.5,235,235,115,122.5,-130,,122.5,240,255.5,-266,255.5,613,2,SBD
Caitlin Sullivan,,28,USA,NE,F,Wraps,Open,67.4,75,210,-230,230,230,97.5,-105,-107.5,,97.5,197.5,217.5,-227.5,217.5,545,5,SBD
Tasha Whelan,,34,USA,WA,F,Wraps,Open,65.59,75,167.5,180,190,190,102.5,107.5,110,,110,197.5,212.5,227.5,227.5,527.5,7,SBD
Terri Ashley,,37,USA,CA,F,Wraps,Open,74.75,75,215,235,-250,235,92.5,97.5,100,,100,210,225,235,235,570,3,SBD
Nicole Moore,,32,USA,CA,F,Wraps,Open,74.03,75,210,-225,-225,210,97.5,102.5,105,,105,222.5,-235,-235,222.5,537.5,6,SBD
Tiffany Leung,,28,USA,CA,F,Wraps,Open,44,75,132.5,-140.5,140.5,140.5,62.5,-67.5,-67.5,,62.5,150,-157.5,-162.5,150,353,16,SBD
Tsukiko Fredette,,21,USA,CA,F,Raw,Open,59.24,75,167.5,175,-182.5,175,85,-90,,,85,175,182.5,,182.5,442.5,10,SBD
Stacia-Al Mahoe,,,USA,HI,F,Wraps,Open,47.9,75,110,-127.5,127.5,127.5,70,77.5,,,77.5,145,160,,160,365,15,SBD
Kaylie Klitzing,,27,USA,OR,F,Wraps,Open,58.79,75,137.5,152.5,162.5,162.5,90,97.5,100,,100,150,167.5,-172.5,167.5,430,11,SBD
Caylea Borges,,27,USA,IN,F,Wraps,Open,65.32,75,167.5,177.5,187.5,187.5,82.5,90,-95,,90,165,177.5,-187.5,177.5,455,9,SBD
Falon Gallipeau,,31,USA,CA,F,Raw,Open,66.68,75,165,-175,-177.5,165,92.5,-102.5,102.5,,102.5,170,185,195,195,462.5,8,SBD
Amy Zager,,31,USA,CA,F,Raw,Open,59.87,75,130,137.5,-142.5,137.5,75,-77.5,77.5,,77.5,157.5,-162.5,,157.5,372.5,14,SBD
Jasmine Mercado,,23,USA,CA,F,Raw,Open,51.26,75,120,125,-130,125,52.5,57.5,-60,,57.5,122.5,130,132.5,132.5,315,17,SBD
Madison Riebe,,23,USA,MN,F,Raw,Open,71.67,75,140,147.5,-152.5,147.5,80,85,90,,90,162.5,167.5,-172.5,167.5,405,12,SBD
Kate Jehue,,32,USA,CA,F,Wraps,Open,73.66,75,137.5,147.5,-152.5,147.5,77.5,85,-90,,85,160,170,-177.5,170,402.5,13,SBD
Anne Marie Peralta,,23,USA,CA,F,Raw,Open,51.53,75,92.5,97.5,100,100,42.5,-45,-45,,42.5,110,120,127.5,127.5,270,18,SBD
Logan Richards,,28,USA,KS,F,Wraps,Open,61.69,75,87.5,95,-105,95,-47.5,50,52.5,,52.5,102.5,107.5,-110,107.5,255,19,SBD
Bella Derby,,18,USA,CA,F,Raw,Open,66.5,75,67.5,77.5,-87.5,77.5,45,50,55,,55,90,100,-105,100,232.5,20,SBD
Katie Volker,,38,USA,CA,F,Raw,Open,62.87,75,60,67.5,72.5,72.5,40,42.5,-47.5,,42.5,75,82.5,87.5,87.5,202.5,21,SBD
Zeba Kamin,,35,USA,CA,F,Raw,Open,65.5,75,105,-110,-110,105,-47.5,-47.5,-47.5,,,135,137.5,,137.5,,DQ,SBD
Erin Paxton,,28,USA,CA,F,Raw,Open,72.94,75,117.5,125,130,130,62.5,67.5,-70,,67.5,-145,-145,-145,,,DQ,SBD
Mackie Fleishman,,31,USA,WA,M,Wraps,Open,89.9,90,300,320,332.5,332.5,215,227.5,-232.5,,227.5,290,305,320,320,880,1,SBD
Chris Garcia #1,,31,USA,CA,M,Wraps,Open,89.9,90,317.5,335,350,350,182.5,192.5,202.5,,202.5,310,327.5,-335,327.5,880,2,SBD
Shawn Graves,,23,USA,CA,M,Wraps,Open,89.9,90,295,312.5,320,320,185,192.5,-197.5,,192.5,305,322.5,-332.5,322.5,835,3,SBD
Adrian Asbun,,28,USA,CA,M,Wraps,Open,89.27,90,190,210,235,235,160,-175,-177.5,,160,245,272.5,-285,272.5,667.5,4,SBD
Paul Yonnotti,,28,USA,CA,M,Raw,Open,89.63,90,227.5,240,250,250,170,182.5,-185,,182.5,210,220,-230,220,652.5,5,SBD
Abi Sekhar,,28,USA,CA,M,Raw,Open,67.22,90,152.5,157.5,167.5,167.5,115,122.5,127.5,,127.5,205,217.5,-227.5,217.5,512.5,13,SBD
Richard Alba,,27,USA,CA,M,Raw,Open,82.1,90,185,195,202.5,202.5,112.5,120,127.5,,127.5,225,235,250,250,580,6,SBD
Patrick Mora,,24,USA,CA,M,Raw,Open,88.72,90,185,190,197.5,197.5,127.5,132.5,137.5,,137.5,235,245,-257.5,245,580,7,SBD
Justin Blanchard,,23,USA,WA,M,Wraps,Open,88.09,90,192.5,205,212.5,212.5,115,125,127.5,,127.5,200,212.5,220,220,560,8,SBD
Jonathan Hurley,,24,USA,CA,M,Raw,Open,80.2,90,170,180,-185,180,105,-107.5,107.5,,107.5,220,230,-237.5,230,517.5,12,SBD
Mauricio Salazar,,19,USA,CA,M,Raw,Open,86.91,90,182.5,192.5,200,200,87.5,105,,,105,215,-235,235,235,540,9,SBD
Justin Schaaf,,21,USA,OR,M,Raw,Open,88.99,90,175,190,195,195,122.5,130,132.5,,132.5,212.5,-227.5,-227.5,212.5,540,10,SBD
Jordan Pilkington,,25,USA,NV,M,Raw,Open,89.54,90,175,187.5,-195,187.5,117.5,125,-127.5,,125,197.5,210,220,220,532.5,11,SBD
Brendan Turley,,24,USA,CA,M,Raw,Open,74.57,90,117.5,125,135,135,102.5,112.5,117.5,,117.5,145,157.5,-167.5,157.5,410,14,SBD
Kris Gallegos,,37,USA,CA,M,Wraps,Open,81.74,90,185,205,215,215,-140,-150,-150,,,225,240,-245,240,,DQ,SBD
Mark DeMeo Jr,,60,USA,CA,M,Raw,Open,70.85,90,152.5,165,-190,165,115,120,125,,125,-162.5,,,,,DQ,SBD
John Stott,,54,USA,CA,M,Wraps,Open,91.44,110,185,192.5,197.5,197.5,82.5,85,-87.5,,85,190,197.5,200,200,482.5,G,SBD
