{
  "type": "code",
  "modid": "resinregrow",
  "name": "Resin Regrow",
  "author": "Elias Heyndrickx",
  "description": "Adds in the possibility for resin to generate on trees grown from saplings",
  "version": "1.0.0",
  "dependencies": {
    "game": ""
  }
}
