{
  "type": "code",
  "modid": "betterdoors",
  "name": "Better doors",
  "author": "Elias Heyndrickx",
  "description": "Doors will consider their surroundings (more) when determining their opening direction",
  "version": "1.0.0",
  "dependencies": {
    "game": "1.6.0"
  }
}
