{
  "profiles": {
    "start-debug-in-game": {
      "commandName": "Executable",
      "executablePath": "$(VINTAGE_STORY)/Vintagestory.exe",
      "commandLineArgs": "--addModPath=\"$(SolutionDir)VSModLauncher\\bin\\$(Configuration)\\\\\" \"$(SolutionDir)coloredtorches\\bin\\$(Configuration)\\\\\" "
    }
  }
}
