{
  "data_asset_type": null,
  "expectation_suite_name": "era_history_cleaned.warning",
  "expectations": [
    {
      "expectation_context": {
        "description": null
      },
      "expectation_type": "expect_table_column_count_to_equal",
      "ge_cloud_id": null,
      "kwargs": {
        "value": 27
      },
      "meta": {}
    },
    {
      "expectation_context": {
        "description": null
      },
      "expectation_type": "expect_column_values_to_not_be_null",
      "ge_cloud_id": null,
      "kwargs": {
        "column": "id"
      },
      "meta": {}
    },
    {
      "expectation_context": {
        "description": null
      },
      "expectation_type": "expect_column_values_to_not_be_null",
      "ge_cloud_id": null,
      "kwargs": {
        "column": "account_name"
      },
      "meta": {}
    },
    {
      "expectation_context": {
        "description": null
      },
      "expectation_type": "expect_column_values_to_not_be_null",
      "ge_cloud_id": null,
      "kwargs": {
        "column": "gbgid"
      },
      "meta": {}
    },
    {
      "expectation_context": {
        "description": null
      },
      "expectation_type": "expect_column_values_to_not_be_null",
      "ge_cloud_id": null,
      "kwargs": {
        "column": "contract_id"
      },
      "meta": {}
    },
    {
      "expectation_context": {
        "description": null
      },
      "expectation_type": "expect_column_values_to_not_be_null",
      "ge_cloud_id": null,
      "kwargs": {
        "column": "completed"
      },
      "meta": {}
    },
    {
      "expectation_context": {
        "description": null
      },
      "expectation_type": "expect_column_values_to_not_be_null",
      "ge_cloud_id": null,
      "kwargs": {
        "column": "day"
      },
      "meta": {}
    },
    {
      "expectation_context": {
        "description": null
      },
      "expectation_type": "expect_column_values_to_not_be_null",
      "ge_cloud_id": null,
      "kwargs": {
        "column": "month"
      },
      "meta": {}
    },
    {
      "expectation_context": {
        "description": null
      },
      "expectation_type": "expect_column_values_to_not_be_null",
      "ge_cloud_id": null,
      "kwargs": {
        "column": "quarter"
      },
      "meta": {}
    },
    {
      "expectation_context": {
        "description": null
      },
      "expectation_type": "expect_column_values_to_not_be_null",
      "ge_cloud_id": null,
      "kwargs": {
        "column": "year"
      },
      "meta": {}
    },
    {
      "expectation_context": {
        "description": null
      },
      "expectation_type": "expect_column_values_to_not_be_null",
      "ge_cloud_id": null,
      "kwargs": {
        "column": "score"
      },
      "meta": {}
    },
    {
      "expectation_context": {
        "description": null
      },
      "expectation_type": "expect_column_values_to_not_be_null",
      "ge_cloud_id": null,
      "kwargs": {
        "column": "q1"
      },
      "meta": {}
    },
    {
      "expectation_context": {
        "description": null
      },
      "expectation_type": "expect_column_values_to_not_be_null",
      "ge_cloud_id": null,
      "kwargs": {
        "column": "q2"
      },
      "meta": {}
    },
    {
      "expectation_context": {
        "description": null
      },
      "expectation_type": "expect_column_values_to_not_be_null",
      "ge_cloud_id": null,
      "kwargs": {
        "column": "q3"
      },
      "meta": {}
    },
    {
      "expectation_context": {
        "description": null
      },
      "expectation_type": "expect_column_values_to_not_be_null",
      "ge_cloud_id": null,
      "kwargs": {
        "column": "q4"
      },
      "meta": {}
    },
    {
      "expectation_context": {
        "description": null
      },
      "expectation_type": "expect_column_values_to_not_be_null",
      "ge_cloud_id": null,
      "kwargs": {
        "column": "q5"
      },
      "meta": {}
    },
    {
      "expectation_context": {
        "description": null
      },
      "expectation_type": "expect_column_values_to_not_be_null",
      "ge_cloud_id": null,
      "kwargs": {
        "column": "q6"
      },
      "meta": {}
    },
    {
      "expectation_context": {
        "description": null
      },
      "expectation_type": "expect_column_values_to_not_be_null",
      "ge_cloud_id": null,
      "kwargs": {
        "column": "q7"
      },
      "meta": {}
    },
    {
      "expectation_context": {
        "description": null
      },
      "expectation_type": "expect_column_values_to_not_be_null",
      "ge_cloud_id": null,
      "kwargs": {
        "column": "q8"
      },
      "meta": {}
    },
    {
      "expectation_context": {
        "description": null
      },
      "expectation_type": "expect_column_values_to_not_be_null",
      "ge_cloud_id": null,
      "kwargs": {
        "column": "q9"
      },
      "meta": {}
    },
    {
      "expectation_context": {
        "description": null
      },
      "expectation_type": "expect_column_values_to_not_be_null",
      "ge_cloud_id": null,
      "kwargs": {
        "column": "q10"
      },
      "meta": {}
    },
    {
      "expectation_context": {
        "description": null
      },
      "expectation_type": "expect_column_values_to_not_be_null",
      "ge_cloud_id": null,
      "kwargs": {
        "column": "q11"
      },
      "meta": {}
    },
    {
      "expectation_context": {
        "description": null
      },
      "expectation_type": "expect_column_values_to_not_be_null",
      "ge_cloud_id": null,
      "kwargs": {
        "column": "q12"
      },
      "meta": {}
    },
    {
      "expectation_context": {
        "description": null
      },
      "expectation_type": "expect_column_values_to_not_be_null",
      "ge_cloud_id": null,
      "kwargs": {
        "column": "q13"
      },
      "meta": {}
    },
    {
      "expectation_context": {
        "description": null
      },
      "expectation_type": "expect_column_values_to_not_be_null",
      "ge_cloud_id": null,
      "kwargs": {
        "column": "q14"
      },
      "meta": {}
    },
    {
      "expectation_context": {
        "description": null
      },
      "expectation_type": "expect_column_values_to_not_be_null",
      "ge_cloud_id": null,
      "kwargs": {
        "column": "q15"
      },
      "meta": {}
    },
    {
      "expectation_context": {
        "description": null
      },
      "expectation_type": "expect_column_values_to_not_be_null",
      "ge_cloud_id": null,
      "kwargs": {
        "column": "q16"
      },
      "meta": {}
    },
    {
      "expectation_context": {
        "description": null
      },
      "expectation_type": "expect_column_values_to_not_be_null",
      "ge_cloud_id": null,
      "kwargs": {
        "column": "comments"
      },
      "meta": {}
    },
    {
      "expectation_context": {
        "description": null
      },
      "expectation_type": "expect_table_columns_to_match_ordered_list",
      "ge_cloud_id": null,
      "kwargs": {
        "column_list": [
          "id",
          "account_name",
          "gbgid",
          "contract_id",
          "completed",
          "day",
          "month",
          "quarter",
          "year",
          "score",
          "q1",
          "q2",
          "q3",
          "q4",
          "q5",
          "q6",
          "q7",
          "q8",
          "q9",
          "q10",
          "q11",
          "q12",
          "q13",
          "q14",
          "q15",
          "q16",
          "comments"
        ]
      },
      "meta": {}
    },
    {
      "expectation_context": {
        "description": null
      },
      "expectation_type": "expect_column_values_to_match_regex",
      "ge_cloud_id": null,
      "kwargs": {
        "column": "gbgid",
        "regex": "^GB[0-9]*"
      },
      "meta": {}
    },
    {
      "expectation_context": {
        "description": null
      },
      "expectation_type": "expect_column_values_to_be_between",
      "ge_cloud_id": null,
      "kwargs": {
        "column": "day",
        "max_value": 31,
        "min_value": 1
      },
      "meta": {}
    },
    {
      "expectation_context": {
        "description": null
      },
      "expectation_type": "expect_column_values_to_be_between",
      "ge_cloud_id": null,
      "kwargs": {
        "column": "month",
        "max_value": 12,
        "min_value": 1
      },
      "meta": {}
    },
    {
      "expectation_context": {
        "description": null
      },
      "expectation_type": "expect_column_values_to_be_between",
      "ge_cloud_id": null,
      "kwargs": {
        "column": "year",
        "max_value": 2100,
        "min_value": 2000
      },
      "meta": {}
    },
    {
      "expectation_context": {
        "description": null
      },
      "expectation_type": "expect_column_values_to_be_between",
      "ge_cloud_id": null,
      "kwargs": {
        "column": "quarter",
        "max_value": 4,
        "min_value": 1
      },
      "meta": {}
    },
    {
      "expectation_context": {
        "description": null
      },
      "expectation_type": "expect_column_values_to_be_between",
      "ge_cloud_id": null,
      "kwargs": {
        "column": "score",
        "max_value": 19,
        "min_value": 0
      },
      "meta": {}
    }
  ],
  "ge_cloud_id": null,
  "meta": {
    "citations": [
      {
        "batch_request": {
          "data_asset_name": "era_history",
          "data_connector_name": "default_inferred_data_connector_name",
          "datasource_name": "airflow-pg",
          "limit": 1000
        },
        "citation_date": "2022-02-19T14:39:11.905031Z",
        "comment": "Created suite added via CLI"
      }
    ],
    "great_expectations_version": "0.13.45"
  }
}
