<svg width="179" height="57" viewBox="0 0 179 57" fill="none" xmlns="http://www.w3.org/2000/svg">
<path d="M81.8545 50.18C81.4545 50.18 80.9879 50.1533 80.4545 50.1C79.9212 50.06 79.3879 50.0067 78.8545 49.94C78.3345 49.86 77.8745 49.7933 77.4745 49.74L77.6345 48.42C78.0212 48.46 78.4679 48.5067 78.9745 48.56C79.4945 48.6133 80.0012 48.66 80.4945 48.7C81.0012 48.74 81.4279 48.76 81.7745 48.76C82.7479 48.76 83.4745 48.54 83.9545 48.1C84.4345 47.66 84.6745 46.9733 84.6745 46.04C84.6745 45.5333 84.5745 45.1333 84.3745 44.84C84.1879 44.5333 83.8679 44.2933 83.4145 44.12C82.9745 43.9333 82.3812 43.7667 81.6345 43.62C80.6745 43.42 79.8745 43.1867 79.2345 42.92C78.6079 42.64 78.1345 42.2467 77.8145 41.74C77.5079 41.2333 77.3545 40.5467 77.3545 39.68C77.3545 38.7867 77.5345 38.0667 77.8945 37.52C78.2679 36.9733 78.7879 36.5733 79.4545 36.32C80.1345 36.0667 80.9212 35.94 81.8145 35.94C82.2145 35.94 82.6679 35.9667 83.1745 36.02C83.6945 36.06 84.2012 36.1133 84.6945 36.18C85.2012 36.2333 85.6345 36.2933 85.9945 36.36L85.8545 37.7C85.4679 37.6467 85.0212 37.6 84.5145 37.56C84.0079 37.5067 83.5212 37.46 83.0545 37.42C82.5879 37.38 82.2145 37.36 81.9345 37.36C80.9612 37.36 80.2212 37.54 79.7145 37.9C79.2212 38.26 78.9745 38.82 78.9745 39.58C78.9745 40.1667 79.0812 40.6133 79.2945 40.92C79.5212 41.2267 79.8812 41.4667 80.3745 41.64C80.8679 41.8133 81.5145 41.9933 82.3145 42.18C83.0079 42.34 83.6012 42.5133 84.0945 42.7C84.6012 42.8867 85.0145 43.12 85.3345 43.4C85.6679 43.6667 85.9079 44.0067 86.0545 44.42C86.2145 44.82 86.2945 45.32 86.2945 45.92C86.2945 46.9333 86.1145 47.7533 85.7545 48.38C85.3945 49.0067 84.8812 49.4667 84.2145 49.76C83.5479 50.04 82.7612 50.18 81.8545 50.18ZM88.6744 50V40H90.2144V40.7C90.5344 40.5133 90.9677 40.32 91.5144 40.12C92.061 39.9067 92.5877 39.8 93.0944 39.8C93.761 39.8 94.2944 39.88 94.6944 40.04C95.1077 40.2 95.441 40.46 95.6944 40.82C95.961 40.6733 96.2877 40.52 96.6744 40.36C97.061 40.2 97.4744 40.0667 97.9144 39.96C98.3677 39.8533 98.8077 39.8 99.2344 39.8C100.141 39.8 100.834 39.96 101.314 40.28C101.808 40.5867 102.148 41.1 102.334 41.82C102.521 42.54 102.614 43.5 102.614 44.7V50H101.074V44.76C101.074 43.8933 101.021 43.2 100.914 42.68C100.821 42.16 100.628 41.7867 100.334 41.56C100.041 41.32 99.5944 41.2 98.9944 41.2C98.461 41.2 97.9344 41.28 97.4144 41.44C96.9077 41.6 96.5144 41.76 96.2344 41.92C96.3277 42.2667 96.3877 42.7 96.4144 43.22C96.4544 43.7267 96.4744 44.2533 96.4744 44.8V50H94.9344V44.84C94.9344 43.9333 94.8877 43.22 94.7944 42.7C94.701 42.1667 94.501 41.7867 94.1944 41.56C93.901 41.32 93.4544 41.2 92.8544 41.2C92.3477 41.2 91.8477 41.28 91.3544 41.44C90.861 41.6 90.481 41.76 90.2144 41.92V50H88.6744ZM107.573 50.2C106.653 50.2 105.953 49.94 105.473 49.42C104.993 48.9 104.753 48.14 104.753 47.14C104.753 46.4867 104.866 45.9533 105.093 45.54C105.32 45.1267 105.66 44.8133 106.113 44.6C106.58 44.3733 107.153 44.2333 107.833 44.18L110.913 43.88V43.02C110.913 42.34 110.76 41.86 110.453 41.58C110.16 41.3 109.72 41.16 109.133 41.16C108.8 41.16 108.4 41.1733 107.933 41.2C107.48 41.2267 107.026 41.26 106.573 41.3C106.12 41.34 105.72 41.38 105.373 41.42L105.293 40.24C105.613 40.1733 106 40.1067 106.453 40.04C106.906 39.9733 107.38 39.92 107.873 39.88C108.366 39.8267 108.82 39.8 109.233 39.8C109.993 39.8 110.613 39.92 111.093 40.16C111.573 40.3867 111.92 40.74 112.133 41.22C112.36 41.6867 112.473 42.2867 112.473 43.02V48.08C112.5 48.3733 112.613 48.5867 112.813 48.72C113.026 48.8533 113.293 48.94 113.613 48.98L113.553 50.2C113.26 50.2 112.993 50.18 112.753 50.14C112.513 50.1133 112.286 50.0667 112.073 50C111.9 49.9333 111.733 49.8533 111.573 49.76C111.426 49.6667 111.28 49.5533 111.133 49.42C110.88 49.5267 110.553 49.64 110.153 49.76C109.766 49.88 109.346 49.98 108.893 50.06C108.453 50.1533 108.013 50.2 107.573 50.2ZM107.833 48.9C108.193 48.9 108.566 48.8667 108.953 48.8C109.34 48.7333 109.706 48.6533 110.053 48.56C110.4 48.4667 110.686 48.38 110.913 48.3V45.04L108.013 45.32C107.413 45.3733 106.98 45.5467 106.713 45.84C106.46 46.1333 106.333 46.5533 106.333 47.1C106.333 47.66 106.46 48.1 106.713 48.42C106.966 48.74 107.34 48.9 107.833 48.9ZM118.552 50.2C118.246 50.2 117.872 50.18 117.432 50.14C117.006 50.1 116.579 50.0533 116.152 50C115.726 49.9333 115.346 49.8733 115.012 49.82L115.092 48.48C115.426 48.52 115.799 48.5667 116.212 48.62C116.639 48.6733 117.052 48.72 117.452 48.76C117.852 48.7867 118.172 48.8 118.412 48.8C118.959 48.8 119.412 48.7533 119.772 48.66C120.132 48.5533 120.406 48.38 120.592 48.14C120.779 47.9 120.872 47.56 120.872 47.12C120.872 46.7867 120.799 46.5267 120.652 46.34C120.519 46.1533 120.259 46 119.872 45.88C119.499 45.76 118.952 45.6467 118.232 45.54C117.486 45.42 116.859 45.2733 116.352 45.1C115.859 44.9133 115.492 44.64 115.252 44.28C115.012 43.92 114.892 43.4067 114.892 42.74C114.892 41.9933 115.066 41.4067 115.412 40.98C115.759 40.5533 116.206 40.2533 116.752 40.08C117.312 39.8933 117.892 39.8 118.492 39.8C118.866 39.8 119.272 39.82 119.712 39.86C120.166 39.9 120.606 39.9533 121.032 40.02C121.459 40.0733 121.826 40.1267 122.132 40.18L122.092 41.52C121.772 41.4667 121.399 41.42 120.972 41.38C120.546 41.3267 120.119 41.2867 119.692 41.26C119.266 41.22 118.892 41.2 118.572 41.2C118.172 41.2 117.812 41.2467 117.492 41.34C117.172 41.42 116.919 41.5667 116.732 41.78C116.546 41.9933 116.452 42.2933 116.452 42.68C116.452 42.9733 116.519 43.2133 116.652 43.4C116.786 43.5733 117.039 43.72 117.412 43.84C117.786 43.96 118.326 44.08 119.032 44.2C119.859 44.3333 120.519 44.5 121.012 44.7C121.519 44.9 121.886 45.18 122.112 45.54C122.339 45.9 122.452 46.4067 122.452 47.06C122.452 48.2333 122.106 49.0533 121.412 49.52C120.719 49.9733 119.766 50.2 118.552 50.2ZM124.749 50V35.66H126.289V40.54C126.635 40.38 127.095 40.22 127.669 40.06C128.255 39.8867 128.815 39.8 129.349 39.8C130.269 39.8 130.969 39.9667 131.449 40.3C131.942 40.62 132.275 41.14 132.449 41.86C132.635 42.58 132.729 43.5267 132.729 44.7V50H131.169V44.76C131.169 43.8933 131.115 43.2 131.009 42.68C130.915 42.16 130.722 41.7867 130.429 41.56C130.135 41.32 129.682 41.2 129.069 41.2C128.562 41.2 128.049 41.2667 127.529 41.4C127.009 41.5333 126.595 41.66 126.289 41.78V50H124.749ZM140.145 50V36.18H143.045L146.865 47.78L150.705 36.18H153.605V50H152.005V37.88H151.705L147.765 49.5H145.985L142.045 37.88H141.745V50H140.145ZM158.901 50.2C157.981 50.2 157.281 49.94 156.801 49.42C156.321 48.9 156.081 48.14 156.081 47.14C156.081 46.4867 156.195 45.9533 156.421 45.54C156.648 45.1267 156.988 44.8133 157.441 44.6C157.908 44.3733 158.481 44.2333 159.161 44.18L162.241 43.88V43.02C162.241 42.34 162.088 41.86 161.781 41.58C161.488 41.3 161.048 41.16 160.461 41.16C160.128 41.16 159.728 41.1733 159.261 41.2C158.808 41.2267 158.355 41.26 157.901 41.3C157.448 41.34 157.048 41.38 156.701 41.42L156.621 40.24C156.941 40.1733 157.328 40.1067 157.781 40.04C158.235 39.9733 158.708 39.92 159.201 39.88C159.695 39.8267 160.148 39.8 160.561 39.8C161.321 39.8 161.941 39.92 162.421 40.16C162.901 40.3867 163.248 40.74 163.461 41.22C163.688 41.6867 163.801 42.2867 163.801 43.02V48.08C163.828 48.3733 163.941 48.5867 164.141 48.72C164.355 48.8533 164.621 48.94 164.941 48.98L164.881 50.2C164.588 50.2 164.321 50.18 164.081 50.14C163.841 50.1133 163.615 50.0667 163.401 50C163.228 49.9333 163.061 49.8533 162.901 49.76C162.755 49.6667 162.608 49.5533 162.461 49.42C162.208 49.5267 161.881 49.64 161.481 49.76C161.095 49.88 160.675 49.98 160.221 50.06C159.781 50.1533 159.341 50.2 158.901 50.2ZM159.161 48.9C159.521 48.9 159.895 48.8667 160.281 48.8C160.668 48.7333 161.035 48.6533 161.381 48.56C161.728 48.4667 162.015 48.38 162.241 48.3V45.04L159.341 45.32C158.741 45.3733 158.308 45.5467 158.041 45.84C157.788 46.1333 157.661 46.5533 157.661 47.1C157.661 47.66 157.788 48.1 158.041 48.42C158.295 48.74 158.668 48.9 159.161 48.9ZM166.76 50V40H168.3V40.7C168.527 40.5667 168.807 40.4333 169.14 40.3C169.487 40.1667 169.854 40.0533 170.24 39.96C170.627 39.8533 171 39.8 171.36 39.8C172.28 39.8 172.98 39.9667 173.46 40.3C173.954 40.62 174.294 41.14 174.48 41.86C174.667 42.58 174.76 43.5267 174.76 44.7V50H173.2V44.76C173.2 43.8933 173.147 43.2 173.04 42.68C172.947 42.16 172.747 41.7867 172.44 41.56C172.147 41.32 171.694 41.2 171.08 41.2C170.747 41.2 170.4 41.24 170.04 41.32C169.694 41.3867 169.367 41.48 169.06 41.6C168.754 41.7067 168.5 41.8133 168.3 41.92V50H166.76Z" fill="#3AAA35"/>
<path d="M78.456 22V4.32H90.52V7.674H82.564V11.392H88.96V14.72H82.564V18.62H90.52V22H78.456ZM96.2083 22.312C94.787 22.312 93.721 21.9653 93.0103 21.272C92.317 20.5787 91.9703 19.5213 91.9703 18.1C91.9703 17.0947 92.1523 16.3233 92.5163 15.786C92.8976 15.2313 93.4436 14.8327 94.1543 14.59C94.865 14.3473 95.723 14.2 96.7283 14.148L99.6403 13.914V13.238C99.6403 12.718 99.493 12.354 99.1983 12.146C98.921 11.9207 98.505 11.808 97.9503 11.808C97.4476 11.808 96.8756 11.8253 96.2343 11.86C95.593 11.8947 94.9603 11.938 94.3363 11.99C93.7123 12.042 93.175 12.094 92.7243 12.146L92.5943 9.39C93.0623 9.26867 93.617 9.156 94.2583 9.052C94.917 8.93067 95.6016 8.83533 96.3123 8.766C97.023 8.67933 97.6903 8.636 98.3143 8.636C99.441 8.636 100.394 8.77467 101.174 9.052C101.972 9.312 102.578 9.76267 102.994 10.404C103.41 11.028 103.618 11.9033 103.618 13.03V18.75C103.67 18.958 103.792 19.1227 103.982 19.244C104.19 19.348 104.416 19.426 104.658 19.478L104.58 22.13C104.182 22.1647 103.757 22.1907 103.306 22.208C102.873 22.2253 102.526 22.2167 102.266 22.182C101.816 22.13 101.426 22.026 101.096 21.87C100.784 21.6967 100.55 21.5233 100.394 21.35C100.117 21.4713 99.753 21.61 99.3023 21.766C98.8516 21.922 98.3576 22.052 97.8203 22.156C97.3003 22.26 96.763 22.312 96.2083 22.312ZM97.1963 19.426C97.491 19.426 97.7856 19.3913 98.0803 19.322C98.3923 19.2527 98.687 19.1747 98.9643 19.088C99.2416 19.0013 99.467 18.9233 99.6403 18.854V16.28L97.3523 16.488C96.867 16.54 96.5116 16.696 96.2863 16.956C96.061 17.1987 95.9483 17.5453 95.9483 17.996C95.9483 18.4293 96.0523 18.776 96.2603 19.036C96.4683 19.296 96.7803 19.426 97.1963 19.426ZM112.361 27.902C110.975 27.902 109.796 27.798 108.825 27.59C107.855 27.3993 107.118 27.0353 106.615 26.498C106.13 25.9607 105.887 25.1807 105.887 24.158C105.887 23.7073 105.948 23.3087 106.069 22.962C106.191 22.6153 106.39 22.286 106.667 21.974C106.945 21.6447 107.3 21.3153 107.733 20.986C107.491 20.7953 107.291 20.5353 107.135 20.206C106.979 19.8593 106.901 19.4867 106.901 19.088C106.901 18.88 107.031 18.5767 107.291 18.178C107.569 17.7793 107.846 17.4327 108.123 17.138C107.777 16.9647 107.447 16.7307 107.135 16.436C106.823 16.124 106.563 15.708 106.355 15.188C106.147 14.668 106.043 14.0093 106.043 13.212C106.043 11.5307 106.52 10.352 107.473 9.676C108.427 8.98267 109.839 8.636 111.711 8.636C112.145 8.636 112.621 8.67067 113.141 8.74C113.679 8.792 114.103 8.86133 114.415 8.948L118.757 8.844V11.444L116.937 11.418C117.093 11.6087 117.223 11.8513 117.327 12.146C117.431 12.4407 117.483 12.796 117.483 13.212C117.483 14.4253 117.275 15.3613 116.859 16.02C116.443 16.6787 115.819 17.138 114.987 17.398C114.155 17.6407 113.089 17.762 111.789 17.762C111.651 17.762 111.469 17.7533 111.243 17.736C111.018 17.7013 110.827 17.6753 110.671 17.658C110.619 17.7967 110.559 17.9613 110.489 18.152C110.42 18.3253 110.385 18.4553 110.385 18.542C110.385 18.7327 110.463 18.88 110.619 18.984C110.775 19.088 111.087 19.1573 111.555 19.192C112.023 19.2267 112.725 19.244 113.661 19.244C114.892 19.244 115.871 19.3653 116.599 19.608C117.327 19.8333 117.847 20.2407 118.159 20.83C118.471 21.402 118.627 22.208 118.627 23.248C118.627 24.808 118.073 25.9693 116.963 26.732C115.854 27.512 114.32 27.902 112.361 27.902ZM112.127 25.016C113.133 25.016 113.852 24.912 114.285 24.704C114.719 24.496 114.935 24.1493 114.935 23.664C114.935 23.3 114.857 23.0227 114.701 22.832C114.545 22.6587 114.285 22.546 113.921 22.494C113.575 22.442 113.098 22.416 112.491 22.416C112.318 22.416 112.11 22.4073 111.867 22.39C111.625 22.39 111.391 22.3813 111.165 22.364C110.94 22.364 110.732 22.3553 110.541 22.338C110.351 22.338 110.212 22.3293 110.125 22.312C109.796 22.5373 109.571 22.7453 109.449 22.936C109.345 23.1267 109.293 23.378 109.293 23.69C109.293 24.0193 109.38 24.2793 109.553 24.47C109.744 24.6607 110.047 24.7993 110.463 24.886C110.879 24.9727 111.434 25.016 112.127 25.016ZM111.737 15.032C112.431 15.032 112.925 14.8933 113.219 14.616C113.531 14.3213 113.687 13.8447 113.687 13.186C113.687 12.5273 113.531 12.0593 113.219 11.782C112.925 11.4873 112.431 11.34 111.737 11.34C111.061 11.34 110.576 11.4873 110.281 11.782C109.987 12.0593 109.839 12.5273 109.839 13.186C109.839 13.8447 109.987 14.3213 110.281 14.616C110.576 14.8933 111.061 15.032 111.737 15.032ZM120.475 22V3.722H124.453V22H120.475ZM132.587 22.312C131.113 22.312 129.935 22.0693 129.051 21.584C128.184 21.0987 127.56 20.362 127.179 19.374C126.815 18.386 126.633 17.138 126.633 15.63C126.633 14.0527 126.858 12.7527 127.309 11.73C127.777 10.69 128.461 9.91867 129.363 9.416C130.264 8.896 131.399 8.636 132.769 8.636C134.779 8.636 136.287 9.12133 137.293 10.092C138.315 11.0627 138.827 12.5967 138.827 14.694L138.619 16.748H130.611C130.628 17.58 130.801 18.204 131.131 18.62C131.477 19.0187 132.067 19.218 132.899 19.218C133.436 19.218 134.034 19.2093 134.693 19.192C135.369 19.1573 136.036 19.1227 136.695 19.088C137.353 19.0533 137.917 19.0187 138.385 18.984L138.463 21.688C138.012 21.7747 137.449 21.87 136.773 21.974C136.097 22.0607 135.395 22.1387 134.667 22.208C133.939 22.2773 133.245 22.312 132.587 22.312ZM130.585 14.33H134.849C134.849 13.29 134.684 12.5707 134.355 12.172C134.025 11.756 133.497 11.548 132.769 11.548C132.041 11.548 131.495 11.7647 131.131 12.198C130.784 12.614 130.602 13.3247 130.585 14.33ZM145.777 22.312C145.135 22.312 144.477 22.2773 143.801 22.208C143.125 22.1387 142.501 22.0607 141.929 21.974C141.357 21.87 140.88 21.7747 140.499 21.688L140.629 18.828C141.079 18.88 141.591 18.9407 142.163 19.01C142.735 19.0793 143.298 19.14 143.853 19.192C144.407 19.244 144.858 19.27 145.205 19.27C145.673 19.27 146.054 19.2353 146.349 19.166C146.643 19.0967 146.86 18.9753 146.999 18.802C147.155 18.6287 147.233 18.386 147.233 18.074C147.233 17.8487 147.155 17.6667 146.999 17.528C146.86 17.3893 146.6 17.2767 146.219 17.19C145.855 17.086 145.309 16.982 144.581 16.878C143.61 16.7393 142.813 16.54 142.189 16.28C141.565 16.0027 141.105 15.604 140.811 15.084C140.533 14.5467 140.395 13.836 140.395 12.952C140.395 11.8253 140.629 10.95 141.097 10.326C141.582 9.702 142.223 9.26867 143.021 9.026C143.818 8.766 144.693 8.636 145.647 8.636C146.305 8.636 146.964 8.67067 147.623 8.74C148.299 8.792 148.923 8.86133 149.495 8.948C150.067 9.03467 150.543 9.12133 150.925 9.208L150.795 12.172C150.361 12.1027 149.85 12.042 149.261 11.99C148.689 11.9207 148.117 11.8687 147.545 11.834C146.99 11.7993 146.522 11.782 146.141 11.782C145.777 11.782 145.456 11.8167 145.179 11.886C144.919 11.938 144.719 12.042 144.581 12.198C144.442 12.3367 144.373 12.5447 144.373 12.822C144.373 13.03 144.433 13.2033 144.555 13.342C144.676 13.4633 144.919 13.576 145.283 13.68C145.647 13.7667 146.175 13.8533 146.869 13.94C147.926 14.0787 148.775 14.2953 149.417 14.59C150.058 14.8847 150.517 15.3007 150.795 15.838C151.072 16.358 151.211 17.0687 151.211 17.97C151.211 19.5647 150.743 20.6913 149.807 21.35C148.871 21.9913 147.527 22.312 145.777 22.312Z" fill="white"/>
<path fill-rule="evenodd" clip-rule="evenodd" d="M36.7612 38.1129V52.9999H32.4978V38.1129H36.7612ZM28.6115 34.1445V52.9999H10.1398V34.1445H28.6115ZM24.7325 38.1041H14.0189V49.0401H24.7325V38.1041ZM36.7612 25.8238V34.1445H32.4978V25.8238H36.7612ZM47.9016 25.8238V30.1761H40.6512V25.8238H47.9016ZM59.1229 25.8238V30.1761H51.7892V25.8238H59.1229ZM28.6117 25.8238V30.1761H10.1398V25.8238H28.6117ZM59.1229 3V21.8554H40.6512V3H59.1229ZM28.6117 3V21.8554H10.1398V3H28.6117ZM36.7612 13.6421V21.8554H32.4978V13.6421H36.7612ZM55.2437 6.95979H44.5302V17.8958H55.2437V6.95979ZM24.7325 6.95979H14.0189V17.8958H24.7325V6.95979ZM36.7612 3V9.67367H32.4978V3H36.7612Z" fill="url(#paint0_linear_6_2)"/>
<path fill-rule="evenodd" clip-rule="evenodd" d="M69.1508 26.4853C66.4522 29.2975 61.1298 34.2674 53.9801 38.1595C53.7132 38.3048 53.7194 38.6976 53.9898 38.8358C57.6287 40.6933 59.7959 43.7017 59.8911 47.9756C59.9578 50.9658 58.1614 52.9415 55.493 52.9987C53.078 53.0504 51.7092 51.3931 51.6726 48.2551C51.6443 45.8165 50.7971 43.7065 49.4338 41.7568C49.0816 41.253 48.7306 40.9626 48.2877 40.8796C48.2241 40.8678 48.1585 40.8771 48.0981 40.9007C35.1886 45.9123 18.0958 45.9922 0.116305 27.742C-0.197368 27.4236 0.181257 26.9074 0.567276 27.1277C8.99368 31.9361 37.6422 45.2935 68.6819 25.8848C69.0621 25.6471 69.4629 26.1601 69.1508 26.4853ZM50.1253 38.941L50.0845 38.9409C50.0097 38.9418 49.9338 38.9461 49.8576 38.9515C49.8389 38.9527 49.8202 38.9533 49.8014 38.9549C49.7294 38.961 49.6562 38.9703 49.583 38.9804C49.5599 38.9836 49.5372 38.9856 49.514 38.9892C49.4414 39.0003 49.3677 39.0147 49.2938 39.0298C49.27 39.0347 49.2466 39.0381 49.2227 39.0435C49.1251 39.0647 49.0269 39.0891 48.9273 39.1173C49.0324 39.1491 49.1346 39.1829 49.2346 39.2183L49.2806 39.2355C49.3666 39.2666 49.4513 39.2988 49.5339 39.3324C49.5416 39.3356 49.549 39.339 49.5567 39.3421C49.647 39.3793 49.7352 39.4181 49.8215 39.4582C49.822 39.4585 49.8227 39.4587 49.8232 39.4591C51.4823 40.2322 52.4128 41.5362 53.2621 42.8679L53.578 43.3676C53.8927 43.8667 54.2073 44.3608 54.556 44.8234C54.2148 41.7297 52.9934 39.6353 51.1522 39.085C51.0698 39.0604 50.9864 39.039 50.9016 39.0205C50.9001 39.0203 50.8987 39.0199 50.8973 39.0196C50.815 39.0018 50.7315 38.9872 50.6469 38.9752C50.6425 38.9747 50.6379 38.9739 50.6333 38.9732C50.5527 38.9622 50.471 38.9543 50.3885 38.949C50.3795 38.9482 50.3707 38.9475 50.3619 38.947C50.2841 38.9423 50.205 38.9407 50.1253 38.941ZM52.898 9.35438V15.5012H46.8762V9.35438H52.898ZM22.3867 9.35438V15.5012H16.3649V9.35438H22.3867Z" fill="#3AAA35"/>
<defs>
<linearGradient id="paint0_linear_6_2" x1="35" y1="2.99992" x2="34.6314" y2="52.0209" gradientUnits="userSpaceOnUse">
<stop stop-color="white"/>
<stop offset="0.576042" stop-color="#F1F1F1"/>
<stop offset="1" stop-color="#3AAA35"/>
</linearGradient>
</defs>
</svg>
