<?xml version="1.0" encoding="UTF-8"?>
<!-- 
    DTR1 SLIST - Sequence
    Status: draft
-->
<rule xmlns="http://purl.oclc.org/dsdl/schematron"
      abstract="true"
      id="SLIST"
      see="https://docs.art-decor.org/documentation/datatypes/DTr1_SLIST">
    <extends rule="ANY"/>
</rule>
