<?xml version="1.0" encoding="UTF-8"?>
<!--
Template derived pattern
===========================================
ID: 1.2.40.0.34.6.0.11.3.9
Name: Impfrelevante Erkrankungen Problem Entry
Description: 
-->
<pattern xmlns="http://purl.oclc.org/dsdl/schematron"
         id="template-1.2.40.0.34.6.0.11.3.9-2019-05-20T081225">
   <title>Impfrelevante Erkrankungen Problem Entry</title>
   <!--
Template derived rules for ID: 1.2.40.0.34.6.0.11.3.9
Context: *[hl7:observation[hl7:templateId[@root = '1.2.40.0.34.6.0.11.3.9'] and hl7:templateId[@root = '2.16.840.1.113883.10.20.1.28'] and hl7:templateId[@root = '1.3.6.1.4.1.19376.1.5.3.1.4.5']]]
Item: (eimpf_entry_ImpfrelevanteErkrankungProblemEntry)
-->

   <!--
Template derived rules for ID: 1.2.40.0.34.6.0.11.3.9
Context: *[hl7:observation[hl7:templateId[@root = '1.2.40.0.34.6.0.11.3.9'] and hl7:templateId[@root = '2.16.840.1.113883.10.20.1.28'] and hl7:templateId[@root = '1.3.6.1.4.1.19376.1.5.3.1.4.5']]]/hl7:observation[hl7:templateId[@root = '1.2.40.0.34.6.0.11.3.9'] and hl7:templateId[@root = '2.16.840.1.113883.10.20.1.28'] and hl7:templateId[@root = '1.3.6.1.4.1.19376.1.5.3.1.4.5']]
Item: (eimpf_entry_ImpfrelevanteErkrankungProblemEntry)
-->

   <rule fpi="RULC-1"
         context="*[hl7:observation[hl7:templateId[@root = '1.2.40.0.34.6.0.11.3.9'] and hl7:templateId[@root = '2.16.840.1.113883.10.20.1.28'] and hl7:templateId[@root = '1.3.6.1.4.1.19376.1.5.3.1.4.5']]]/hl7:observation[hl7:templateId[@root = '1.2.40.0.34.6.0.11.3.9'] and hl7:templateId[@root = '2.16.840.1.113883.10.20.1.28'] and hl7:templateId[@root = '1.3.6.1.4.1.19376.1.5.3.1.4.5']]"
         id="d42e49401-false-d1499495e0">
      <assert role="error"
              see="http://elga.art-decor.org/elgaimpf-html-20250116T125121/tmp-1.2.40.0.34.6.0.11.3.9-2019-05-20T081225.html"
              test="string(@classCode) = ('OBS')">(eimpf_entry_ImpfrelevanteErkrankungProblemEntry): Der Wert von classCode MUSS 'OBS' sein. Gefunden: "<value-of select="@classCode"/>"</assert>
      <assert role="error"
              see="http://elga.art-decor.org/elgaimpf-html-20250116T125121/tmp-1.2.40.0.34.6.0.11.3.9-2019-05-20T081225.html"
              test="string(@moodCode) = ('EVN')">(eimpf_entry_ImpfrelevanteErkrankungProblemEntry): Der Wert von moodCode MUSS 'EVN' sein. Gefunden: "<value-of select="@moodCode"/>"</assert>
      <assert role="error"
              see="http://elga.art-decor.org/elgaimpf-html-20250116T125121/tmp-1.2.40.0.34.6.0.11.3.9-2019-05-20T081225.html"
              test="@negationInd">(eimpf_entry_ImpfrelevanteErkrankungProblemEntry): Attribut @negationInd MUSS vorkommen.</assert>
      <assert role="error"
              see="http://elga.art-decor.org/elgaimpf-html-20250116T125121/tmp-1.2.40.0.34.6.0.11.3.9-2019-05-20T081225.html"
              test="not(@negationInd) or string(@negationInd)=('true','false')">(eimpf_entry_ImpfrelevanteErkrankungProblemEntry): Attribute @negationInd MUSS vom Datentyp 'bl' sein  - '<value-of select="@negationInd"/>'</assert>
      <assert role="error"
              see="http://elga.art-decor.org/elgaimpf-html-20250116T125121/tmp-1.2.40.0.34.6.0.11.3.9-2019-05-20T081225.html"
              test="count(hl7:templateId[@root = '1.2.40.0.34.6.0.11.3.9']) &gt;= 1">(eimpf_entry_ImpfrelevanteErkrankungProblemEntry): Element hl7:templateId[@root = '1.2.40.0.34.6.0.11.3.9'] ist mandatory [min 1x].</assert>
      <assert role="error"
              see="http://elga.art-decor.org/elgaimpf-html-20250116T125121/tmp-1.2.40.0.34.6.0.11.3.9-2019-05-20T081225.html"
              test="count(hl7:templateId[@root = '1.2.40.0.34.6.0.11.3.9']) &lt;= 1">(eimpf_entry_ImpfrelevanteErkrankungProblemEntry): Element hl7:templateId[@root = '1.2.40.0.34.6.0.11.3.9'] kommt zu häufig vor [max 1x].</assert>
      <assert role="error"
              see="http://elga.art-decor.org/elgaimpf-html-20250116T125121/tmp-1.2.40.0.34.6.0.11.3.9-2019-05-20T081225.html"
              test="count(hl7:templateId[@root = '2.16.840.1.113883.10.20.1.28']) &gt;= 1">(eimpf_entry_ImpfrelevanteErkrankungProblemEntry): Element hl7:templateId[@root = '2.16.840.1.113883.10.20.1.28'] ist mandatory [min 1x].</assert>
      <assert role="error"
              see="http://elga.art-decor.org/elgaimpf-html-20250116T125121/tmp-1.2.40.0.34.6.0.11.3.9-2019-05-20T081225.html"
              test="count(hl7:templateId[@root = '2.16.840.1.113883.10.20.1.28']) &lt;= 1">(eimpf_entry_ImpfrelevanteErkrankungProblemEntry): Element hl7:templateId[@root = '2.16.840.1.113883.10.20.1.28'] kommt zu häufig vor [max 1x].</assert>
      <assert role="error"
              see="http://elga.art-decor.org/elgaimpf-html-20250116T125121/tmp-1.2.40.0.34.6.0.11.3.9-2019-05-20T081225.html"
              test="count(hl7:templateId[@root = '1.3.6.1.4.1.19376.1.5.3.1.4.5']) &gt;= 1">(eimpf_entry_ImpfrelevanteErkrankungProblemEntry): Element hl7:templateId[@root = '1.3.6.1.4.1.19376.1.5.3.1.4.5'] ist mandatory [min 1x].</assert>
      <assert role="error"
              see="http://elga.art-decor.org/elgaimpf-html-20250116T125121/tmp-1.2.40.0.34.6.0.11.3.9-2019-05-20T081225.html"
              test="count(hl7:templateId[@root = '1.3.6.1.4.1.19376.1.5.3.1.4.5']) &lt;= 1">(eimpf_entry_ImpfrelevanteErkrankungProblemEntry): Element hl7:templateId[@root = '1.3.6.1.4.1.19376.1.5.3.1.4.5'] kommt zu häufig vor [max 1x].</assert>
      <assert role="error"
              see="http://elga.art-decor.org/elgaimpf-html-20250116T125121/tmp-1.2.40.0.34.6.0.11.3.9-2019-05-20T081225.html"
              test="count(hl7:id[not(@nullFlavor)]) &gt;= 1">(eimpf_entry_ImpfrelevanteErkrankungProblemEntry): Element hl7:id[not(@nullFlavor)] ist mandatory [min 1x].</assert>
      <assert role="error"
              see="http://elga.art-decor.org/elgaimpf-html-20250116T125121/tmp-1.2.40.0.34.6.0.11.3.9-2019-05-20T081225.html"
              test="count(hl7:id[not(@nullFlavor)]) &lt;= 1">(eimpf_entry_ImpfrelevanteErkrankungProblemEntry): Element hl7:id[not(@nullFlavor)] kommt zu häufig vor [max 1x].</assert>
      <assert role="error"
              see="http://elga.art-decor.org/elgaimpf-html-20250116T125121/tmp-1.2.40.0.34.6.0.11.3.9-2019-05-20T081225.html"
              test="count(hl7:code[(@code = '55607006' and @codeSystem = '2.16.840.1.113883.6.96')]) &gt;= 1">(eimpf_entry_ImpfrelevanteErkrankungProblemEntry): Element hl7:code[(@code = '55607006' and @codeSystem = '2.16.840.1.113883.6.96')] ist mandatory [min 1x].</assert>
      <assert role="error"
              see="http://elga.art-decor.org/elgaimpf-html-20250116T125121/tmp-1.2.40.0.34.6.0.11.3.9-2019-05-20T081225.html"
              test="count(hl7:code[(@code = '55607006' and @codeSystem = '2.16.840.1.113883.6.96')]) &lt;= 1">(eimpf_entry_ImpfrelevanteErkrankungProblemEntry): Element hl7:code[(@code = '55607006' and @codeSystem = '2.16.840.1.113883.6.96')] kommt zu häufig vor [max 1x].</assert>
      <assert role="error"
              see="http://elga.art-decor.org/elgaimpf-html-20250116T125121/tmp-1.2.40.0.34.6.0.11.3.9-2019-05-20T081225.html"
              test="count(hl7:text[not(@nullFlavor)]) &gt;= 1">(eimpf_entry_ImpfrelevanteErkrankungProblemEntry): Element hl7:text[not(@nullFlavor)] ist mandatory [min 1x].</assert>
      <assert role="error"
              see="http://elga.art-decor.org/elgaimpf-html-20250116T125121/tmp-1.2.40.0.34.6.0.11.3.9-2019-05-20T081225.html"
              test="count(hl7:text[not(@nullFlavor)]) &lt;= 1">(eimpf_entry_ImpfrelevanteErkrankungProblemEntry): Element hl7:text[not(@nullFlavor)] kommt zu häufig vor [max 1x].</assert>
      <assert role="error"
              see="http://elga.art-decor.org/elgaimpf-html-20250116T125121/tmp-1.2.40.0.34.6.0.11.3.9-2019-05-20T081225.html"
              test="count(hl7:statusCode[@code = 'completed']) &gt;= 1">(eimpf_entry_ImpfrelevanteErkrankungProblemEntry): Element hl7:statusCode[@code = 'completed'] ist mandatory [min 1x].</assert>
      <assert role="error"
              see="http://elga.art-decor.org/elgaimpf-html-20250116T125121/tmp-1.2.40.0.34.6.0.11.3.9-2019-05-20T081225.html"
              test="count(hl7:statusCode[@code = 'completed']) &lt;= 1">(eimpf_entry_ImpfrelevanteErkrankungProblemEntry): Element hl7:statusCode[@code = 'completed'] kommt zu häufig vor [max 1x].</assert>
      <assert role="error"
              see="http://elga.art-decor.org/elgaimpf-html-20250116T125121/tmp-1.2.40.0.34.6.0.11.3.9-2019-05-20T081225.html"
              test="count(hl7:effectiveTime[not(@nullFlavor)]) &gt;= 1">(eimpf_entry_ImpfrelevanteErkrankungProblemEntry): Element hl7:effectiveTime[not(@nullFlavor)] ist mandatory [min 1x].</assert>
      <assert role="error"
              see="http://elga.art-decor.org/elgaimpf-html-20250116T125121/tmp-1.2.40.0.34.6.0.11.3.9-2019-05-20T081225.html"
              test="count(hl7:effectiveTime[not(@nullFlavor)]) &lt;= 1">(eimpf_entry_ImpfrelevanteErkrankungProblemEntry): Element hl7:effectiveTime[not(@nullFlavor)] kommt zu häufig vor [max 1x].</assert>
      <assert role="error"
              see="http://elga.art-decor.org/elgaimpf-html-20250116T125121/tmp-1.2.40.0.34.6.0.11.3.9-2019-05-20T081225.html"
              test="count(hl7:value[concat(@code, @codeSystem) = doc('include/voc-1.2.40.0.34.6.0.10.2-DYNAMIC.xml')//valueSet[1]/conceptList/concept/concat(@code, @codeSystem)]) &gt;= 1">(eimpf_entry_ImpfrelevanteErkrankungProblemEntry): Element hl7:value[concat(@code, @codeSystem) = doc('include/voc-1.2.40.0.34.6.0.10.2-DYNAMIC.xml')//valueSet[1]/conceptList/concept/concat(@code, @codeSystem)] ist mandatory [min 1x].</assert>
      <assert role="error"
              see="http://elga.art-decor.org/elgaimpf-html-20250116T125121/tmp-1.2.40.0.34.6.0.11.3.9-2019-05-20T081225.html"
              test="count(hl7:value[concat(@code, @codeSystem) = doc('include/voc-1.2.40.0.34.6.0.10.2-DYNAMIC.xml')//valueSet[1]/conceptList/concept/concat(@code, @codeSystem)]) &lt;= 1">(eimpf_entry_ImpfrelevanteErkrankungProblemEntry): Element hl7:value[concat(@code, @codeSystem) = doc('include/voc-1.2.40.0.34.6.0.10.2-DYNAMIC.xml')//valueSet[1]/conceptList/concept/concat(@code, @codeSystem)] kommt zu häufig vor [max 1x].</assert>
   </rule>
   <!--
Template derived rules for ID: 1.2.40.0.34.6.0.11.3.9
Context: *[hl7:observation[hl7:templateId[@root = '1.2.40.0.34.6.0.11.3.9'] and hl7:templateId[@root = '2.16.840.1.113883.10.20.1.28'] and hl7:templateId[@root = '1.3.6.1.4.1.19376.1.5.3.1.4.5']]]/hl7:observation[hl7:templateId[@root = '1.2.40.0.34.6.0.11.3.9'] and hl7:templateId[@root = '2.16.840.1.113883.10.20.1.28'] and hl7:templateId[@root = '1.3.6.1.4.1.19376.1.5.3.1.4.5']]/hl7:templateId[@root = '1.2.40.0.34.6.0.11.3.9']
Item: (eimpf_entry_ImpfrelevanteErkrankungProblemEntry)
-->

   <rule fpi="RULC-1"
         context="*[hl7:observation[hl7:templateId[@root = '1.2.40.0.34.6.0.11.3.9'] and hl7:templateId[@root = '2.16.840.1.113883.10.20.1.28'] and hl7:templateId[@root = '1.3.6.1.4.1.19376.1.5.3.1.4.5']]]/hl7:observation[hl7:templateId[@root = '1.2.40.0.34.6.0.11.3.9'] and hl7:templateId[@root = '2.16.840.1.113883.10.20.1.28'] and hl7:templateId[@root = '1.3.6.1.4.1.19376.1.5.3.1.4.5']]/hl7:templateId[@root = '1.2.40.0.34.6.0.11.3.9']"
         id="d42e49419-false-d1499708e0">
      <extends rule="II"/>
      <assert role="error"
              see="http://elga.art-decor.org/elgaimpf-html-20250116T125121/tmp-1.2.40.0.34.6.0.11.3.9-2019-05-20T081225.html"
              test="empty(@xsi:type) or resolve-QName(@xsi:type, .) = QName('urn:hl7-org:v3', 'II')">(eimpf_entry_ImpfrelevanteErkrankungProblemEntry): Wenn eine @xsi:type Instruktion anwesend ist MUSS diese den Wert "{urn:hl7-org:v3}:II" haben. Gefunden "{<value-of select="namespace-uri-from-QName(resolve-QName(@xsi:type,.))"/>}:<value-of select="local-name-from-QName(resolve-QName(@xsi:type,.))"/>"</assert>
      <assert role="error"
              see="http://elga.art-decor.org/elgaimpf-html-20250116T125121/tmp-1.2.40.0.34.6.0.11.3.9-2019-05-20T081225.html"
              test="string(@root) = ('1.2.40.0.34.6.0.11.3.9')">(eimpf_entry_ImpfrelevanteErkrankungProblemEntry): Der Wert von root MUSS '1.2.40.0.34.6.0.11.3.9' sein. Gefunden: "<value-of select="@root"/>"</assert>
   </rule>
   <!--
Template derived rules for ID: 1.2.40.0.34.6.0.11.3.9
Context: *[hl7:observation[hl7:templateId[@root = '1.2.40.0.34.6.0.11.3.9'] and hl7:templateId[@root = '2.16.840.1.113883.10.20.1.28'] and hl7:templateId[@root = '1.3.6.1.4.1.19376.1.5.3.1.4.5']]]/hl7:observation[hl7:templateId[@root = '1.2.40.0.34.6.0.11.3.9'] and hl7:templateId[@root = '2.16.840.1.113883.10.20.1.28'] and hl7:templateId[@root = '1.3.6.1.4.1.19376.1.5.3.1.4.5']]/hl7:templateId[@root = '2.16.840.1.113883.10.20.1.28']
Item: (eimpf_entry_ImpfrelevanteErkrankungProblemEntry)
-->

   <rule fpi="RULC-1"
         context="*[hl7:observation[hl7:templateId[@root = '1.2.40.0.34.6.0.11.3.9'] and hl7:templateId[@root = '2.16.840.1.113883.10.20.1.28'] and hl7:templateId[@root = '1.3.6.1.4.1.19376.1.5.3.1.4.5']]]/hl7:observation[hl7:templateId[@root = '1.2.40.0.34.6.0.11.3.9'] and hl7:templateId[@root = '2.16.840.1.113883.10.20.1.28'] and hl7:templateId[@root = '1.3.6.1.4.1.19376.1.5.3.1.4.5']]/hl7:templateId[@root = '2.16.840.1.113883.10.20.1.28']"
         id="d42e49428-false-d1499723e0">
      <extends rule="II"/>
      <assert role="error"
              see="http://elga.art-decor.org/elgaimpf-html-20250116T125121/tmp-1.2.40.0.34.6.0.11.3.9-2019-05-20T081225.html"
              test="empty(@xsi:type) or resolve-QName(@xsi:type, .) = QName('urn:hl7-org:v3', 'II')">(eimpf_entry_ImpfrelevanteErkrankungProblemEntry): Wenn eine @xsi:type Instruktion anwesend ist MUSS diese den Wert "{urn:hl7-org:v3}:II" haben. Gefunden "{<value-of select="namespace-uri-from-QName(resolve-QName(@xsi:type,.))"/>}:<value-of select="local-name-from-QName(resolve-QName(@xsi:type,.))"/>"</assert>
      <assert role="error"
              see="http://elga.art-decor.org/elgaimpf-html-20250116T125121/tmp-1.2.40.0.34.6.0.11.3.9-2019-05-20T081225.html"
              test="string(@root) = ('2.16.840.1.113883.10.20.1.28')">(eimpf_entry_ImpfrelevanteErkrankungProblemEntry): Der Wert von root MUSS '2.16.840.1.113883.10.20.1.28' sein. Gefunden: "<value-of select="@root"/>"</assert>
   </rule>
   <!--
Template derived rules for ID: 1.2.40.0.34.6.0.11.3.9
Context: *[hl7:observation[hl7:templateId[@root = '1.2.40.0.34.6.0.11.3.9'] and hl7:templateId[@root = '2.16.840.1.113883.10.20.1.28'] and hl7:templateId[@root = '1.3.6.1.4.1.19376.1.5.3.1.4.5']]]/hl7:observation[hl7:templateId[@root = '1.2.40.0.34.6.0.11.3.9'] and hl7:templateId[@root = '2.16.840.1.113883.10.20.1.28'] and hl7:templateId[@root = '1.3.6.1.4.1.19376.1.5.3.1.4.5']]/hl7:templateId[@root = '1.3.6.1.4.1.19376.1.5.3.1.4.5']
Item: (eimpf_entry_ImpfrelevanteErkrankungProblemEntry)
-->

   <rule fpi="RULC-1"
         context="*[hl7:observation[hl7:templateId[@root = '1.2.40.0.34.6.0.11.3.9'] and hl7:templateId[@root = '2.16.840.1.113883.10.20.1.28'] and hl7:templateId[@root = '1.3.6.1.4.1.19376.1.5.3.1.4.5']]]/hl7:observation[hl7:templateId[@root = '1.2.40.0.34.6.0.11.3.9'] and hl7:templateId[@root = '2.16.840.1.113883.10.20.1.28'] and hl7:templateId[@root = '1.3.6.1.4.1.19376.1.5.3.1.4.5']]/hl7:templateId[@root = '1.3.6.1.4.1.19376.1.5.3.1.4.5']"
         id="d42e49436-false-d1499738e0">
      <extends rule="II"/>
      <assert role="error"
              see="http://elga.art-decor.org/elgaimpf-html-20250116T125121/tmp-1.2.40.0.34.6.0.11.3.9-2019-05-20T081225.html"
              test="empty(@xsi:type) or resolve-QName(@xsi:type, .) = QName('urn:hl7-org:v3', 'II')">(eimpf_entry_ImpfrelevanteErkrankungProblemEntry): Wenn eine @xsi:type Instruktion anwesend ist MUSS diese den Wert "{urn:hl7-org:v3}:II" haben. Gefunden "{<value-of select="namespace-uri-from-QName(resolve-QName(@xsi:type,.))"/>}:<value-of select="local-name-from-QName(resolve-QName(@xsi:type,.))"/>"</assert>
      <assert role="error"
              see="http://elga.art-decor.org/elgaimpf-html-20250116T125121/tmp-1.2.40.0.34.6.0.11.3.9-2019-05-20T081225.html"
              test="string(@root) = ('1.3.6.1.4.1.19376.1.5.3.1.4.5')">(eimpf_entry_ImpfrelevanteErkrankungProblemEntry): Der Wert von root MUSS '1.3.6.1.4.1.19376.1.5.3.1.4.5' sein. Gefunden: "<value-of select="@root"/>"</assert>
   </rule>
   <!--
Template derived rules for ID: 1.2.40.0.34.6.0.11.3.9
Context: *[hl7:observation[hl7:templateId[@root = '1.2.40.0.34.6.0.11.3.9'] and hl7:templateId[@root = '2.16.840.1.113883.10.20.1.28'] and hl7:templateId[@root = '1.3.6.1.4.1.19376.1.5.3.1.4.5']]]/hl7:observation[hl7:templateId[@root = '1.2.40.0.34.6.0.11.3.9'] and hl7:templateId[@root = '2.16.840.1.113883.10.20.1.28'] and hl7:templateId[@root = '1.3.6.1.4.1.19376.1.5.3.1.4.5']]/hl7:id[not(@nullFlavor)]
Item: (eimpf_entry_ImpfrelevanteErkrankungProblemEntry)
-->

   <rule fpi="RULC-1"
         context="*[hl7:observation[hl7:templateId[@root = '1.2.40.0.34.6.0.11.3.9'] and hl7:templateId[@root = '2.16.840.1.113883.10.20.1.28'] and hl7:templateId[@root = '1.3.6.1.4.1.19376.1.5.3.1.4.5']]]/hl7:observation[hl7:templateId[@root = '1.2.40.0.34.6.0.11.3.9'] and hl7:templateId[@root = '2.16.840.1.113883.10.20.1.28'] and hl7:templateId[@root = '1.3.6.1.4.1.19376.1.5.3.1.4.5']]/hl7:id[not(@nullFlavor)]"
         id="d42e49444-false-d1499752e0">
      <extends rule="II"/>
      <assert role="error"
              see="http://elga.art-decor.org/elgaimpf-html-20250116T125121/tmp-1.2.40.0.34.6.0.11.3.9-2019-05-20T081225.html"
              test="empty(@xsi:type) or resolve-QName(@xsi:type, .) = QName('urn:hl7-org:v3', 'II')">(eimpf_entry_ImpfrelevanteErkrankungProblemEntry): Wenn eine @xsi:type Instruktion anwesend ist MUSS diese den Wert "{urn:hl7-org:v3}:II" haben. Gefunden "{<value-of select="namespace-uri-from-QName(resolve-QName(@xsi:type,.))"/>}:<value-of select="local-name-from-QName(resolve-QName(@xsi:type,.))"/>"</assert>
   </rule>
   <!--
Template derived rules for ID: 1.2.40.0.34.6.0.11.3.9
Context: *[hl7:observation[hl7:templateId[@root = '1.2.40.0.34.6.0.11.3.9'] and hl7:templateId[@root = '2.16.840.1.113883.10.20.1.28'] and hl7:templateId[@root = '1.3.6.1.4.1.19376.1.5.3.1.4.5']]]/hl7:observation[hl7:templateId[@root = '1.2.40.0.34.6.0.11.3.9'] and hl7:templateId[@root = '2.16.840.1.113883.10.20.1.28'] and hl7:templateId[@root = '1.3.6.1.4.1.19376.1.5.3.1.4.5']]/hl7:code[(@code = '55607006' and @codeSystem = '2.16.840.1.113883.6.96')]
Item: (eimpf_entry_ImpfrelevanteErkrankungProblemEntry)
-->

   <rule fpi="RULC-1"
         context="*[hl7:observation[hl7:templateId[@root = '1.2.40.0.34.6.0.11.3.9'] and hl7:templateId[@root = '2.16.840.1.113883.10.20.1.28'] and hl7:templateId[@root = '1.3.6.1.4.1.19376.1.5.3.1.4.5']]]/hl7:observation[hl7:templateId[@root = '1.2.40.0.34.6.0.11.3.9'] and hl7:templateId[@root = '2.16.840.1.113883.10.20.1.28'] and hl7:templateId[@root = '1.3.6.1.4.1.19376.1.5.3.1.4.5']]/hl7:code[(@code = '55607006' and @codeSystem = '2.16.840.1.113883.6.96')]"
         id="d42e49458-false-d1499763e0">
      <extends rule="CE"/>
      <assert role="error"
              see="http://elga.art-decor.org/elgaimpf-html-20250116T125121/tmp-1.2.40.0.34.6.0.11.3.9-2019-05-20T081225.html"
              test="empty(@xsi:type) or resolve-QName(@xsi:type, .) = QName('urn:hl7-org:v3', 'CE')">(eimpf_entry_ImpfrelevanteErkrankungProblemEntry): Wenn eine @xsi:type Instruktion anwesend ist MUSS diese den Wert "{urn:hl7-org:v3}:CE" haben. Gefunden "{<value-of select="namespace-uri-from-QName(resolve-QName(@xsi:type,.))"/>}:<value-of select="local-name-from-QName(resolve-QName(@xsi:type,.))"/>"</assert>
      <assert role="error"
              see="http://elga.art-decor.org/elgaimpf-html-20250116T125121/tmp-1.2.40.0.34.6.0.11.3.9-2019-05-20T081225.html"
              test="@nullFlavor or (@code='55607006' and @codeSystem='2.16.840.1.113883.6.96')">(eimpf_entry_ImpfrelevanteErkrankungProblemEntry): Der Elementinhalt MUSS einer von 'code '55607006' codeSystem '2.16.840.1.113883.6.96'' sein.</assert>
      <assert role="error"
              see="http://elga.art-decor.org/elgaimpf-html-20250116T125121/tmp-1.2.40.0.34.6.0.11.3.9-2019-05-20T081225.html"
              test="string(@codeSystemName) = ('SNOMED CT')">(eimpf_entry_ImpfrelevanteErkrankungProblemEntry): Der Wert von codeSystemName MUSS 'SNOMED CT' sein. Gefunden: "<value-of select="@codeSystemName"/>"</assert>
      <assert role="error"
              see="http://elga.art-decor.org/elgaimpf-html-20250116T125121/tmp-1.2.40.0.34.6.0.11.3.9-2019-05-20T081225.html"
              test="not(@codeSystemName) or string-length(@codeSystemName)&gt;0">(eimpf_entry_ImpfrelevanteErkrankungProblemEntry): Attribute @codeSystemName MUSS vom Datentyp 'st' sein  - '<value-of select="@codeSystemName"/>'</assert>
   </rule>
   <!--
Template derived rules for ID: 1.2.40.0.34.6.0.11.9.1
Context: *[hl7:observation[hl7:templateId[@root = '1.2.40.0.34.6.0.11.3.9'] and hl7:templateId[@root = '2.16.840.1.113883.10.20.1.28'] and hl7:templateId[@root = '1.3.6.1.4.1.19376.1.5.3.1.4.5']]]/hl7:observation[hl7:templateId[@root = '1.2.40.0.34.6.0.11.3.9'] and hl7:templateId[@root = '2.16.840.1.113883.10.20.1.28'] and hl7:templateId[@root = '1.3.6.1.4.1.19376.1.5.3.1.4.5']]/hl7:text
Item: (atcdabrr_other_NarrativeTextReference)
-->

   <rule fpi="RULC-1"
         context="*[hl7:observation[hl7:templateId[@root = '1.2.40.0.34.6.0.11.3.9'] and hl7:templateId[@root = '2.16.840.1.113883.10.20.1.28'] and hl7:templateId[@root = '1.3.6.1.4.1.19376.1.5.3.1.4.5']]]/hl7:observation[hl7:templateId[@root = '1.2.40.0.34.6.0.11.3.9'] and hl7:templateId[@root = '2.16.840.1.113883.10.20.1.28'] and hl7:templateId[@root = '1.3.6.1.4.1.19376.1.5.3.1.4.5']]/hl7:text"
         id="d1499764e75-false-d1499786e0">
      <extends rule="ED"/>
      <assert role="error"
              see="http://elga.art-decor.org/elgaimpf-html-20250116T125121/tmp-1.2.40.0.34.6.0.11.9.1-2021-05-06T093820.html"
              test="empty(@xsi:type) or resolve-QName(@xsi:type, .) = QName('urn:hl7-org:v3', 'ED')">(atcdabrr_other_NarrativeTextReference): Wenn eine @xsi:type Instruktion anwesend ist MUSS diese den Wert "{urn:hl7-org:v3}:ED" haben. Gefunden "{<value-of select="namespace-uri-from-QName(resolve-QName(@xsi:type,.))"/>}:<value-of select="local-name-from-QName(resolve-QName(@xsi:type,.))"/>"</assert>
      <assert role="error"
              see="http://elga.art-decor.org/elgaimpf-html-20250116T125121/tmp-1.2.40.0.34.6.0.11.9.1-2021-05-06T093820.html"
              test="count(hl7:reference[not(@nullFlavor)]) &gt;= 1">(atcdabrr_other_NarrativeTextReference): Element hl7:reference[not(@nullFlavor)] ist mandatory [min 1x].</assert>
      <assert role="error"
              see="http://elga.art-decor.org/elgaimpf-html-20250116T125121/tmp-1.2.40.0.34.6.0.11.9.1-2021-05-06T093820.html"
              test="count(hl7:reference[not(@nullFlavor)]) &lt;= 1">(atcdabrr_other_NarrativeTextReference): Element hl7:reference[not(@nullFlavor)] kommt zu häufig vor [max 1x].</assert>
   </rule>
   <!--
Template derived rules for ID: 1.2.40.0.34.6.0.11.9.1
Context: *[hl7:observation[hl7:templateId[@root = '1.2.40.0.34.6.0.11.3.9'] and hl7:templateId[@root = '2.16.840.1.113883.10.20.1.28'] and hl7:templateId[@root = '1.3.6.1.4.1.19376.1.5.3.1.4.5']]]/hl7:observation[hl7:templateId[@root = '1.2.40.0.34.6.0.11.3.9'] and hl7:templateId[@root = '2.16.840.1.113883.10.20.1.28'] and hl7:templateId[@root = '1.3.6.1.4.1.19376.1.5.3.1.4.5']]/hl7:text/hl7:reference[not(@nullFlavor)]
Item: (atcdabrr_other_NarrativeTextReference)
-->

   <rule fpi="RULC-1"
         context="*[hl7:observation[hl7:templateId[@root = '1.2.40.0.34.6.0.11.3.9'] and hl7:templateId[@root = '2.16.840.1.113883.10.20.1.28'] and hl7:templateId[@root = '1.3.6.1.4.1.19376.1.5.3.1.4.5']]]/hl7:observation[hl7:templateId[@root = '1.2.40.0.34.6.0.11.3.9'] and hl7:templateId[@root = '2.16.840.1.113883.10.20.1.28'] and hl7:templateId[@root = '1.3.6.1.4.1.19376.1.5.3.1.4.5']]/hl7:text/hl7:reference[not(@nullFlavor)]"
         id="d1499764e77-false-d1499805e0">
      <extends rule="TEL"/>
      <assert role="error"
              see="http://elga.art-decor.org/elgaimpf-html-20250116T125121/tmp-1.2.40.0.34.6.0.11.9.1-2021-05-06T093820.html"
              test="empty(@xsi:type) or resolve-QName(@xsi:type, .) = QName('urn:hl7-org:v3', 'TEL')">(atcdabrr_other_NarrativeTextReference): Wenn eine @xsi:type Instruktion anwesend ist MUSS diese den Wert "{urn:hl7-org:v3}:TEL" haben. Gefunden "{<value-of select="namespace-uri-from-QName(resolve-QName(@xsi:type,.))"/>}:<value-of select="local-name-from-QName(resolve-QName(@xsi:type,.))"/>"</assert>
      <assert role="error"
              see="http://elga.art-decor.org/elgaimpf-html-20250116T125121/tmp-1.2.40.0.34.6.0.11.9.1-2021-05-06T093820.html"
              test="@value">(atcdabrr_other_NarrativeTextReference): Attribut @value MUSS vorkommen.</assert>
      <assert role="error"
              see="http://elga.art-decor.org/elgaimpf-html-20250116T125121/tmp-1.2.40.0.34.6.0.11.9.1-2021-05-06T093820.html"
              test="starts-with(@value,'#') or starts-with(@value,'http')">(atcdabrr_other_NarrativeTextReference): The @value attribute content MUST conform to the format '#xxx', where xxx is the ID of the corresponding 'content'-element, or begin with the 'http' or 'https' url-scheme.</assert>
   </rule>
   <!--
Template derived rules for ID: 1.2.40.0.34.6.0.11.3.9
Context: *[hl7:observation[hl7:templateId[@root = '1.2.40.0.34.6.0.11.3.9'] and hl7:templateId[@root = '2.16.840.1.113883.10.20.1.28'] and hl7:templateId[@root = '1.3.6.1.4.1.19376.1.5.3.1.4.5']]]/hl7:observation[hl7:templateId[@root = '1.2.40.0.34.6.0.11.3.9'] and hl7:templateId[@root = '2.16.840.1.113883.10.20.1.28'] and hl7:templateId[@root = '1.3.6.1.4.1.19376.1.5.3.1.4.5']]/hl7:statusCode[@code = 'completed']
Item: (eimpf_entry_ImpfrelevanteErkrankungProblemEntry)
-->

   <rule fpi="RULC-1"
         context="*[hl7:observation[hl7:templateId[@root = '1.2.40.0.34.6.0.11.3.9'] and hl7:templateId[@root = '2.16.840.1.113883.10.20.1.28'] and hl7:templateId[@root = '1.3.6.1.4.1.19376.1.5.3.1.4.5']]]/hl7:observation[hl7:templateId[@root = '1.2.40.0.34.6.0.11.3.9'] and hl7:templateId[@root = '2.16.840.1.113883.10.20.1.28'] and hl7:templateId[@root = '1.3.6.1.4.1.19376.1.5.3.1.4.5']]/hl7:statusCode[@code = 'completed']"
         id="d42e49470-false-d1499820e0">
      <extends rule="CS"/>
      <assert role="error"
              see="http://elga.art-decor.org/elgaimpf-html-20250116T125121/tmp-1.2.40.0.34.6.0.11.3.9-2019-05-20T081225.html"
              test="empty(@xsi:type) or resolve-QName(@xsi:type, .) = QName('urn:hl7-org:v3', 'CS')">(eimpf_entry_ImpfrelevanteErkrankungProblemEntry): Wenn eine @xsi:type Instruktion anwesend ist MUSS diese den Wert "{urn:hl7-org:v3}:CS" haben. Gefunden "{<value-of select="namespace-uri-from-QName(resolve-QName(@xsi:type,.))"/>}:<value-of select="local-name-from-QName(resolve-QName(@xsi:type,.))"/>"</assert>
      <assert role="error"
              see="http://elga.art-decor.org/elgaimpf-html-20250116T125121/tmp-1.2.40.0.34.6.0.11.3.9-2019-05-20T081225.html"
              test="@nullFlavor or (@code='completed')">(eimpf_entry_ImpfrelevanteErkrankungProblemEntry): Der Elementinhalt MUSS einer von 'code 'completed'' sein.</assert>
   </rule>
   <!--
Template derived rules for ID: 1.2.40.0.34.6.0.11.3.9
Context: *[hl7:observation[hl7:templateId[@root = '1.2.40.0.34.6.0.11.3.9'] and hl7:templateId[@root = '2.16.840.1.113883.10.20.1.28'] and hl7:templateId[@root = '1.3.6.1.4.1.19376.1.5.3.1.4.5']]]/hl7:observation[hl7:templateId[@root = '1.2.40.0.34.6.0.11.3.9'] and hl7:templateId[@root = '2.16.840.1.113883.10.20.1.28'] and hl7:templateId[@root = '1.3.6.1.4.1.19376.1.5.3.1.4.5']]/hl7:effectiveTime[not(@nullFlavor)]
Item: (eimpf_entry_ImpfrelevanteErkrankungProblemEntry)
-->

   <rule fpi="RULC-1"
         context="*[hl7:observation[hl7:templateId[@root = '1.2.40.0.34.6.0.11.3.9'] and hl7:templateId[@root = '2.16.840.1.113883.10.20.1.28'] and hl7:templateId[@root = '1.3.6.1.4.1.19376.1.5.3.1.4.5']]]/hl7:observation[hl7:templateId[@root = '1.2.40.0.34.6.0.11.3.9'] and hl7:templateId[@root = '2.16.840.1.113883.10.20.1.28'] and hl7:templateId[@root = '1.3.6.1.4.1.19376.1.5.3.1.4.5']]/hl7:effectiveTime[not(@nullFlavor)]"
         id="d42e49482-false-d1499836e0">
      <extends rule="IVL_TS"/>
      <assert role="error"
              see="http://elga.art-decor.org/elgaimpf-html-20250116T125121/tmp-1.2.40.0.34.6.0.11.3.9-2019-05-20T081225.html"
              test="empty(@xsi:type) or resolve-QName(@xsi:type, .) = QName('urn:hl7-org:v3', 'IVL_TS')">(eimpf_entry_ImpfrelevanteErkrankungProblemEntry): Wenn eine @xsi:type Instruktion anwesend ist MUSS diese den Wert "{urn:hl7-org:v3}:IVL_TS" haben. Gefunden "{<value-of select="namespace-uri-from-QName(resolve-QName(@xsi:type,.))"/>}:<value-of select="local-name-from-QName(resolve-QName(@xsi:type,.))"/>"</assert>
      <let name="elmcount"
           value="count(hl7:low[not(@nullFlavor)] | hl7:low[@nullFlavor='UNK'])"/>
      <assert role="error"
              see="http://elga.art-decor.org/elgaimpf-html-20250116T125121/tmp-1.2.40.0.34.6.0.11.3.9-2019-05-20T081225.html"
              test="$elmcount &gt;= 1">(eimpf_entry_ImpfrelevanteErkrankungProblemEntry): Auswahl (hl7:low[not(@nullFlavor)]  oder  hl7:low[@nullFlavor='UNK']) enthält nicht genügend Elemente [min 1x]</assert>
      <assert role="error"
              see="http://elga.art-decor.org/elgaimpf-html-20250116T125121/tmp-1.2.40.0.34.6.0.11.3.9-2019-05-20T081225.html"
              test="$elmcount &lt;= 1">(eimpf_entry_ImpfrelevanteErkrankungProblemEntry): Auswahl (hl7:low[not(@nullFlavor)]  oder  hl7:low[@nullFlavor='UNK']) enthält zu viele Elemente [max 1x]</assert>
      <assert role="error"
              see="http://elga.art-decor.org/elgaimpf-html-20250116T125121/tmp-1.2.40.0.34.6.0.11.3.9-2019-05-20T081225.html"
              test="count(hl7:low[not(@nullFlavor)]) &lt;= 1">(eimpf_entry_ImpfrelevanteErkrankungProblemEntry): Element hl7:low[not(@nullFlavor)] kommt zu häufig vor [max 1x].</assert>
      <assert role="error"
              see="http://elga.art-decor.org/elgaimpf-html-20250116T125121/tmp-1.2.40.0.34.6.0.11.3.9-2019-05-20T081225.html"
              test="count(hl7:low[@nullFlavor='UNK']) &lt;= 1">(eimpf_entry_ImpfrelevanteErkrankungProblemEntry): Element hl7:low[@nullFlavor='UNK'] kommt zu häufig vor [max 1x].</assert>
      <assert role="error"
              see="http://elga.art-decor.org/elgaimpf-html-20250116T125121/tmp-1.2.40.0.34.6.0.11.3.9-2019-05-20T081225.html"
              test="count(hl7:high) &lt;= 1">(eimpf_entry_ImpfrelevanteErkrankungProblemEntry): Element hl7:high kommt zu häufig vor [max 1x].</assert>
   </rule>
   <!--
Template derived rules for ID: 1.2.40.0.34.6.0.11.3.9
Context: *[hl7:observation[hl7:templateId[@root = '1.2.40.0.34.6.0.11.3.9'] and hl7:templateId[@root = '2.16.840.1.113883.10.20.1.28'] and hl7:templateId[@root = '1.3.6.1.4.1.19376.1.5.3.1.4.5']]]/hl7:observation[hl7:templateId[@root = '1.2.40.0.34.6.0.11.3.9'] and hl7:templateId[@root = '2.16.840.1.113883.10.20.1.28'] and hl7:templateId[@root = '1.3.6.1.4.1.19376.1.5.3.1.4.5']]/hl7:effectiveTime[not(@nullFlavor)]/hl7:low[not(@nullFlavor)]
Item: (eimpf_entry_ImpfrelevanteErkrankungProblemEntry)
-->

   <rule fpi="RULC-1"
         context="*[hl7:observation[hl7:templateId[@root = '1.2.40.0.34.6.0.11.3.9'] and hl7:templateId[@root = '2.16.840.1.113883.10.20.1.28'] and hl7:templateId[@root = '1.3.6.1.4.1.19376.1.5.3.1.4.5']]]/hl7:observation[hl7:templateId[@root = '1.2.40.0.34.6.0.11.3.9'] and hl7:templateId[@root = '2.16.840.1.113883.10.20.1.28'] and hl7:templateId[@root = '1.3.6.1.4.1.19376.1.5.3.1.4.5']]/hl7:effectiveTime[not(@nullFlavor)]/hl7:low[not(@nullFlavor)]"
         id="d42e49501-false-d1499867e0">
      <extends rule="TS.DATE"/>
      <assert role="error"
              see="http://elga.art-decor.org/elgaimpf-html-20250116T125121/tmp-1.2.40.0.34.6.0.11.3.9-2019-05-20T081225.html"
              test="empty(@xsi:type) or resolve-QName(@xsi:type, .) = QName('urn:hl7-org:v3', 'TS')">(eimpf_entry_ImpfrelevanteErkrankungProblemEntry): Wenn eine @xsi:type Instruktion anwesend ist MUSS diese den Wert "{urn:hl7-org:v3}:TS" haben. Gefunden "{<value-of select="namespace-uri-from-QName(resolve-QName(@xsi:type,.))"/>}:<value-of select="local-name-from-QName(resolve-QName(@xsi:type,.))"/>"</assert>
      <assert role="error"
              see="http://elga.art-decor.org/elgaimpf-html-20250116T125121/tmp-1.2.40.0.34.6.0.11.3.9-2019-05-20T081225.html"
              test="not(*)">(eimpf_entry_ImpfrelevanteErkrankungProblemEntry): <value-of select="local-name()"/> with datatype TS.DATE, SHOULD NOT have child elements.</assert>
   </rule>
   <!--
Template derived rules for ID: 1.2.40.0.34.6.0.11.3.9
Context: *[hl7:observation[hl7:templateId[@root = '1.2.40.0.34.6.0.11.3.9'] and hl7:templateId[@root = '2.16.840.1.113883.10.20.1.28'] and hl7:templateId[@root = '1.3.6.1.4.1.19376.1.5.3.1.4.5']]]/hl7:observation[hl7:templateId[@root = '1.2.40.0.34.6.0.11.3.9'] and hl7:templateId[@root = '2.16.840.1.113883.10.20.1.28'] and hl7:templateId[@root = '1.3.6.1.4.1.19376.1.5.3.1.4.5']]/hl7:effectiveTime[not(@nullFlavor)]/hl7:low[@nullFlavor='UNK']
Item: (eimpf_entry_ImpfrelevanteErkrankungProblemEntry)
-->

   <rule fpi="RULC-1"
         context="*[hl7:observation[hl7:templateId[@root = '1.2.40.0.34.6.0.11.3.9'] and hl7:templateId[@root = '2.16.840.1.113883.10.20.1.28'] and hl7:templateId[@root = '1.3.6.1.4.1.19376.1.5.3.1.4.5']]]/hl7:observation[hl7:templateId[@root = '1.2.40.0.34.6.0.11.3.9'] and hl7:templateId[@root = '2.16.840.1.113883.10.20.1.28'] and hl7:templateId[@root = '1.3.6.1.4.1.19376.1.5.3.1.4.5']]/hl7:effectiveTime[not(@nullFlavor)]/hl7:low[@nullFlavor='UNK']"
         id="d42e49503-false-d1499878e0">
      <extends rule="TS.DATE"/>
      <assert role="error"
              see="http://elga.art-decor.org/elgaimpf-html-20250116T125121/tmp-1.2.40.0.34.6.0.11.3.9-2019-05-20T081225.html"
              test="empty(@xsi:type) or resolve-QName(@xsi:type, .) = QName('urn:hl7-org:v3', 'TS')">(eimpf_entry_ImpfrelevanteErkrankungProblemEntry): Wenn eine @xsi:type Instruktion anwesend ist MUSS diese den Wert "{urn:hl7-org:v3}:TS" haben. Gefunden "{<value-of select="namespace-uri-from-QName(resolve-QName(@xsi:type,.))"/>}:<value-of select="local-name-from-QName(resolve-QName(@xsi:type,.))"/>"</assert>
      <assert role="error"
              see="http://elga.art-decor.org/elgaimpf-html-20250116T125121/tmp-1.2.40.0.34.6.0.11.3.9-2019-05-20T081225.html"
              test="not(*)">(eimpf_entry_ImpfrelevanteErkrankungProblemEntry): <value-of select="local-name()"/> with datatype TS.DATE, SHOULD NOT have child elements.</assert>
      <assert role="error"
              see="http://elga.art-decor.org/elgaimpf-html-20250116T125121/tmp-1.2.40.0.34.6.0.11.3.9-2019-05-20T081225.html"
              test="string(@nullFlavor) = ('UNK')">(eimpf_entry_ImpfrelevanteErkrankungProblemEntry): Der Wert von nullFlavor MUSS 'UNK' sein. Gefunden: "<value-of select="@nullFlavor"/>"</assert>
   </rule>
   <!--
Template derived rules for ID: 1.2.40.0.34.6.0.11.3.9
Context: *[hl7:observation[hl7:templateId[@root = '1.2.40.0.34.6.0.11.3.9'] and hl7:templateId[@root = '2.16.840.1.113883.10.20.1.28'] and hl7:templateId[@root = '1.3.6.1.4.1.19376.1.5.3.1.4.5']]]/hl7:observation[hl7:templateId[@root = '1.2.40.0.34.6.0.11.3.9'] and hl7:templateId[@root = '2.16.840.1.113883.10.20.1.28'] and hl7:templateId[@root = '1.3.6.1.4.1.19376.1.5.3.1.4.5']]/hl7:effectiveTime[not(@nullFlavor)]/hl7:high
Item: (eimpf_entry_ImpfrelevanteErkrankungProblemEntry)
-->

   <rule fpi="RULC-1"
         context="*[hl7:observation[hl7:templateId[@root = '1.2.40.0.34.6.0.11.3.9'] and hl7:templateId[@root = '2.16.840.1.113883.10.20.1.28'] and hl7:templateId[@root = '1.3.6.1.4.1.19376.1.5.3.1.4.5']]]/hl7:observation[hl7:templateId[@root = '1.2.40.0.34.6.0.11.3.9'] and hl7:templateId[@root = '2.16.840.1.113883.10.20.1.28'] and hl7:templateId[@root = '1.3.6.1.4.1.19376.1.5.3.1.4.5']]/hl7:effectiveTime[not(@nullFlavor)]/hl7:high"
         id="d42e49512-false-d1499895e0">
      <extends rule="TS.DATE"/>
      <assert role="error"
              see="http://elga.art-decor.org/elgaimpf-html-20250116T125121/tmp-1.2.40.0.34.6.0.11.3.9-2019-05-20T081225.html"
              test="empty(@xsi:type) or resolve-QName(@xsi:type, .) = QName('urn:hl7-org:v3', 'TS')">(eimpf_entry_ImpfrelevanteErkrankungProblemEntry): Wenn eine @xsi:type Instruktion anwesend ist MUSS diese den Wert "{urn:hl7-org:v3}:TS" haben. Gefunden "{<value-of select="namespace-uri-from-QName(resolve-QName(@xsi:type,.))"/>}:<value-of select="local-name-from-QName(resolve-QName(@xsi:type,.))"/>"</assert>
      <assert role="error"
              see="http://elga.art-decor.org/elgaimpf-html-20250116T125121/tmp-1.2.40.0.34.6.0.11.3.9-2019-05-20T081225.html"
              test="not(*)">(eimpf_entry_ImpfrelevanteErkrankungProblemEntry): <value-of select="local-name()"/> with datatype TS.DATE, SHOULD NOT have child elements.</assert>
   </rule>
   <!--
Template derived rules for ID: 1.2.40.0.34.6.0.11.3.9
Context: *[hl7:observation[hl7:templateId[@root = '1.2.40.0.34.6.0.11.3.9'] and hl7:templateId[@root = '2.16.840.1.113883.10.20.1.28'] and hl7:templateId[@root = '1.3.6.1.4.1.19376.1.5.3.1.4.5']]]/hl7:observation[hl7:templateId[@root = '1.2.40.0.34.6.0.11.3.9'] and hl7:templateId[@root = '2.16.840.1.113883.10.20.1.28'] and hl7:templateId[@root = '1.3.6.1.4.1.19376.1.5.3.1.4.5']]/hl7:value[concat(@code, @codeSystem) = doc('include/voc-1.2.40.0.34.6.0.10.2-DYNAMIC.xml')//valueSet[1]/conceptList/concept/concat(@code, @codeSystem)]
Item: (eimpf_entry_ImpfrelevanteErkrankungProblemEntry)
-->

   <rule fpi="RULC-1"
         context="*[hl7:observation[hl7:templateId[@root = '1.2.40.0.34.6.0.11.3.9'] and hl7:templateId[@root = '2.16.840.1.113883.10.20.1.28'] and hl7:templateId[@root = '1.3.6.1.4.1.19376.1.5.3.1.4.5']]]/hl7:observation[hl7:templateId[@root = '1.2.40.0.34.6.0.11.3.9'] and hl7:templateId[@root = '2.16.840.1.113883.10.20.1.28'] and hl7:templateId[@root = '1.3.6.1.4.1.19376.1.5.3.1.4.5']]/hl7:value[concat(@code, @codeSystem) = doc('include/voc-1.2.40.0.34.6.0.10.2-DYNAMIC.xml')//valueSet[1]/conceptList/concept/concat(@code, @codeSystem)]"
         id="d42e49519-false-d1499914e0">
      <extends rule="CD"/>
      <assert role="error"
              see="http://elga.art-decor.org/elgaimpf-html-20250116T125121/tmp-1.2.40.0.34.6.0.11.3.9-2019-05-20T081225.html"
              test="empty(@xsi:type) or resolve-QName(@xsi:type, .) = QName('urn:hl7-org:v3', 'CD')">(eimpf_entry_ImpfrelevanteErkrankungProblemEntry): Wenn eine @xsi:type Instruktion anwesend ist MUSS diese den Wert "{urn:hl7-org:v3}:CD" haben. Gefunden "{<value-of select="namespace-uri-from-QName(resolve-QName(@xsi:type,.))"/>}:<value-of select="local-name-from-QName(resolve-QName(@xsi:type,.))"/>"</assert>
      <let name="theCode" value="@code"/>
      <let name="theCodeSystem" value="@codeSystem"/>
      <assert role="error"
              see="http://elga.art-decor.org/elgaimpf-html-20250116T125121/tmp-1.2.40.0.34.6.0.11.3.9-2019-05-20T081225.html"
              test="@nullFlavor or exists(doc('include/voc-1.2.40.0.34.6.0.10.2-DYNAMIC.xml')//valueSet[1][conceptList/concept[@code = $theCode][@codeSystem = $theCodeSystem]])">(eimpf_entry_ImpfrelevanteErkrankungProblemEntry): Der Elementinhalt MUSS einer von '1.2.40.0.34.6.0.10.2 eImpf_ImpfrelevanteErkrankung (DYNAMIC)' sein.</assert>
      <assert role="error"
              see="http://elga.art-decor.org/elgaimpf-html-20250116T125121/tmp-1.2.40.0.34.6.0.11.3.9-2019-05-20T081225.html"
              test="@code">(eimpf_entry_ImpfrelevanteErkrankungProblemEntry): Attribut @code MUSS vorkommen.</assert>
      <assert role="error"
              see="http://elga.art-decor.org/elgaimpf-html-20250116T125121/tmp-1.2.40.0.34.6.0.11.3.9-2019-05-20T081225.html"
              test="not(@code) or (string-length(@code) &gt; 0 and not(matches(@code,'\s')))">(eimpf_entry_ImpfrelevanteErkrankungProblemEntry): Attribute @code MUSS vom Datentyp 'cs' sein  - '<value-of select="@code"/>'</assert>
      <assert role="error"
              see="http://elga.art-decor.org/elgaimpf-html-20250116T125121/tmp-1.2.40.0.34.6.0.11.3.9-2019-05-20T081225.html"
              test="@codeSystem">(eimpf_entry_ImpfrelevanteErkrankungProblemEntry): Attribut @codeSystem MUSS vorkommen.</assert>
      <assert role="error"
              see="http://elga.art-decor.org/elgaimpf-html-20250116T125121/tmp-1.2.40.0.34.6.0.11.3.9-2019-05-20T081225.html"
              test="not(@codeSystem) or matches(@codeSystem,'^[0-2](\.(0|[1-9]\d*))*$')">(eimpf_entry_ImpfrelevanteErkrankungProblemEntry): Attribute @codeSystem MUSS vom Datentyp 'oid' sein  - '<value-of select="@codeSystem"/>'</assert>
      <assert role="error"
              see="http://elga.art-decor.org/elgaimpf-html-20250116T125121/tmp-1.2.40.0.34.6.0.11.3.9-2019-05-20T081225.html"
              test="count(hl7:originalText[not(@nullFlavor)]) &gt;= 1">(eimpf_entry_ImpfrelevanteErkrankungProblemEntry): Element hl7:originalText[not(@nullFlavor)] ist mandatory [min 1x].</assert>
      <assert role="error"
              see="http://elga.art-decor.org/elgaimpf-html-20250116T125121/tmp-1.2.40.0.34.6.0.11.3.9-2019-05-20T081225.html"
              test="count(hl7:originalText[not(@nullFlavor)]) &lt;= 1">(eimpf_entry_ImpfrelevanteErkrankungProblemEntry): Element hl7:originalText[not(@nullFlavor)] kommt zu häufig vor [max 1x].</assert>
   </rule>
   <!--
Template derived rules for ID: 1.2.40.0.34.6.0.11.9.2
Context: *[hl7:observation[hl7:templateId[@root = '1.2.40.0.34.6.0.11.3.9'] and hl7:templateId[@root = '2.16.840.1.113883.10.20.1.28'] and hl7:templateId[@root = '1.3.6.1.4.1.19376.1.5.3.1.4.5']]]/hl7:observation[hl7:templateId[@root = '1.2.40.0.34.6.0.11.3.9'] and hl7:templateId[@root = '2.16.840.1.113883.10.20.1.28'] and hl7:templateId[@root = '1.3.6.1.4.1.19376.1.5.3.1.4.5']]/hl7:value[concat(@code, @codeSystem) = doc('include/voc-1.2.40.0.34.6.0.10.2-DYNAMIC.xml')//valueSet[1]/conceptList/concept/concat(@code, @codeSystem)]/hl7:originalText
Item: (atcdabbr_other_OriginalTextReference)
-->

   <rule fpi="RULC-1"
         context="*[hl7:observation[hl7:templateId[@root = '1.2.40.0.34.6.0.11.3.9'] and hl7:templateId[@root = '2.16.840.1.113883.10.20.1.28'] and hl7:templateId[@root = '1.3.6.1.4.1.19376.1.5.3.1.4.5']]]/hl7:observation[hl7:templateId[@root = '1.2.40.0.34.6.0.11.3.9'] and hl7:templateId[@root = '2.16.840.1.113883.10.20.1.28'] and hl7:templateId[@root = '1.3.6.1.4.1.19376.1.5.3.1.4.5']]/hl7:value[concat(@code, @codeSystem) = doc('include/voc-1.2.40.0.34.6.0.10.2-DYNAMIC.xml')//valueSet[1]/conceptList/concept/concat(@code, @codeSystem)]/hl7:originalText"
         id="d1499917e72-false-d1499959e0">
      <extends rule="ED"/>
      <assert role="error"
              see="http://elga.art-decor.org/elgaimpf-html-20250116T125121/tmp-1.2.40.0.34.6.0.11.9.2-2021-02-19T133148.html"
              test="empty(@xsi:type) or resolve-QName(@xsi:type, .) = QName('urn:hl7-org:v3', 'ED')">(atcdabbr_other_OriginalTextReference): Wenn eine @xsi:type Instruktion anwesend ist MUSS diese den Wert "{urn:hl7-org:v3}:ED" haben. Gefunden "{<value-of select="namespace-uri-from-QName(resolve-QName(@xsi:type,.))"/>}:<value-of select="local-name-from-QName(resolve-QName(@xsi:type,.))"/>"</assert>
      <assert role="error"
              see="http://elga.art-decor.org/elgaimpf-html-20250116T125121/tmp-1.2.40.0.34.6.0.11.9.2-2021-02-19T133148.html"
              test="count(hl7:reference[not(@nullFlavor)]) &gt;= 1">(atcdabbr_other_OriginalTextReference): Element hl7:reference[not(@nullFlavor)] ist mandatory [min 1x].</assert>
      <assert role="error"
              see="http://elga.art-decor.org/elgaimpf-html-20250116T125121/tmp-1.2.40.0.34.6.0.11.9.2-2021-02-19T133148.html"
              test="count(hl7:reference[not(@nullFlavor)]) &lt;= 1">(atcdabbr_other_OriginalTextReference): Element hl7:reference[not(@nullFlavor)] kommt zu häufig vor [max 1x].</assert>
   </rule>
   <!--
Template derived rules for ID: 1.2.40.0.34.6.0.11.9.2
Context: *[hl7:observation[hl7:templateId[@root = '1.2.40.0.34.6.0.11.3.9'] and hl7:templateId[@root = '2.16.840.1.113883.10.20.1.28'] and hl7:templateId[@root = '1.3.6.1.4.1.19376.1.5.3.1.4.5']]]/hl7:observation[hl7:templateId[@root = '1.2.40.0.34.6.0.11.3.9'] and hl7:templateId[@root = '2.16.840.1.113883.10.20.1.28'] and hl7:templateId[@root = '1.3.6.1.4.1.19376.1.5.3.1.4.5']]/hl7:value[concat(@code, @codeSystem) = doc('include/voc-1.2.40.0.34.6.0.10.2-DYNAMIC.xml')//valueSet[1]/conceptList/concept/concat(@code, @codeSystem)]/hl7:originalText/hl7:reference[not(@nullFlavor)]
Item: (atcdabbr_other_OriginalTextReference)
-->

   <rule fpi="RULC-1"
         context="*[hl7:observation[hl7:templateId[@root = '1.2.40.0.34.6.0.11.3.9'] and hl7:templateId[@root = '2.16.840.1.113883.10.20.1.28'] and hl7:templateId[@root = '1.3.6.1.4.1.19376.1.5.3.1.4.5']]]/hl7:observation[hl7:templateId[@root = '1.2.40.0.34.6.0.11.3.9'] and hl7:templateId[@root = '2.16.840.1.113883.10.20.1.28'] and hl7:templateId[@root = '1.3.6.1.4.1.19376.1.5.3.1.4.5']]/hl7:value[concat(@code, @codeSystem) = doc('include/voc-1.2.40.0.34.6.0.10.2-DYNAMIC.xml')//valueSet[1]/conceptList/concept/concat(@code, @codeSystem)]/hl7:originalText/hl7:reference[not(@nullFlavor)]"
         id="d1499917e78-false-d1499978e0">
      <extends rule="TEL"/>
      <assert role="error"
              see="http://elga.art-decor.org/elgaimpf-html-20250116T125121/tmp-1.2.40.0.34.6.0.11.9.2-2021-02-19T133148.html"
              test="empty(@xsi:type) or resolve-QName(@xsi:type, .) = QName('urn:hl7-org:v3', 'TEL')">(atcdabbr_other_OriginalTextReference): Wenn eine @xsi:type Instruktion anwesend ist MUSS diese den Wert "{urn:hl7-org:v3}:TEL" haben. Gefunden "{<value-of select="namespace-uri-from-QName(resolve-QName(@xsi:type,.))"/>}:<value-of select="local-name-from-QName(resolve-QName(@xsi:type,.))"/>"</assert>
      <assert role="error"
              see="http://elga.art-decor.org/elgaimpf-html-20250116T125121/tmp-1.2.40.0.34.6.0.11.9.2-2021-02-19T133148.html"
              test="@value">(atcdabbr_other_OriginalTextReference): Attribut @value MUSS vorkommen.</assert>
      <assert role="error"
              see="http://elga.art-decor.org/elgaimpf-html-20250116T125121/tmp-1.2.40.0.34.6.0.11.9.2-2021-02-19T133148.html"
              test="starts-with(@value,'#')">(atcdabbr_other_OriginalTextReference): The @value attribute content MUST conform to the format '#xxx', where xxx is the ID of the corresponding 'content'-element.</assert>
   </rule>

   <!--
Template derived rules for ID: 1.2.40.0.34.6.0.11.3.9
Context: *[hl7:observation[hl7:templateId[@root = '1.2.40.0.34.6.0.11.3.9'] and hl7:templateId[@root = '2.16.840.1.113883.10.20.1.28'] and hl7:templateId[@root = '1.3.6.1.4.1.19376.1.5.3.1.4.5']]]/hl7:observation[hl7:templateId[@root = '1.2.40.0.34.6.0.11.3.9'] and hl7:templateId[@root = '2.16.840.1.113883.10.20.1.28'] and hl7:templateId[@root = '1.3.6.1.4.1.19376.1.5.3.1.4.5']]/hl7:entryRelationship[hl7:act[hl7:templateId[@root = '1.2.40.0.34.6.0.11.3.11'] and hl7:templateId[@root = '2.16.840.1.113883.10.20.1.40'] and hl7:templateId[@root = '1.3.6.1.4.1.19376.1.5.3.1.4.2']]]
Item: (eimpf_entry_ImpfrelevanteErkrankungProblemEntry)
-->
   <rule fpi="RULC-1"
         context="*[hl7:observation[hl7:templateId[@root = '1.2.40.0.34.6.0.11.3.9'] and hl7:templateId[@root = '2.16.840.1.113883.10.20.1.28'] and hl7:templateId[@root = '1.3.6.1.4.1.19376.1.5.3.1.4.5']]]/hl7:observation[hl7:templateId[@root = '1.2.40.0.34.6.0.11.3.9'] and hl7:templateId[@root = '2.16.840.1.113883.10.20.1.28'] and hl7:templateId[@root = '1.3.6.1.4.1.19376.1.5.3.1.4.5']]/hl7:entryRelationship[hl7:act[hl7:templateId[@root = '1.2.40.0.34.6.0.11.3.11'] and hl7:templateId[@root = '2.16.840.1.113883.10.20.1.40'] and hl7:templateId[@root = '1.3.6.1.4.1.19376.1.5.3.1.4.2']]]">
      <assert role="error"
              see="http://elga.art-decor.org/elgaimpf-html-20250116T125121/tmp-1.2.40.0.34.6.0.11.3.9-2019-05-20T081225.html"
              test="string(@typeCode) = ('COMP')">(eimpf_entry_ImpfrelevanteErkrankungProblemEntry): Der Wert von typeCode MUSS 'COMP' sein. Gefunden: "<value-of select="@typeCode"/>"</assert>
      <assert role="error"
              see="http://elga.art-decor.org/elgaimpf-html-20250116T125121/tmp-1.2.40.0.34.6.0.11.3.9-2019-05-20T081225.html"
              test="string(@contextConductionInd) = ('true') or not(@contextConductionInd)">(eimpf_entry_ImpfrelevanteErkrankungProblemEntry): Der Wert von contextConductionInd MUSS 'true' sein. Gefunden: "<value-of select="@contextConductionInd"/>"</assert>
   </rule>
</pattern>
