<?xml version="1.0" encoding="UTF-8"?>
<!--
Template derived pattern
===========================================
ID: 1.2.40.0.34.6.0.11.3.2
Name: Immunization Target Entry
Description: 
                 Immunisierung gegen eine bestimmte Krankheit oder einen Erreger (Impfziel). 
            
-->
<pattern xmlns="http://purl.oclc.org/dsdl/schematron"
         id="template-1.2.40.0.34.6.0.11.3.2-2023-06-06T145012">
   <title>Immunization Target Entry</title>
   <!--
Template derived rules for ID: 1.2.40.0.34.6.0.11.3.2
Context: *[hl7:observation[hl7:templateId[@root = '1.2.40.0.34.6.0.11.3.2']]]
Item: (atcdabbr_entry_ImmunizationTarget)
-->

   <!--
Template derived rules for ID: 1.2.40.0.34.6.0.11.3.2
Context: *[hl7:observation[hl7:templateId[@root = '1.2.40.0.34.6.0.11.3.2']]]/hl7:observation[hl7:templateId[@root = '1.2.40.0.34.6.0.11.3.2']]
Item: (atcdabbr_entry_ImmunizationTarget)
-->

   <rule fpi="RULC-1"
         context="*[hl7:observation[hl7:templateId[@root = '1.2.40.0.34.6.0.11.3.2']]]/hl7:observation[hl7:templateId[@root = '1.2.40.0.34.6.0.11.3.2']]"
         id="d42e42767-false-d1929200e0">
      <assert role="error"
              see="https://elga.art-decor.org/elgabgd-html-20250116T125424/tmp-1.2.40.0.34.6.0.11.3.2-2023-06-06T145012.html"
              test="string(@classCode) = ('OBS')">(atcdabbr_entry_ImmunizationTarget): Der Wert von classCode MUSS 'OBS' sein. Gefunden: "<value-of select="@classCode"/>"</assert>
      <assert role="error"
              see="https://elga.art-decor.org/elgabgd-html-20250116T125424/tmp-1.2.40.0.34.6.0.11.3.2-2023-06-06T145012.html"
              test="string(@moodCode) = ('EVN')">(atcdabbr_entry_ImmunizationTarget): Der Wert von moodCode MUSS 'EVN' sein. Gefunden: "<value-of select="@moodCode"/>"</assert>
      <assert role="error"
              see="https://elga.art-decor.org/elgabgd-html-20250116T125424/tmp-1.2.40.0.34.6.0.11.3.2-2023-06-06T145012.html"
              test="count(hl7:templateId[@root = '1.2.40.0.34.6.0.11.3.2']) &gt;= 1">(atcdabbr_entry_ImmunizationTarget): Element hl7:templateId[@root = '1.2.40.0.34.6.0.11.3.2'] ist mandatory [min 1x].</assert>
      <assert role="error"
              see="https://elga.art-decor.org/elgabgd-html-20250116T125424/tmp-1.2.40.0.34.6.0.11.3.2-2023-06-06T145012.html"
              test="count(hl7:templateId[@root = '1.2.40.0.34.6.0.11.3.2']) &lt;= 1">(atcdabbr_entry_ImmunizationTarget): Element hl7:templateId[@root = '1.2.40.0.34.6.0.11.3.2'] kommt zu häufig vor [max 1x].</assert>
      <assert role="error"
              see="https://elga.art-decor.org/elgabgd-html-20250116T125424/tmp-1.2.40.0.34.6.0.11.3.2-2023-06-06T145012.html"
              test="count(hl7:code[concat(@code, @codeSystem) = doc('include/voc-1.2.40.0.34.6.0.10.4-DYNAMIC.xml')//valueSet[1]/conceptList/concept/concat(@code, @codeSystem)]) &gt;= 1">(atcdabbr_entry_ImmunizationTarget): Element hl7:code[concat(@code, @codeSystem) = doc('include/voc-1.2.40.0.34.6.0.10.4-DYNAMIC.xml')//valueSet[1]/conceptList/concept/concat(@code, @codeSystem)] ist mandatory [min 1x].</assert>
      <assert role="error"
              see="https://elga.art-decor.org/elgabgd-html-20250116T125424/tmp-1.2.40.0.34.6.0.11.3.2-2023-06-06T145012.html"
              test="count(hl7:code[concat(@code, @codeSystem) = doc('include/voc-1.2.40.0.34.6.0.10.4-DYNAMIC.xml')//valueSet[1]/conceptList/concept/concat(@code, @codeSystem)]) &lt;= 1">(atcdabbr_entry_ImmunizationTarget): Element hl7:code[concat(@code, @codeSystem) = doc('include/voc-1.2.40.0.34.6.0.10.4-DYNAMIC.xml')//valueSet[1]/conceptList/concept/concat(@code, @codeSystem)] kommt zu häufig vor [max 1x].</assert>
      <assert role="error"
              see="https://elga.art-decor.org/elgabgd-html-20250116T125424/tmp-1.2.40.0.34.6.0.11.3.2-2023-06-06T145012.html"
              test="count(hl7:text[not(@nullFlavor)]) &gt;= 1">(atcdabbr_entry_ImmunizationTarget): Element hl7:text[not(@nullFlavor)] ist mandatory [min 1x].</assert>
      <assert role="error"
              see="https://elga.art-decor.org/elgabgd-html-20250116T125424/tmp-1.2.40.0.34.6.0.11.3.2-2023-06-06T145012.html"
              test="count(hl7:text[not(@nullFlavor)]) &lt;= 1">(atcdabbr_entry_ImmunizationTarget): Element hl7:text[not(@nullFlavor)] kommt zu häufig vor [max 1x].</assert>
      <assert role="error"
              see="https://elga.art-decor.org/elgabgd-html-20250116T125424/tmp-1.2.40.0.34.6.0.11.3.2-2023-06-06T145012.html"
              test="count(hl7:statusCode[@code = 'completed']) &gt;= 1">(atcdabbr_entry_ImmunizationTarget): Element hl7:statusCode[@code = 'completed'] ist mandatory [min 1x].</assert>
      <assert role="error"
              see="https://elga.art-decor.org/elgabgd-html-20250116T125424/tmp-1.2.40.0.34.6.0.11.3.2-2023-06-06T145012.html"
              test="count(hl7:statusCode[@code = 'completed']) &lt;= 1">(atcdabbr_entry_ImmunizationTarget): Element hl7:statusCode[@code = 'completed'] kommt zu häufig vor [max 1x].</assert>
   </rule>
   <!--
Template derived rules for ID: 1.2.40.0.34.6.0.11.3.2
Context: *[hl7:observation[hl7:templateId[@root = '1.2.40.0.34.6.0.11.3.2']]]/hl7:observation[hl7:templateId[@root = '1.2.40.0.34.6.0.11.3.2']]/hl7:templateId[@root = '1.2.40.0.34.6.0.11.3.2']
Item: (atcdabbr_entry_ImmunizationTarget)
-->

   <rule fpi="RULC-1"
         context="*[hl7:observation[hl7:templateId[@root = '1.2.40.0.34.6.0.11.3.2']]]/hl7:observation[hl7:templateId[@root = '1.2.40.0.34.6.0.11.3.2']]/hl7:templateId[@root = '1.2.40.0.34.6.0.11.3.2']"
         id="d42e42782-false-d1929264e0">
      <extends rule="II"/>
      <assert role="error"
              see="https://elga.art-decor.org/elgabgd-html-20250116T125424/tmp-1.2.40.0.34.6.0.11.3.2-2023-06-06T145012.html"
              test="empty(@xsi:type) or resolve-QName(@xsi:type, .) = QName('urn:hl7-org:v3', 'II')">(atcdabbr_entry_ImmunizationTarget): Wenn eine @xsi:type Instruktion anwesend ist MUSS diese den Wert "{urn:hl7-org:v3}:II" haben. Gefunden "{<value-of select="namespace-uri-from-QName(resolve-QName(@xsi:type,.))"/>}:<value-of select="local-name-from-QName(resolve-QName(@xsi:type,.))"/>"</assert>
      <assert role="error"
              see="https://elga.art-decor.org/elgabgd-html-20250116T125424/tmp-1.2.40.0.34.6.0.11.3.2-2023-06-06T145012.html"
              test="string(@root) = ('1.2.40.0.34.6.0.11.3.2')">(atcdabbr_entry_ImmunizationTarget): Der Wert von root MUSS '1.2.40.0.34.6.0.11.3.2' sein. Gefunden: "<value-of select="@root"/>"</assert>
   </rule>
   <!--
Template derived rules for ID: 1.2.40.0.34.6.0.11.3.2
Context: *[hl7:observation[hl7:templateId[@root = '1.2.40.0.34.6.0.11.3.2']]]/hl7:observation[hl7:templateId[@root = '1.2.40.0.34.6.0.11.3.2']]/hl7:id
Item: (atcdabbr_entry_ImmunizationTarget)
-->

   <rule fpi="RULC-1"
         context="*[hl7:observation[hl7:templateId[@root = '1.2.40.0.34.6.0.11.3.2']]]/hl7:observation[hl7:templateId[@root = '1.2.40.0.34.6.0.11.3.2']]/hl7:id"
         id="d42e42790-false-d1929278e0">
      <extends rule="II"/>
      <assert role="error"
              see="https://elga.art-decor.org/elgabgd-html-20250116T125424/tmp-1.2.40.0.34.6.0.11.3.2-2023-06-06T145012.html"
              test="empty(@xsi:type) or resolve-QName(@xsi:type, .) = QName('urn:hl7-org:v3', 'II')">(atcdabbr_entry_ImmunizationTarget): Wenn eine @xsi:type Instruktion anwesend ist MUSS diese den Wert "{urn:hl7-org:v3}:II" haben. Gefunden "{<value-of select="namespace-uri-from-QName(resolve-QName(@xsi:type,.))"/>}:<value-of select="local-name-from-QName(resolve-QName(@xsi:type,.))"/>"</assert>
   </rule>
   <!--
Template derived rules for ID: 1.2.40.0.34.6.0.11.3.2
Context: *[hl7:observation[hl7:templateId[@root = '1.2.40.0.34.6.0.11.3.2']]]/hl7:observation[hl7:templateId[@root = '1.2.40.0.34.6.0.11.3.2']]/hl7:code[concat(@code, @codeSystem) = doc('include/voc-1.2.40.0.34.6.0.10.4-DYNAMIC.xml')//valueSet[1]/conceptList/concept/concat(@code, @codeSystem)]
Item: (atcdabbr_entry_ImmunizationTarget)
-->

   <rule fpi="RULC-1"
         context="*[hl7:observation[hl7:templateId[@root = '1.2.40.0.34.6.0.11.3.2']]]/hl7:observation[hl7:templateId[@root = '1.2.40.0.34.6.0.11.3.2']]/hl7:code[concat(@code, @codeSystem) = doc('include/voc-1.2.40.0.34.6.0.10.4-DYNAMIC.xml')//valueSet[1]/conceptList/concept/concat(@code, @codeSystem)]"
         id="d42e42797-false-d1929291e0">
      <extends rule="CE"/>
      <assert role="error"
              see="https://elga.art-decor.org/elgabgd-html-20250116T125424/tmp-1.2.40.0.34.6.0.11.3.2-2023-06-06T145012.html"
              test="empty(@xsi:type) or resolve-QName(@xsi:type, .) = QName('urn:hl7-org:v3', 'CE')">(atcdabbr_entry_ImmunizationTarget): Wenn eine @xsi:type Instruktion anwesend ist MUSS diese den Wert "{urn:hl7-org:v3}:CE" haben. Gefunden "{<value-of select="namespace-uri-from-QName(resolve-QName(@xsi:type,.))"/>}:<value-of select="local-name-from-QName(resolve-QName(@xsi:type,.))"/>"</assert>
      <let name="theCode" value="@code"/>
      <let name="theCodeSystem" value="@codeSystem"/>
      <assert role="error"
              see="https://elga.art-decor.org/elgabgd-html-20250116T125424/tmp-1.2.40.0.34.6.0.11.3.2-2023-06-06T145012.html"
              test="@nullFlavor or exists(doc('include/voc-1.2.40.0.34.6.0.10.4-DYNAMIC.xml')//valueSet[1][conceptList/concept[@code = $theCode][@codeSystem = $theCodeSystem]])">(atcdabbr_entry_ImmunizationTarget): Der Elementinhalt MUSS einer von '1.2.40.0.34.6.0.10.4 eImpf_ImmunizationTarget (DYNAMIC)' sein.</assert>
      <assert role="error"
              see="https://elga.art-decor.org/elgabgd-html-20250116T125424/tmp-1.2.40.0.34.6.0.11.3.2-2023-06-06T145012.html"
              test="@code">(atcdabbr_entry_ImmunizationTarget): Attribut @code MUSS vorkommen.</assert>
      <assert role="error"
              see="https://elga.art-decor.org/elgabgd-html-20250116T125424/tmp-1.2.40.0.34.6.0.11.3.2-2023-06-06T145012.html"
              test="not(@code) or (string-length(@code) &gt; 0 and not(matches(@code,'\s')))">(atcdabbr_entry_ImmunizationTarget): Attribute @code MUSS vom Datentyp 'cs' sein  - '<value-of select="@code"/>'</assert>
      <assert role="error"
              see="https://elga.art-decor.org/elgabgd-html-20250116T125424/tmp-1.2.40.0.34.6.0.11.3.2-2023-06-06T145012.html"
              test="@codeSystem">(atcdabbr_entry_ImmunizationTarget): Attribut @codeSystem MUSS vorkommen.</assert>
      <assert role="error"
              see="https://elga.art-decor.org/elgabgd-html-20250116T125424/tmp-1.2.40.0.34.6.0.11.3.2-2023-06-06T145012.html"
              test="not(@codeSystem) or matches(@codeSystem,'^[0-2](\.(0|[1-9]\d*))*$')">(atcdabbr_entry_ImmunizationTarget): Attribute @codeSystem MUSS vom Datentyp 'oid' sein  - '<value-of select="@codeSystem"/>'</assert>
      <assert role="error"
              see="https://elga.art-decor.org/elgabgd-html-20250116T125424/tmp-1.2.40.0.34.6.0.11.3.2-2023-06-06T145012.html"
              test="not(@codeSystemName) or string-length(@codeSystemName)&gt;0">(atcdabbr_entry_ImmunizationTarget): Attribute @codeSystemName MUSS vom Datentyp 'st' sein  - '<value-of select="@codeSystemName"/>'</assert>
      <assert role="error"
              see="https://elga.art-decor.org/elgabgd-html-20250116T125424/tmp-1.2.40.0.34.6.0.11.3.2-2023-06-06T145012.html"
              test="not(@displayName) or string-length(@displayName)&gt;0">(atcdabbr_entry_ImmunizationTarget): Attribute @displayName MUSS vom Datentyp 'st' sein  - '<value-of select="@displayName"/>'</assert>
   </rule>
   <!--
Template derived rules for ID: 1.2.40.0.34.6.0.11.9.1
Context: *[hl7:observation[hl7:templateId[@root = '1.2.40.0.34.6.0.11.3.2']]]/hl7:observation[hl7:templateId[@root = '1.2.40.0.34.6.0.11.3.2']]/hl7:text
Item: (atcdabrr_other_NarrativeTextReference)
-->

   <rule fpi="RULC-1"
         context="*[hl7:observation[hl7:templateId[@root = '1.2.40.0.34.6.0.11.3.2']]]/hl7:observation[hl7:templateId[@root = '1.2.40.0.34.6.0.11.3.2']]/hl7:text"
         id="d1929292e89-false-d1929328e0">
      <extends rule="ED"/>
      <assert role="error"
              see="https://elga.art-decor.org/elgabgd-html-20250116T125424/tmp-1.2.40.0.34.6.0.11.9.1-2021-05-06T093820.html"
              test="empty(@xsi:type) or resolve-QName(@xsi:type, .) = QName('urn:hl7-org:v3', 'ED')">(atcdabrr_other_NarrativeTextReference): Wenn eine @xsi:type Instruktion anwesend ist MUSS diese den Wert "{urn:hl7-org:v3}:ED" haben. Gefunden "{<value-of select="namespace-uri-from-QName(resolve-QName(@xsi:type,.))"/>}:<value-of select="local-name-from-QName(resolve-QName(@xsi:type,.))"/>"</assert>
      <assert role="error"
              see="https://elga.art-decor.org/elgabgd-html-20250116T125424/tmp-1.2.40.0.34.6.0.11.9.1-2021-05-06T093820.html"
              test="count(hl7:reference[not(@nullFlavor)]) &gt;= 1">(atcdabrr_other_NarrativeTextReference): Element hl7:reference[not(@nullFlavor)] ist mandatory [min 1x].</assert>
      <assert role="error"
              see="https://elga.art-decor.org/elgabgd-html-20250116T125424/tmp-1.2.40.0.34.6.0.11.9.1-2021-05-06T093820.html"
              test="count(hl7:reference[not(@nullFlavor)]) &lt;= 1">(atcdabrr_other_NarrativeTextReference): Element hl7:reference[not(@nullFlavor)] kommt zu häufig vor [max 1x].</assert>
   </rule>
   <!--
Template derived rules for ID: 1.2.40.0.34.6.0.11.9.1
Context: *[hl7:observation[hl7:templateId[@root = '1.2.40.0.34.6.0.11.3.2']]]/hl7:observation[hl7:templateId[@root = '1.2.40.0.34.6.0.11.3.2']]/hl7:text/hl7:reference[not(@nullFlavor)]
Item: (atcdabrr_other_NarrativeTextReference)
-->

   <rule fpi="RULC-1"
         context="*[hl7:observation[hl7:templateId[@root = '1.2.40.0.34.6.0.11.3.2']]]/hl7:observation[hl7:templateId[@root = '1.2.40.0.34.6.0.11.3.2']]/hl7:text/hl7:reference[not(@nullFlavor)]"
         id="d1929292e91-false-d1929347e0">
      <extends rule="TEL"/>
      <assert role="error"
              see="https://elga.art-decor.org/elgabgd-html-20250116T125424/tmp-1.2.40.0.34.6.0.11.9.1-2021-05-06T093820.html"
              test="empty(@xsi:type) or resolve-QName(@xsi:type, .) = QName('urn:hl7-org:v3', 'TEL')">(atcdabrr_other_NarrativeTextReference): Wenn eine @xsi:type Instruktion anwesend ist MUSS diese den Wert "{urn:hl7-org:v3}:TEL" haben. Gefunden "{<value-of select="namespace-uri-from-QName(resolve-QName(@xsi:type,.))"/>}:<value-of select="local-name-from-QName(resolve-QName(@xsi:type,.))"/>"</assert>
      <assert role="error"
              see="https://elga.art-decor.org/elgabgd-html-20250116T125424/tmp-1.2.40.0.34.6.0.11.9.1-2021-05-06T093820.html"
              test="@value">(atcdabrr_other_NarrativeTextReference): Attribut @value MUSS vorkommen.</assert>
      <assert role="error"
              see="https://elga.art-decor.org/elgabgd-html-20250116T125424/tmp-1.2.40.0.34.6.0.11.9.1-2021-05-06T093820.html"
              test="starts-with(@value,'#') or starts-with(@value,'http')">(atcdabrr_other_NarrativeTextReference): The @value attribute content MUST conform to the format '#xxx', where xxx is the ID of the corresponding 'content'-element, or begin with the 'http' or 'https' url-scheme.</assert>
   </rule>
   <!--
Template derived rules for ID: 1.2.40.0.34.6.0.11.3.2
Context: *[hl7:observation[hl7:templateId[@root = '1.2.40.0.34.6.0.11.3.2']]]/hl7:observation[hl7:templateId[@root = '1.2.40.0.34.6.0.11.3.2']]/hl7:statusCode[@code = 'completed']
Item: (atcdabbr_entry_ImmunizationTarget)
-->

   <rule fpi="RULC-1"
         context="*[hl7:observation[hl7:templateId[@root = '1.2.40.0.34.6.0.11.3.2']]]/hl7:observation[hl7:templateId[@root = '1.2.40.0.34.6.0.11.3.2']]/hl7:statusCode[@code = 'completed']"
         id="d42e42818-false-d1929362e0">
      <extends rule="CS"/>
      <assert role="error"
              see="https://elga.art-decor.org/elgabgd-html-20250116T125424/tmp-1.2.40.0.34.6.0.11.3.2-2023-06-06T145012.html"
              test="empty(@xsi:type) or resolve-QName(@xsi:type, .) = QName('urn:hl7-org:v3', 'CS')">(atcdabbr_entry_ImmunizationTarget): Wenn eine @xsi:type Instruktion anwesend ist MUSS diese den Wert "{urn:hl7-org:v3}:CS" haben. Gefunden "{<value-of select="namespace-uri-from-QName(resolve-QName(@xsi:type,.))"/>}:<value-of select="local-name-from-QName(resolve-QName(@xsi:type,.))"/>"</assert>
      <assert role="error"
              see="https://elga.art-decor.org/elgabgd-html-20250116T125424/tmp-1.2.40.0.34.6.0.11.3.2-2023-06-06T145012.html"
              test="string(@code) = ('completed')">(atcdabbr_entry_ImmunizationTarget): Der Wert von code MUSS 'completed' sein. Gefunden: "<value-of select="@code"/>"</assert>
   </rule>
</pattern>
