<?xml version="1.0" encoding="UTF-8"?>
<!--
Template derived pattern
===========================================
ID: 1.2.40.0.34.11.2.2.21
Name: Medikation bei Einweisung (full)
Description: 
-->
<pattern xmlns="http://purl.oclc.org/dsdl/schematron"
         id="template-1.2.40.0.34.11.2.2.21-2013-11-12T000000">
   <title>Medikation bei Einweisung (full)</title>
   <!--
Template derived rules for ID: 1.2.40.0.34.11.2.2.21
Context: *[hl7:section[hl7:templateId[@root = '1.2.40.0.34.11.2.2.21'] and hl7:templateId[@root = '1.3.6.1.4.1.19376.1.5.3.1.3.20']]]
Item: (MedikationEinweisungFull)
-->

   <!--
Template derived rules for ID: 1.2.40.0.34.11.2.2.21
Context: *[hl7:section[hl7:templateId[@root = '1.2.40.0.34.11.2.2.21'] and hl7:templateId[@root = '1.3.6.1.4.1.19376.1.5.3.1.3.20']]]/hl7:section[hl7:templateId[@root = '1.2.40.0.34.11.2.2.21'] and hl7:templateId[@root = '1.3.6.1.4.1.19376.1.5.3.1.3.20']]
Item: (MedikationEinweisungFull)
-->

   <rule fpi="RULC-1"
         context="*[hl7:section[hl7:templateId[@root = '1.2.40.0.34.11.2.2.21'] and hl7:templateId[@root = '1.3.6.1.4.1.19376.1.5.3.1.3.20']]]/hl7:section[hl7:templateId[@root = '1.2.40.0.34.11.2.2.21'] and hl7:templateId[@root = '1.3.6.1.4.1.19376.1.5.3.1.3.20']]"
         id="d42e9231-false-d175070e0">
      <assert role="error"
              see="http://elga.art-decor.org/elga-html-20230508T144915/tmp-1.2.40.0.34.11.2.2.21-2013-11-12T000000.html"
              test="count(hl7:templateId[@root = '1.2.40.0.34.11.2.2.21']) &gt;= 1">(MedikationEinweisungFull): Element hl7:templateId[@root = '1.2.40.0.34.11.2.2.21'] ist required [min 1x].</assert>
      <assert role="error"
              see="http://elga.art-decor.org/elga-html-20230508T144915/tmp-1.2.40.0.34.11.2.2.21-2013-11-12T000000.html"
              test="count(hl7:templateId[@root = '1.2.40.0.34.11.2.2.21']) &lt;= 1">(MedikationEinweisungFull): Element hl7:templateId[@root = '1.2.40.0.34.11.2.2.21'] kommt zu häufig vor [max 1x].</assert>
      <assert role="error"
              see="http://elga.art-decor.org/elga-html-20230508T144915/tmp-1.2.40.0.34.11.2.2.21-2013-11-12T000000.html"
              test="count(hl7:templateId[@root = '1.3.6.1.4.1.19376.1.5.3.1.3.20']) &gt;= 1">(MedikationEinweisungFull): Element hl7:templateId[@root = '1.3.6.1.4.1.19376.1.5.3.1.3.20'] ist required [min 1x].</assert>
      <assert role="error"
              see="http://elga.art-decor.org/elga-html-20230508T144915/tmp-1.2.40.0.34.11.2.2.21-2013-11-12T000000.html"
              test="count(hl7:templateId[@root = '1.3.6.1.4.1.19376.1.5.3.1.3.20']) &lt;= 1">(MedikationEinweisungFull): Element hl7:templateId[@root = '1.3.6.1.4.1.19376.1.5.3.1.3.20'] kommt zu häufig vor [max 1x].</assert>
      <assert role="error"
              see="http://elga.art-decor.org/elga-html-20230508T144915/tmp-1.2.40.0.34.11.2.2.21-2013-11-12T000000.html"
              test="count(hl7:code[(@code = '42346-7' and @codeSystem = '2.16.840.1.113883.6.1')]) &gt;= 1">(MedikationEinweisungFull): Element hl7:code[(@code = '42346-7' and @codeSystem = '2.16.840.1.113883.6.1')] ist mandatory [min 1x].</assert>
      <assert role="error"
              see="http://elga.art-decor.org/elga-html-20230508T144915/tmp-1.2.40.0.34.11.2.2.21-2013-11-12T000000.html"
              test="count(hl7:code[(@code = '42346-7' and @codeSystem = '2.16.840.1.113883.6.1')]) &lt;= 1">(MedikationEinweisungFull): Element hl7:code[(@code = '42346-7' and @codeSystem = '2.16.840.1.113883.6.1')] kommt zu häufig vor [max 1x].</assert>
      <assert role="error"
              see="http://elga.art-decor.org/elga-html-20230508T144915/tmp-1.2.40.0.34.11.2.2.21-2013-11-12T000000.html"
              test="count(hl7:title) &gt;= 1">(MedikationEinweisungFull): Element hl7:title ist required [min 1x].</assert>
      <assert role="error"
              see="http://elga.art-decor.org/elga-html-20230508T144915/tmp-1.2.40.0.34.11.2.2.21-2013-11-12T000000.html"
              test="count(hl7:title) &lt;= 1">(MedikationEinweisungFull): Element hl7:title kommt zu häufig vor [max 1x].</assert>
      <assert role="error"
              see="http://elga.art-decor.org/elga-html-20230508T144915/tmp-1.2.40.0.34.11.2.2.21-2013-11-12T000000.html"
              test="count(hl7:text) &gt;= 1">(MedikationEinweisungFull): Element hl7:text ist required [min 1x].</assert>
      <assert role="error"
              see="http://elga.art-decor.org/elga-html-20230508T144915/tmp-1.2.40.0.34.11.2.2.21-2013-11-12T000000.html"
              test="count(hl7:text) &lt;= 1">(MedikationEinweisungFull): Element hl7:text kommt zu häufig vor [max 1x].</assert>
      <let name="elmcount"
           value="count(hl7:entry[hl7:substanceAdministration[hl7:templateId[@root = '1.2.40.0.34.11.2.3.2'] and hl7:templateId[@root = '2.16.840.1.113883.10.20.1.24'] and hl7:templateId[@root = '1.3.6.1.4.1.19376.1.5.3.1.4.7'] and hl7:templateId[@root = '1.3.6.1.4.1.19376.1.9.1.3.2']]] | hl7:entry[hl7:supply[hl7:templateId[@root = '1.2.40.0.34.11.2.3.3'] and hl7:templateId[@root = '2.16.840.1.113883.10.20.1.34'] and hl7:templateId[@root = '1.3.6.1.4.1.19376.1.5.3.1.4.7.3'] and hl7:templateId[@root = '1.3.6.1.4.1.19376.1.9.1.3.4']]])"/>
      <assert role="error"
              see="http://elga.art-decor.org/elga-html-20230508T144915/tmp-1.2.40.0.34.11.2.2.21-2013-11-12T000000.html"
              test="$elmcount &gt;= 1">(MedikationEinweisungFull): Auswahl (hl7:entry[hl7:substanceAdministration[hl7:templateId[@root = '1.2.40.0.34.11.2.3.2'] and hl7:templateId[@root = '2.16.840.1.113883.10.20.1.24'] and hl7:templateId[@root = '1.3.6.1.4.1.19376.1.5.3.1.4.7'] and hl7:templateId[@root = '1.3.6.1.4.1.19376.1.9.1.3.2']]]  oder  hl7:entry[hl7:supply[hl7:templateId[@root = '1.2.40.0.34.11.2.3.3'] and hl7:templateId[@root = '2.16.840.1.113883.10.20.1.34'] and hl7:templateId[@root = '1.3.6.1.4.1.19376.1.5.3.1.4.7.3'] and hl7:templateId[@root = '1.3.6.1.4.1.19376.1.9.1.3.4']]]) enthält nicht genügend Elemente [min 1x]</assert>
   </rule>
   <!--
Template derived rules for ID: 1.2.40.0.34.11.2.2.21
Context: *[hl7:section[hl7:templateId[@root = '1.2.40.0.34.11.2.2.21'] and hl7:templateId[@root = '1.3.6.1.4.1.19376.1.5.3.1.3.20']]]/hl7:section[hl7:templateId[@root = '1.2.40.0.34.11.2.2.21'] and hl7:templateId[@root = '1.3.6.1.4.1.19376.1.5.3.1.3.20']]/hl7:templateId[@root = '1.2.40.0.34.11.2.2.21']
Item: (MedikationEinweisungFull)
-->

   <rule fpi="RULC-1"
         context="*[hl7:section[hl7:templateId[@root = '1.2.40.0.34.11.2.2.21'] and hl7:templateId[@root = '1.3.6.1.4.1.19376.1.5.3.1.3.20']]]/hl7:section[hl7:templateId[@root = '1.2.40.0.34.11.2.2.21'] and hl7:templateId[@root = '1.3.6.1.4.1.19376.1.5.3.1.3.20']]/hl7:templateId[@root = '1.2.40.0.34.11.2.2.21']"
         id="d42e9235-false-d175222e0">
      <extends rule="II"/>
      <assert role="error"
              see="http://elga.art-decor.org/elga-html-20230508T144915/tmp-1.2.40.0.34.11.2.2.21-2013-11-12T000000.html"
              test="empty(@xsi:type) or resolve-QName(@xsi:type, .) = QName('urn:hl7-org:v3', 'II')">(MedikationEinweisungFull): Wenn eine @xsi:type Instruktion anwesend ist MUSS diese den Wert "{urn:hl7-org:v3}:II" haben. Gefunden "{<value-of select="namespace-uri-from-QName(resolve-QName(@xsi:type,.))"/>}:<value-of select="local-name-from-QName(resolve-QName(@xsi:type,.))"/>"</assert>
      <assert role="error"
              see="http://elga.art-decor.org/elga-html-20230508T144915/tmp-1.2.40.0.34.11.2.2.21-2013-11-12T000000.html"
              test="string(@root) = ('1.2.40.0.34.11.2.2.21')">(MedikationEinweisungFull): Der Wert von root MUSS '1.2.40.0.34.11.2.2.21' sein. Gefunden: "<value-of select="@root"/>"</assert>
   </rule>
   <!--
Template derived rules for ID: 1.2.40.0.34.11.2.2.21
Context: *[hl7:section[hl7:templateId[@root = '1.2.40.0.34.11.2.2.21'] and hl7:templateId[@root = '1.3.6.1.4.1.19376.1.5.3.1.3.20']]]/hl7:section[hl7:templateId[@root = '1.2.40.0.34.11.2.2.21'] and hl7:templateId[@root = '1.3.6.1.4.1.19376.1.5.3.1.3.20']]/hl7:templateId[@root = '1.3.6.1.4.1.19376.1.5.3.1.3.20']
Item: (MedikationEinweisungFull)
-->

   <rule fpi="RULC-1"
         context="*[hl7:section[hl7:templateId[@root = '1.2.40.0.34.11.2.2.21'] and hl7:templateId[@root = '1.3.6.1.4.1.19376.1.5.3.1.3.20']]]/hl7:section[hl7:templateId[@root = '1.2.40.0.34.11.2.2.21'] and hl7:templateId[@root = '1.3.6.1.4.1.19376.1.5.3.1.3.20']]/hl7:templateId[@root = '1.3.6.1.4.1.19376.1.5.3.1.3.20']"
         id="d42e9240-false-d175237e0">
      <extends rule="II"/>
      <assert role="error"
              see="http://elga.art-decor.org/elga-html-20230508T144915/tmp-1.2.40.0.34.11.2.2.21-2013-11-12T000000.html"
              test="empty(@xsi:type) or resolve-QName(@xsi:type, .) = QName('urn:hl7-org:v3', 'II')">(MedikationEinweisungFull): Wenn eine @xsi:type Instruktion anwesend ist MUSS diese den Wert "{urn:hl7-org:v3}:II" haben. Gefunden "{<value-of select="namespace-uri-from-QName(resolve-QName(@xsi:type,.))"/>}:<value-of select="local-name-from-QName(resolve-QName(@xsi:type,.))"/>"</assert>
      <assert role="error"
              see="http://elga.art-decor.org/elga-html-20230508T144915/tmp-1.2.40.0.34.11.2.2.21-2013-11-12T000000.html"
              test="string(@root) = ('1.3.6.1.4.1.19376.1.5.3.1.3.20')">(MedikationEinweisungFull): Der Wert von root MUSS '1.3.6.1.4.1.19376.1.5.3.1.3.20' sein. Gefunden: "<value-of select="@root"/>"</assert>
   </rule>
   <!--
Template derived rules for ID: 1.2.40.0.34.11.30005
Context: *[hl7:section[hl7:templateId[@root = '1.2.40.0.34.11.2.2.21'] and hl7:templateId[@root = '1.3.6.1.4.1.19376.1.5.3.1.3.20']]]/hl7:section[hl7:templateId[@root = '1.2.40.0.34.11.2.2.21'] and hl7:templateId[@root = '1.3.6.1.4.1.19376.1.5.3.1.3.20']]/hl7:code[(@code = '42346-7' and @codeSystem = '2.16.840.1.113883.6.1')]
Item: (MedikationEinweisungAlleEIS)
-->

   <rule fpi="RULC-1"
         context="*[hl7:section[hl7:templateId[@root = '1.2.40.0.34.11.2.2.21'] and hl7:templateId[@root = '1.3.6.1.4.1.19376.1.5.3.1.3.20']]]/hl7:section[hl7:templateId[@root = '1.2.40.0.34.11.2.2.21'] and hl7:templateId[@root = '1.3.6.1.4.1.19376.1.5.3.1.3.20']]/hl7:code[(@code = '42346-7' and @codeSystem = '2.16.840.1.113883.6.1')]"
         id="d175238e112-false-d175253e0">
      <extends rule="CE"/>
      <assert role="error"
              see="http://elga.art-decor.org/elga-html-20230508T144915/tmp-1.2.40.0.34.11.30005-2011-12-19T000000.html"
              test="empty(@xsi:type) or resolve-QName(@xsi:type, .) = QName('urn:hl7-org:v3', 'CE')">(MedikationEinweisungAlleEIS): Wenn eine @xsi:type Instruktion anwesend ist MUSS diese den Wert "{urn:hl7-org:v3}:CE" haben. Gefunden "{<value-of select="namespace-uri-from-QName(resolve-QName(@xsi:type,.))"/>}:<value-of select="local-name-from-QName(resolve-QName(@xsi:type,.))"/>"</assert>
      <assert role="error"
              see="http://elga.art-decor.org/elga-html-20230508T144915/tmp-1.2.40.0.34.11.30005-2011-12-19T000000.html"
              test="@nullFlavor or (@code='42346-7' and @codeSystem='2.16.840.1.113883.6.1')">(MedikationEinweisungAlleEIS): Der Elementinhalt MUSS einer von 'code '42346-7' codeSystem '2.16.840.1.113883.6.1'' sein.</assert>
   </rule>
   <!--
Template derived rules for ID: 1.2.40.0.34.11.30005
Context: *[hl7:section[hl7:templateId[@root = '1.2.40.0.34.11.2.2.21'] and hl7:templateId[@root = '1.3.6.1.4.1.19376.1.5.3.1.3.20']]]/hl7:section[hl7:templateId[@root = '1.2.40.0.34.11.2.2.21'] and hl7:templateId[@root = '1.3.6.1.4.1.19376.1.5.3.1.3.20']]/hl7:title
Item: (MedikationEinweisungAlleEIS)
-->

   <rule fpi="RULC-1"
         context="*[hl7:section[hl7:templateId[@root = '1.2.40.0.34.11.2.2.21'] and hl7:templateId[@root = '1.3.6.1.4.1.19376.1.5.3.1.3.20']]]/hl7:section[hl7:templateId[@root = '1.2.40.0.34.11.2.2.21'] and hl7:templateId[@root = '1.3.6.1.4.1.19376.1.5.3.1.3.20']]/hl7:title"
         id="d175238e118-false-d175269e0">
      <extends rule="ST"/>
      <assert role="error"
              see="http://elga.art-decor.org/elga-html-20230508T144915/tmp-1.2.40.0.34.11.30005-2011-12-19T000000.html"
              test="empty(@xsi:type) or resolve-QName(@xsi:type, .) = QName('urn:hl7-org:v3', 'ST')">(MedikationEinweisungAlleEIS): Wenn eine @xsi:type Instruktion anwesend ist MUSS diese den Wert "{urn:hl7-org:v3}:ST" haben. Gefunden "{<value-of select="namespace-uri-from-QName(resolve-QName(@xsi:type,.))"/>}:<value-of select="local-name-from-QName(resolve-QName(@xsi:type,.))"/>"</assert>
      <assert role="error"
              see="http://elga.art-decor.org/elga-html-20230508T144915/tmp-1.2.40.0.34.11.30005-2011-12-19T000000.html"
              test="text()='Medikation bei Einweisung'">(MedikationEinweisungAlleEIS): Der Elementinhalt von 'hl7:title' MUSS ''Medikation bei Einweisung'' sein. Gefunden: "<value-of select="."/>"</assert>
   </rule>
   <!--
Template derived rules for ID: 1.2.40.0.34.11.30005
Context: *[hl7:section[hl7:templateId[@root = '1.2.40.0.34.11.2.2.21'] and hl7:templateId[@root = '1.3.6.1.4.1.19376.1.5.3.1.3.20']]]/hl7:section[hl7:templateId[@root = '1.2.40.0.34.11.2.2.21'] and hl7:templateId[@root = '1.3.6.1.4.1.19376.1.5.3.1.3.20']]/hl7:text
Item: (MedikationEinweisungAlleEIS)
-->

   <rule fpi="RULC-1"
         context="*[hl7:section[hl7:templateId[@root = '1.2.40.0.34.11.2.2.21'] and hl7:templateId[@root = '1.3.6.1.4.1.19376.1.5.3.1.3.20']]]/hl7:section[hl7:templateId[@root = '1.2.40.0.34.11.2.2.21'] and hl7:templateId[@root = '1.3.6.1.4.1.19376.1.5.3.1.3.20']]/hl7:text"
         id="d175238e124-false-d175283e0">
      <extends rule="SD.TEXT"/>
      <assert role="error"
              see="http://elga.art-decor.org/elga-html-20230508T144915/tmp-1.2.40.0.34.11.30005-2011-12-19T000000.html"
              test="empty(@xsi:type) or resolve-QName(@xsi:type, .) = QName('urn:hl7-org:v3', 'SD.TEXT')">(MedikationEinweisungAlleEIS): Wenn eine @xsi:type Instruktion anwesend ist MUSS diese den Wert "{urn:hl7-org:v3}:SD.TEXT" haben. Gefunden "{<value-of select="namespace-uri-from-QName(resolve-QName(@xsi:type,.))"/>}:<value-of select="local-name-from-QName(resolve-QName(@xsi:type,.))"/>"</assert>
   </rule>

   <!--
Template derived rules for ID: 1.2.40.0.34.11.2.2.21
Context: *[hl7:section[hl7:templateId[@root = '1.2.40.0.34.11.2.2.21'] and hl7:templateId[@root = '1.3.6.1.4.1.19376.1.5.3.1.3.20']]]/hl7:section[hl7:templateId[@root = '1.2.40.0.34.11.2.2.21'] and hl7:templateId[@root = '1.3.6.1.4.1.19376.1.5.3.1.3.20']]/hl7:entry[hl7:substanceAdministration[hl7:templateId[@root = '1.2.40.0.34.11.2.3.2'] and hl7:templateId[@root = '2.16.840.1.113883.10.20.1.24'] and hl7:templateId[@root = '1.3.6.1.4.1.19376.1.5.3.1.4.7'] and hl7:templateId[@root = '1.3.6.1.4.1.19376.1.9.1.3.2']]]
Item: (MedikationEinweisungFull)
-->
   <rule fpi="RULC-1"
         context="*[hl7:section[hl7:templateId[@root = '1.2.40.0.34.11.2.2.21'] and hl7:templateId[@root = '1.3.6.1.4.1.19376.1.5.3.1.3.20']]]/hl7:section[hl7:templateId[@root = '1.2.40.0.34.11.2.2.21'] and hl7:templateId[@root = '1.3.6.1.4.1.19376.1.5.3.1.3.20']]/hl7:entry[hl7:substanceAdministration[hl7:templateId[@root = '1.2.40.0.34.11.2.3.2'] and hl7:templateId[@root = '2.16.840.1.113883.10.20.1.24'] and hl7:templateId[@root = '1.3.6.1.4.1.19376.1.5.3.1.4.7'] and hl7:templateId[@root = '1.3.6.1.4.1.19376.1.9.1.3.2']]]">
      <assert role="error"
              see="http://elga.art-decor.org/elga-html-20230508T144915/tmp-1.2.40.0.34.11.2.2.21-2013-11-12T000000.html"
              test="string(@typeCode) = ('DRIV') or not(@typeCode)">(MedikationEinweisungFull): Der Wert von typeCode MUSS 'DRIV' sein. Gefunden: "<value-of select="@typeCode"/>"</assert>
   </rule>

   <!--
Template derived rules for ID: 1.2.40.0.34.11.2.2.21
Context: *[hl7:section[hl7:templateId[@root = '1.2.40.0.34.11.2.2.21'] and hl7:templateId[@root = '1.3.6.1.4.1.19376.1.5.3.1.3.20']]]/hl7:section[hl7:templateId[@root = '1.2.40.0.34.11.2.2.21'] and hl7:templateId[@root = '1.3.6.1.4.1.19376.1.5.3.1.3.20']]/hl7:entry[hl7:supply[hl7:templateId[@root = '1.2.40.0.34.11.2.3.3'] and hl7:templateId[@root = '2.16.840.1.113883.10.20.1.34'] and hl7:templateId[@root = '1.3.6.1.4.1.19376.1.5.3.1.4.7.3'] and hl7:templateId[@root = '1.3.6.1.4.1.19376.1.9.1.3.4']]]
Item: (MedikationEinweisungFull)
-->
   <rule fpi="RULC-1"
         context="*[hl7:section[hl7:templateId[@root = '1.2.40.0.34.11.2.2.21'] and hl7:templateId[@root = '1.3.6.1.4.1.19376.1.5.3.1.3.20']]]/hl7:section[hl7:templateId[@root = '1.2.40.0.34.11.2.2.21'] and hl7:templateId[@root = '1.3.6.1.4.1.19376.1.5.3.1.3.20']]/hl7:entry[hl7:supply[hl7:templateId[@root = '1.2.40.0.34.11.2.3.3'] and hl7:templateId[@root = '2.16.840.1.113883.10.20.1.34'] and hl7:templateId[@root = '1.3.6.1.4.1.19376.1.5.3.1.4.7.3'] and hl7:templateId[@root = '1.3.6.1.4.1.19376.1.9.1.3.4']]]">
      <assert role="error"
              see="http://elga.art-decor.org/elga-html-20230508T144915/tmp-1.2.40.0.34.11.2.2.21-2013-11-12T000000.html"
              test="string(@typeCode) = ('DRIV') or not(@typeCode)">(MedikationEinweisungFull): Der Wert von typeCode MUSS 'DRIV' sein. Gefunden: "<value-of select="@typeCode"/>"</assert>
   </rule>
</pattern>
