<?xml version="1.0" encoding="UTF-8"?>
<!--
Template derived pattern
===========================================
ID: 1.2.40.0.34.6.0.11.9.44
Name: Participant Body - Verifier
Description: Nur für Korrektur relevant : Die Person, die für die fachliche Richtigkeit der Korrektur verantwortlich ist. 
-->
<pattern xmlns="http://purl.oclc.org/dsdl/schematron"
         id="template-1.2.40.0.34.6.0.11.9.44-2021-08-04T122820-closed">
   <title>Participant Body - Verifier</title>

   <!-- Checking undefined contents for template/element @isClosed="true". Match context that we did not already match -->
   <rule fpi="RUL-QQQ"
         context="*[hl7:templateId[@root = '1.2.40.0.34.6.0.11.9.44']]/*[not(@xsi:nil = 'true')][not(self::hl7:templateId[@root = '1.2.40.0.34.6.0.11.9.44'] | self::hl7:time | self::hl7:participantRole[not(@nullFlavor)])]"
         id="d42e65551-true-d2260247e0">
      <assert role="error"
              see="https://elga.art-decor.org/elgabgd-html-20250116T125424/tmp-1.2.40.0.34.6.0.11.9.44-2021-08-04T122820.html"
              test="not(.)">(atcdabbr_other_ParticipantBodyVerifier)/d42e65551-true-d2260247e0: '<value-of select="name(..)"/>' ist als geschlossen definiert und dieses Element '<name/>' ist nicht erlaubt oder nicht mit diesem Inhalt erlaubt. Dies kann templateId, code oder id betreffen. Erwartet:  hl7:templateId[@root = '1.2.40.0.34.6.0.11.9.44'] | hl7:time | hl7:participantRole[not(@nullFlavor)] (rule-reference: d42e65551-true-d2260247e0)</assert>
   </rule>

   <!-- Checking undefined contents for template/element @isClosed="true". Match context that we did not already match -->
   <rule fpi="RUL-QQQ"
         context="*[hl7:templateId[@root = '1.2.40.0.34.6.0.11.9.44']]/hl7:participantRole[not(@nullFlavor)]/*[not(@xsi:nil = 'true')][not(self::hl7:id[not(@nullFlavor)] | self::hl7:id[@nullFlavor='NI'] | self::hl7:id[@nullFlavor='UNK'] | self::hl7:addr[not(@nullFlavor)] | self::hl7:telecom[not(@nullFlavor)] | self::hl7:playingDevice | self::hl7:playingEntity | self::hl7:scopingEntity)]"
         id="d42e65626-true-d2260297e0">
      <assert role="error"
              see="https://elga.art-decor.org/elgabgd-html-20250116T125424/tmp-1.2.40.0.34.6.0.11.9.44-2021-08-04T122820.html"
              test="not(.)">(atcdabbr_other_ParticipantBodyVerifier)/d42e65626-true-d2260297e0: '<value-of select="name(..)"/>' ist als geschlossen definiert und dieses Element '<name/>' ist nicht erlaubt oder nicht mit diesem Inhalt erlaubt. Dies kann templateId, code oder id betreffen. Erwartet:  hl7:id[not(@nullFlavor)] | hl7:id[@nullFlavor='NI'] | hl7:id[@nullFlavor='UNK'] | hl7:addr[not(@nullFlavor)] | hl7:telecom[not(@nullFlavor)] | hl7:playingDevice | hl7:playingEntity | hl7:scopingEntity (rule-reference: d42e65626-true-d2260297e0)</assert>
   </rule>

   <!-- Checking undefined contents for template/element @isClosed="true". Match context that we did not already match -->
   <rule fpi="RUL-QQQ"
         context="*[hl7:templateId[@root = '1.2.40.0.34.6.0.11.9.44']]/hl7:participantRole[not(@nullFlavor)]/hl7:addr[not(@nullFlavor)]/*[not(@xsi:nil = 'true')][not(self::hl7:streetAddressLine | self::hl7:streetName | self::hl7:houseNumber | self::hl7:postalCode[not(@nullFlavor)] | self::hl7:city[not(@nullFlavor)] | self::hl7:state | self::hl7:country[not(@nullFlavor)] | self::hl7:additionalLocator)]"
         id="d42e65654-true-d2260356e0">
      <assert role="error"
              see="https://elga.art-decor.org/elgabgd-html-20250116T125424/tmp-1.2.40.0.34.6.0.11.9.44-2021-08-04T122820.html"
              test="not(.)">(atcdabbr_other_ParticipantBodyVerifier)/d42e65654-true-d2260356e0: '<value-of select="name(..)"/>' ist als geschlossen definiert und dieses Element '<name/>' ist nicht erlaubt oder nicht mit diesem Inhalt erlaubt. Dies kann templateId, code oder id betreffen. Erwartet:  hl7:streetAddressLine | hl7:streetName | hl7:houseNumber | hl7:postalCode[not(@nullFlavor)] | hl7:city[not(@nullFlavor)] | hl7:state | hl7:country[not(@nullFlavor)] | hl7:additionalLocator (rule-reference: d42e65654-true-d2260356e0)</assert>
   </rule>

   <!-- Checking undefined contents for template/element @isClosed="true". Match context that we did not already match -->
   <rule fpi="RUL-QQQ"
         context="*[hl7:templateId[@root = '1.2.40.0.34.6.0.11.9.44']]/hl7:participantRole[not(@nullFlavor)]/hl7:playingDevice/*[not(@xsi:nil = 'true')][not(self::hl7:manufacturerModelName[not(@nullFlavor)] | self::hl7:softwareName[not(@nullFlavor)])]"
         id="d42e65683-true-d2260421e0">
      <assert role="error"
              see="https://elga.art-decor.org/elgabgd-html-20250116T125424/tmp-1.2.40.0.34.6.0.11.9.44-2021-08-04T122820.html"
              test="not(.)">(atcdabbr_other_ParticipantBodyVerifier)/d42e65683-true-d2260421e0: '<value-of select="name(..)"/>' ist als geschlossen definiert und dieses Element '<name/>' ist nicht erlaubt oder nicht mit diesem Inhalt erlaubt. Dies kann templateId, code oder id betreffen. Erwartet:  hl7:manufacturerModelName[not(@nullFlavor)] | hl7:softwareName[not(@nullFlavor)] (rule-reference: d42e65683-true-d2260421e0)</assert>
   </rule>

   <!-- Checking undefined contents for template/element @isClosed="true". Match context that we did not already match -->
   <rule fpi="RUL-QQQ"
         context="*[hl7:templateId[@root = '1.2.40.0.34.6.0.11.9.44']]/hl7:participantRole[not(@nullFlavor)]/hl7:playingEntity/*[not(@xsi:nil = 'true')][not(self::hl7:name[not(@nullFlavor)])]"
         id="d42e65685-true-d2260445e0">
      <assert role="error"
              see="https://elga.art-decor.org/elgabgd-html-20250116T125424/tmp-1.2.40.0.34.6.0.11.9.44-2021-08-04T122820.html"
              test="not(.)">(atcdabbr_other_ParticipantBodyVerifier)/d42e65685-true-d2260445e0: '<value-of select="name(..)"/>' ist als geschlossen definiert und dieses Element '<name/>' ist nicht erlaubt oder nicht mit diesem Inhalt erlaubt. Dies kann templateId, code oder id betreffen. Erwartet:  hl7:name[not(@nullFlavor)] (rule-reference: d42e65685-true-d2260445e0)</assert>
   </rule>

   <!-- Checking undefined contents for template/element @isClosed="true". Match context that we did not already match -->
   <rule fpi="RUL-QQQ"
         context="*[hl7:templateId[@root = '1.2.40.0.34.6.0.11.9.44']]/hl7:participantRole[not(@nullFlavor)]/hl7:playingEntity/hl7:name[not(@nullFlavor)]/*[not(@xsi:nil = 'true')][not(self::hl7:prefix | self::hl7:family[not(@nullFlavor)] | self::hl7:given[not(@nullFlavor)] | self::hl7:suffix)]"
         id="d42e65691-true-d2260474e0">
      <assert role="error"
              see="https://elga.art-decor.org/elgabgd-html-20250116T125424/tmp-1.2.40.0.34.6.0.11.9.44-2021-08-04T122820.html"
              test="not(.)">(atcdabbr_other_ParticipantBodyVerifier)/d42e65691-true-d2260474e0: '<value-of select="name(..)"/>' ist als geschlossen definiert und dieses Element '<name/>' ist nicht erlaubt oder nicht mit diesem Inhalt erlaubt. Dies kann templateId, code oder id betreffen. Erwartet:  hl7:prefix | hl7:family[not(@nullFlavor)] | hl7:given[not(@nullFlavor)] | hl7:suffix (rule-reference: d42e65691-true-d2260474e0)</assert>
   </rule>

   <!-- Checking undefined contents for template/element @isClosed="true". Match context that we did not already match -->
   <rule fpi="RUL-QQQ"
         context="*[hl7:templateId[@root = '1.2.40.0.34.6.0.11.9.44']]/hl7:participantRole[not(@nullFlavor)]/hl7:scopingEntity/*[not(@xsi:nil = 'true')][not(self::hl7:desc)]"
         id="d42e65786-true-d2260508e0">
      <assert role="error"
              see="https://elga.art-decor.org/elgabgd-html-20250116T125424/tmp-1.2.40.0.34.6.0.11.9.44-2021-08-04T122820.html"
              test="not(.)">(atcdabbr_other_ParticipantBodyVerifier)/d42e65786-true-d2260508e0: '<value-of select="name(..)"/>' ist als geschlossen definiert und dieses Element '<name/>' ist nicht erlaubt oder nicht mit diesem Inhalt erlaubt. Dies kann templateId, code oder id betreffen. Erwartet:  hl7:desc (rule-reference: d42e65786-true-d2260508e0)</assert>
   </rule>
</pattern>
