<?xml version="1.0" encoding="UTF-8"?>
<!--
Template derived pattern
===========================================
ID: 1.2.40.0.34.6.0.11.3.57
Name: EMS Case Identification Arztmeldung
Description: Basierend auf der Fragestellung kann das Labor auch das Fehlen eines Erregers bzw. das Fehlen einer meldepflichtigen Krankheit codieren, indem beim observation-Element das Attribut negationInd auf „true“ gesetzt wird. Dies hat zur Folge, dass die Aussage dieses observation-Elements negiert wird. Das „Case
                    Identification“ Element beinhaltet ein id Element welches den Fall identifiziert. Diese Identifikatoren werden vom EMS nach Meldung einer Krankheit vergeben und identifizieren die Kombination aus Patient/Patientin und ausgebrochener Krankheit. Der erzeugte Identifier wird an das Labor zurückgemeldet und das Labor hat die Möglichkeit bei weiteren Untersuchungen im Kontext der
                    meldepflichtigen Krankheit diesen Identifier zu verwenden. Sollte keine Id für die Krankheit verfügbar sein (z.B.: bei der Initialmeldung) wird dieses id-Element weggelassen.
-->
<pattern xmlns="http://purl.oclc.org/dsdl/schematron"
         id="template-1.2.40.0.34.6.0.11.3.57-2020-02-20T150854">
   <title>EMS Case Identification Arztmeldung</title>
   <!--
Template derived rules for ID: 1.2.40.0.34.6.0.11.3.57
Context: *[hl7:observation[hl7:templateId[@root = '1.2.40.0.34.6.0.11.3.57'] and hl7:templateId[@root = '1.3.6.1.4.1.19376.1.3.1.1.2'] and hl7:templateId[@root = '1.2.40.0.34.11.6.3.2']]]
Item: (epims_entry_caseIdentificationArzt)
-->

   <!--
Template derived rules for ID: 1.2.40.0.34.6.0.11.3.57
Context: *[hl7:observation[hl7:templateId[@root = '1.2.40.0.34.6.0.11.3.57'] and hl7:templateId[@root = '1.3.6.1.4.1.19376.1.3.1.1.2'] and hl7:templateId[@root = '1.2.40.0.34.11.6.3.2']]]/hl7:observation[hl7:templateId[@root = '1.2.40.0.34.6.0.11.3.57'] and hl7:templateId[@root = '1.3.6.1.4.1.19376.1.3.1.1.2'] and hl7:templateId[@root = '1.2.40.0.34.11.6.3.2']]
Item: (epims_entry_caseIdentificationArzt)
-->

   <rule fpi="RULC-1"
         context="*[hl7:observation[hl7:templateId[@root = '1.2.40.0.34.6.0.11.3.57'] and hl7:templateId[@root = '1.3.6.1.4.1.19376.1.3.1.1.2'] and hl7:templateId[@root = '1.2.40.0.34.11.6.3.2']]]/hl7:observation[hl7:templateId[@root = '1.2.40.0.34.6.0.11.3.57'] and hl7:templateId[@root = '1.3.6.1.4.1.19376.1.3.1.1.2'] and hl7:templateId[@root = '1.2.40.0.34.11.6.3.2']]"
         id="d42e18364-false-d163210e0">
      <assert role="error"
              see="https://elga.art-decor.org/epims-html-20250116T123132/tmp-1.2.40.0.34.6.0.11.3.57-2020-02-20T150854.html"
              test="string(@classCode) = ('CASE')">(epims_entry_caseIdentificationArzt): Der Wert von classCode MUSS 'CASE' sein. Gefunden: "<value-of select="@classCode"/>"</assert>
      <assert role="error"
              see="https://elga.art-decor.org/epims-html-20250116T123132/tmp-1.2.40.0.34.6.0.11.3.57-2020-02-20T150854.html"
              test="string(@moodCode) = ('EVN')">(epims_entry_caseIdentificationArzt): Der Wert von moodCode MUSS 'EVN' sein. Gefunden: "<value-of select="@moodCode"/>"</assert>
      <assert role="error"
              see="https://elga.art-decor.org/epims-html-20250116T123132/tmp-1.2.40.0.34.6.0.11.3.57-2020-02-20T150854.html"
              test="not(@negationInd) or string(@negationInd)=('true','false')">(epims_entry_caseIdentificationArzt): Attribute @negationInd MUSS vom Datentyp 'bl' sein  - '<value-of select="@negationInd"/>'</assert>
      <assert role="error"
              see="https://elga.art-decor.org/epims-html-20250116T123132/tmp-1.2.40.0.34.6.0.11.3.57-2020-02-20T150854.html"
              test="count(hl7:templateId[@root = '1.2.40.0.34.6.0.11.3.57']) &gt;= 1">(epims_entry_caseIdentificationArzt): Element hl7:templateId[@root = '1.2.40.0.34.6.0.11.3.57'] ist mandatory [min 1x].</assert>
      <assert role="error"
              see="https://elga.art-decor.org/epims-html-20250116T123132/tmp-1.2.40.0.34.6.0.11.3.57-2020-02-20T150854.html"
              test="count(hl7:templateId[@root = '1.2.40.0.34.6.0.11.3.57']) &lt;= 1">(epims_entry_caseIdentificationArzt): Element hl7:templateId[@root = '1.2.40.0.34.6.0.11.3.57'] kommt zu häufig vor [max 1x].</assert>
      <assert role="error"
              see="https://elga.art-decor.org/epims-html-20250116T123132/tmp-1.2.40.0.34.6.0.11.3.57-2020-02-20T150854.html"
              test="count(hl7:templateId[@root = '1.3.6.1.4.1.19376.1.3.1.1.2']) &gt;= 1">(epims_entry_caseIdentificationArzt): Element hl7:templateId[@root = '1.3.6.1.4.1.19376.1.3.1.1.2'] ist mandatory [min 1x].</assert>
      <assert role="error"
              see="https://elga.art-decor.org/epims-html-20250116T123132/tmp-1.2.40.0.34.6.0.11.3.57-2020-02-20T150854.html"
              test="count(hl7:templateId[@root = '1.3.6.1.4.1.19376.1.3.1.1.2']) &lt;= 1">(epims_entry_caseIdentificationArzt): Element hl7:templateId[@root = '1.3.6.1.4.1.19376.1.3.1.1.2'] kommt zu häufig vor [max 1x].</assert>
      <assert role="error"
              see="https://elga.art-decor.org/epims-html-20250116T123132/tmp-1.2.40.0.34.6.0.11.3.57-2020-02-20T150854.html"
              test="count(hl7:templateId[@root = '1.2.40.0.34.11.6.3.2']) &gt;= 1">(epims_entry_caseIdentificationArzt): Element hl7:templateId[@root = '1.2.40.0.34.11.6.3.2'] ist mandatory [min 1x].</assert>
      <assert role="error"
              see="https://elga.art-decor.org/epims-html-20250116T123132/tmp-1.2.40.0.34.6.0.11.3.57-2020-02-20T150854.html"
              test="count(hl7:templateId[@root = '1.2.40.0.34.11.6.3.2']) &lt;= 1">(epims_entry_caseIdentificationArzt): Element hl7:templateId[@root = '1.2.40.0.34.11.6.3.2'] kommt zu häufig vor [max 1x].</assert>
      <let name="elmcount" value="count(hl7:id[@root = '1.2.40.0.34.3.1.1'])"/>
      <assert role="error"
              see="https://elga.art-decor.org/epims-html-20250116T123132/tmp-1.2.40.0.34.6.0.11.3.57-2020-02-20T150854.html"
              test="$elmcount &lt;= 1">(epims_entry_caseIdentificationArzt): Auswahl (hl7:id[@root = '1.2.40.0.34.3.1.1']) enthält zu viele Elemente [max 1x]</assert>
      <assert role="error"
              see="https://elga.art-decor.org/epims-html-20250116T123132/tmp-1.2.40.0.34.6.0.11.3.57-2020-02-20T150854.html"
              test="count(hl7:id[@root = '1.2.40.0.34.3.1.1']) &lt;= 1">(epims_entry_caseIdentificationArzt): Element hl7:id[@root = '1.2.40.0.34.3.1.1'] kommt zu häufig vor [max 1x].</assert>
      <assert role="error"
              see="https://elga.art-decor.org/epims-html-20250116T123132/tmp-1.2.40.0.34.6.0.11.3.57-2020-02-20T150854.html"
              test="count(hl7:code[(@code = '416341003' and @codeSystem = '2.16.840.1.113883.6.96')]) &gt;= 1">(epims_entry_caseIdentificationArzt): Element hl7:code[(@code = '416341003' and @codeSystem = '2.16.840.1.113883.6.96')] ist mandatory [min 1x].</assert>
      <assert role="error"
              see="https://elga.art-decor.org/epims-html-20250116T123132/tmp-1.2.40.0.34.6.0.11.3.57-2020-02-20T150854.html"
              test="count(hl7:code[(@code = '416341003' and @codeSystem = '2.16.840.1.113883.6.96')]) &lt;= 1">(epims_entry_caseIdentificationArzt): Element hl7:code[(@code = '416341003' and @codeSystem = '2.16.840.1.113883.6.96')] kommt zu häufig vor [max 1x].</assert>
      <assert role="error"
              see="https://elga.art-decor.org/epims-html-20250116T123132/tmp-1.2.40.0.34.6.0.11.3.57-2020-02-20T150854.html"
              test="count(hl7:statusCode[@code = 'completed']) &gt;= 1">(epims_entry_caseIdentificationArzt): Element hl7:statusCode[@code = 'completed'] ist mandatory [min 1x].</assert>
      <assert role="error"
              see="https://elga.art-decor.org/epims-html-20250116T123132/tmp-1.2.40.0.34.6.0.11.3.57-2020-02-20T150854.html"
              test="count(hl7:statusCode[@code = 'completed']) &lt;= 1">(epims_entry_caseIdentificationArzt): Element hl7:statusCode[@code = 'completed'] kommt zu häufig vor [max 1x].</assert>
      <assert role="error"
              see="https://elga.art-decor.org/epims-html-20250116T123132/tmp-1.2.40.0.34.6.0.11.3.57-2020-02-20T150854.html"
              test="count(hl7:effectiveTime) &lt;= 1">(epims_entry_caseIdentificationArzt): Element hl7:effectiveTime kommt zu häufig vor [max 1x].</assert>
      <let name="elmcount"
           value="count(hl7:value[concat(@code, @codeSystem) = doc('include/voc-1.2.40.0.34.6.0.10.29-DYNAMIC.xml')//valueSet[1]/conceptList/concept/concat(@code, @codeSystem) or @nullFlavor] | hl7:value[concat(@code, @codeSystem) = doc('include/voc-1.2.40.0.34.6.0.10.19-DYNAMIC.xml')//valueSet[1]/conceptList/concept/concat(@code, @codeSystem) or @nullFlavor])"/>
      <assert role="error"
              see="https://elga.art-decor.org/epims-html-20250116T123132/tmp-1.2.40.0.34.6.0.11.3.57-2020-02-20T150854.html"
              test="$elmcount &gt;= 1">(epims_entry_caseIdentificationArzt): Auswahl (hl7:value[concat(@code, @codeSystem) = doc('include/voc-1.2.40.0.34.6.0.10.29-DYNAMIC.xml')//valueSet[1]/conceptList/concept/concat(@code, @codeSystem) or @nullFlavor]  oder  hl7:value[concat(@code, @codeSystem) = doc('include/voc-1.2.40.0.34.6.0.10.19-DYNAMIC.xml')//valueSet[1]/conceptList/concept/concat(@code, @codeSystem) or @nullFlavor]) enthält nicht genügend Elemente [min 1x]</assert>
      <assert role="error"
              see="https://elga.art-decor.org/epims-html-20250116T123132/tmp-1.2.40.0.34.6.0.11.3.57-2020-02-20T150854.html"
              test="$elmcount &lt;= 1">(epims_entry_caseIdentificationArzt): Auswahl (hl7:value[concat(@code, @codeSystem) = doc('include/voc-1.2.40.0.34.6.0.10.29-DYNAMIC.xml')//valueSet[1]/conceptList/concept/concat(@code, @codeSystem) or @nullFlavor]  oder  hl7:value[concat(@code, @codeSystem) = doc('include/voc-1.2.40.0.34.6.0.10.19-DYNAMIC.xml')//valueSet[1]/conceptList/concept/concat(@code, @codeSystem) or @nullFlavor]) enthält zu viele Elemente [max 1x]</assert>
      <assert role="error"
              see="https://elga.art-decor.org/epims-html-20250116T123132/tmp-1.2.40.0.34.6.0.11.3.57-2020-02-20T150854.html"
              test="count(hl7:value[concat(@code, @codeSystem) = doc('include/voc-1.2.40.0.34.6.0.10.29-DYNAMIC.xml')//valueSet[1]/conceptList/concept/concat(@code, @codeSystem) or @nullFlavor]) &lt;= 1">(epims_entry_caseIdentificationArzt): Element hl7:value[concat(@code, @codeSystem) = doc('include/voc-1.2.40.0.34.6.0.10.29-DYNAMIC.xml')//valueSet[1]/conceptList/concept/concat(@code, @codeSystem) or @nullFlavor] kommt zu häufig vor [max 1x].</assert>
      <assert role="error"
              see="https://elga.art-decor.org/epims-html-20250116T123132/tmp-1.2.40.0.34.6.0.11.3.57-2020-02-20T150854.html"
              test="count(hl7:value[concat(@code, @codeSystem) = doc('include/voc-1.2.40.0.34.6.0.10.19-DYNAMIC.xml')//valueSet[1]/conceptList/concept/concat(@code, @codeSystem) or @nullFlavor]) &lt;= 1">(epims_entry_caseIdentificationArzt): Element hl7:value[concat(@code, @codeSystem) = doc('include/voc-1.2.40.0.34.6.0.10.19-DYNAMIC.xml')//valueSet[1]/conceptList/concept/concat(@code, @codeSystem) or @nullFlavor] kommt zu häufig vor [max 1x].</assert>
      <assert role="error"
              see="https://elga.art-decor.org/epims-html-20250116T123132/tmp-1.2.40.0.34.6.0.11.3.57-2020-02-20T150854.html"
              test="count(hl7:informant[@typeCode = 'INF'][hl7:relatedEntity[@classCode = 'PAT']]) &lt;= 1">(epims_entry_caseIdentificationArzt): Element hl7:informant[@typeCode = 'INF'][hl7:relatedEntity[@classCode = 'PAT']] kommt zu häufig vor [max 1x].</assert>
   </rule>
   <!--
Template derived rules for ID: 1.2.40.0.34.6.0.11.3.57
Context: *[hl7:observation[hl7:templateId[@root = '1.2.40.0.34.6.0.11.3.57'] and hl7:templateId[@root = '1.3.6.1.4.1.19376.1.3.1.1.2'] and hl7:templateId[@root = '1.2.40.0.34.11.6.3.2']]]/hl7:observation[hl7:templateId[@root = '1.2.40.0.34.6.0.11.3.57'] and hl7:templateId[@root = '1.3.6.1.4.1.19376.1.3.1.1.2'] and hl7:templateId[@root = '1.2.40.0.34.11.6.3.2']]/hl7:templateId[@root = '1.2.40.0.34.6.0.11.3.57']
Item: (epims_entry_caseIdentificationArzt)
-->

   <rule fpi="RULC-1"
         context="*[hl7:observation[hl7:templateId[@root = '1.2.40.0.34.6.0.11.3.57'] and hl7:templateId[@root = '1.3.6.1.4.1.19376.1.3.1.1.2'] and hl7:templateId[@root = '1.2.40.0.34.11.6.3.2']]]/hl7:observation[hl7:templateId[@root = '1.2.40.0.34.6.0.11.3.57'] and hl7:templateId[@root = '1.3.6.1.4.1.19376.1.3.1.1.2'] and hl7:templateId[@root = '1.2.40.0.34.11.6.3.2']]/hl7:templateId[@root = '1.2.40.0.34.6.0.11.3.57']"
         id="d42e18378-false-d163349e0">
      <extends rule="II"/>
      <assert role="error"
              see="https://elga.art-decor.org/epims-html-20250116T123132/tmp-1.2.40.0.34.6.0.11.3.57-2020-02-20T150854.html"
              test="empty(@xsi:type) or resolve-QName(@xsi:type, .) = QName('urn:hl7-org:v3', 'II')">(epims_entry_caseIdentificationArzt): Wenn eine @xsi:type Instruktion anwesend ist MUSS diese den Wert "{urn:hl7-org:v3}:II" haben. Gefunden "{<value-of select="namespace-uri-from-QName(resolve-QName(@xsi:type,.))"/>}:<value-of select="local-name-from-QName(resolve-QName(@xsi:type,.))"/>"</assert>
      <assert role="error"
              see="https://elga.art-decor.org/epims-html-20250116T123132/tmp-1.2.40.0.34.6.0.11.3.57-2020-02-20T150854.html"
              test="string(@root) = ('1.2.40.0.34.6.0.11.3.57')">(epims_entry_caseIdentificationArzt): Der Wert von root MUSS '1.2.40.0.34.6.0.11.3.57' sein. Gefunden: "<value-of select="@root"/>"</assert>
   </rule>
   <!--
Template derived rules for ID: 1.2.40.0.34.6.0.11.3.57
Context: *[hl7:observation[hl7:templateId[@root = '1.2.40.0.34.6.0.11.3.57'] and hl7:templateId[@root = '1.3.6.1.4.1.19376.1.3.1.1.2'] and hl7:templateId[@root = '1.2.40.0.34.11.6.3.2']]]/hl7:observation[hl7:templateId[@root = '1.2.40.0.34.6.0.11.3.57'] and hl7:templateId[@root = '1.3.6.1.4.1.19376.1.3.1.1.2'] and hl7:templateId[@root = '1.2.40.0.34.11.6.3.2']]/hl7:templateId[@root = '1.3.6.1.4.1.19376.1.3.1.1.2']
Item: (epims_entry_caseIdentificationArzt)
-->

   <rule fpi="RULC-1"
         context="*[hl7:observation[hl7:templateId[@root = '1.2.40.0.34.6.0.11.3.57'] and hl7:templateId[@root = '1.3.6.1.4.1.19376.1.3.1.1.2'] and hl7:templateId[@root = '1.2.40.0.34.11.6.3.2']]]/hl7:observation[hl7:templateId[@root = '1.2.40.0.34.6.0.11.3.57'] and hl7:templateId[@root = '1.3.6.1.4.1.19376.1.3.1.1.2'] and hl7:templateId[@root = '1.2.40.0.34.11.6.3.2']]/hl7:templateId[@root = '1.3.6.1.4.1.19376.1.3.1.1.2']"
         id="d42e18383-false-d163364e0">
      <extends rule="II"/>
      <assert role="error"
              see="https://elga.art-decor.org/epims-html-20250116T123132/tmp-1.2.40.0.34.6.0.11.3.57-2020-02-20T150854.html"
              test="empty(@xsi:type) or resolve-QName(@xsi:type, .) = QName('urn:hl7-org:v3', 'II')">(epims_entry_caseIdentificationArzt): Wenn eine @xsi:type Instruktion anwesend ist MUSS diese den Wert "{urn:hl7-org:v3}:II" haben. Gefunden "{<value-of select="namespace-uri-from-QName(resolve-QName(@xsi:type,.))"/>}:<value-of select="local-name-from-QName(resolve-QName(@xsi:type,.))"/>"</assert>
      <assert role="error"
              see="https://elga.art-decor.org/epims-html-20250116T123132/tmp-1.2.40.0.34.6.0.11.3.57-2020-02-20T150854.html"
              test="string(@root) = ('1.3.6.1.4.1.19376.1.3.1.1.2')">(epims_entry_caseIdentificationArzt): Der Wert von root MUSS '1.3.6.1.4.1.19376.1.3.1.1.2' sein. Gefunden: "<value-of select="@root"/>"</assert>
   </rule>
   <!--
Template derived rules for ID: 1.2.40.0.34.6.0.11.3.57
Context: *[hl7:observation[hl7:templateId[@root = '1.2.40.0.34.6.0.11.3.57'] and hl7:templateId[@root = '1.3.6.1.4.1.19376.1.3.1.1.2'] and hl7:templateId[@root = '1.2.40.0.34.11.6.3.2']]]/hl7:observation[hl7:templateId[@root = '1.2.40.0.34.6.0.11.3.57'] and hl7:templateId[@root = '1.3.6.1.4.1.19376.1.3.1.1.2'] and hl7:templateId[@root = '1.2.40.0.34.11.6.3.2']]/hl7:templateId[@root = '1.2.40.0.34.11.6.3.2']
Item: (epims_entry_caseIdentificationArzt)
-->

   <rule fpi="RULC-1"
         context="*[hl7:observation[hl7:templateId[@root = '1.2.40.0.34.6.0.11.3.57'] and hl7:templateId[@root = '1.3.6.1.4.1.19376.1.3.1.1.2'] and hl7:templateId[@root = '1.2.40.0.34.11.6.3.2']]]/hl7:observation[hl7:templateId[@root = '1.2.40.0.34.6.0.11.3.57'] and hl7:templateId[@root = '1.3.6.1.4.1.19376.1.3.1.1.2'] and hl7:templateId[@root = '1.2.40.0.34.11.6.3.2']]/hl7:templateId[@root = '1.2.40.0.34.11.6.3.2']"
         id="d42e18394-false-d163379e0">
      <extends rule="II"/>
      <assert role="error"
              see="https://elga.art-decor.org/epims-html-20250116T123132/tmp-1.2.40.0.34.6.0.11.3.57-2020-02-20T150854.html"
              test="empty(@xsi:type) or resolve-QName(@xsi:type, .) = QName('urn:hl7-org:v3', 'II')">(epims_entry_caseIdentificationArzt): Wenn eine @xsi:type Instruktion anwesend ist MUSS diese den Wert "{urn:hl7-org:v3}:II" haben. Gefunden "{<value-of select="namespace-uri-from-QName(resolve-QName(@xsi:type,.))"/>}:<value-of select="local-name-from-QName(resolve-QName(@xsi:type,.))"/>"</assert>
      <assert role="error"
              see="https://elga.art-decor.org/epims-html-20250116T123132/tmp-1.2.40.0.34.6.0.11.3.57-2020-02-20T150854.html"
              test="string(@root) = ('1.2.40.0.34.11.6.3.2')">(epims_entry_caseIdentificationArzt): Der Wert von root MUSS '1.2.40.0.34.11.6.3.2' sein. Gefunden: "<value-of select="@root"/>"</assert>
   </rule>
   <!--
Template derived rules for ID: 1.2.40.0.34.6.0.11.3.57
Context: *[hl7:observation[hl7:templateId[@root = '1.2.40.0.34.6.0.11.3.57'] and hl7:templateId[@root = '1.3.6.1.4.1.19376.1.3.1.1.2'] and hl7:templateId[@root = '1.2.40.0.34.11.6.3.2']]]/hl7:observation[hl7:templateId[@root = '1.2.40.0.34.6.0.11.3.57'] and hl7:templateId[@root = '1.3.6.1.4.1.19376.1.3.1.1.2'] and hl7:templateId[@root = '1.2.40.0.34.11.6.3.2']]/hl7:id[@root = '1.2.40.0.34.3.1.1']
Item: (epims_entry_caseIdentificationArzt)
-->

   <rule fpi="RULC-1"
         context="*[hl7:observation[hl7:templateId[@root = '1.2.40.0.34.6.0.11.3.57'] and hl7:templateId[@root = '1.3.6.1.4.1.19376.1.3.1.1.2'] and hl7:templateId[@root = '1.2.40.0.34.11.6.3.2']]]/hl7:observation[hl7:templateId[@root = '1.2.40.0.34.6.0.11.3.57'] and hl7:templateId[@root = '1.3.6.1.4.1.19376.1.3.1.1.2'] and hl7:templateId[@root = '1.2.40.0.34.11.6.3.2']]/hl7:id[@root = '1.2.40.0.34.3.1.1']"
         id="d42e18406-false-d163394e0">
      <extends rule="II"/>
      <assert role="error"
              see="https://elga.art-decor.org/epims-html-20250116T123132/tmp-1.2.40.0.34.6.0.11.3.57-2020-02-20T150854.html"
              test="empty(@xsi:type) or resolve-QName(@xsi:type, .) = QName('urn:hl7-org:v3', 'II')">(epims_entry_caseIdentificationArzt): Wenn eine @xsi:type Instruktion anwesend ist MUSS diese den Wert "{urn:hl7-org:v3}:II" haben. Gefunden "{<value-of select="namespace-uri-from-QName(resolve-QName(@xsi:type,.))"/>}:<value-of select="local-name-from-QName(resolve-QName(@xsi:type,.))"/>"</assert>
      <assert role="error"
              see="https://elga.art-decor.org/epims-html-20250116T123132/tmp-1.2.40.0.34.6.0.11.3.57-2020-02-20T150854.html"
              test="string(@root) = ('1.2.40.0.34.3.1.1')">(epims_entry_caseIdentificationArzt): Der Wert von root MUSS '1.2.40.0.34.3.1.1' sein. Gefunden: "<value-of select="@root"/>"</assert>
      <assert role="error"
              see="https://elga.art-decor.org/epims-html-20250116T123132/tmp-1.2.40.0.34.6.0.11.3.57-2020-02-20T150854.html"
              test="@extension">(epims_entry_caseIdentificationArzt): Attribut @extension MUSS vorkommen.</assert>
      <assert role="error"
              see="https://elga.art-decor.org/epims-html-20250116T123132/tmp-1.2.40.0.34.6.0.11.3.57-2020-02-20T150854.html"
              test="not(@extension) or string-length(@extension)&gt;0">(epims_entry_caseIdentificationArzt): Attribute @extension MUSS vom Datentyp 'st' sein  - '<value-of select="@extension"/>'</assert>
      <assert role="error"
              see="https://elga.art-decor.org/epims-html-20250116T123132/tmp-1.2.40.0.34.6.0.11.3.57-2020-02-20T150854.html"
              test="count(hl7:id) = 0">(epims_entry_caseIdentificationArzt): Element hl7:id DARF NICHT vorkommen.</assert>
   </rule>
   <!--
Template derived rules for ID: 1.2.40.0.34.6.0.11.3.57
Context: *[hl7:observation[hl7:templateId[@root = '1.2.40.0.34.6.0.11.3.57'] and hl7:templateId[@root = '1.3.6.1.4.1.19376.1.3.1.1.2'] and hl7:templateId[@root = '1.2.40.0.34.11.6.3.2']]]/hl7:observation[hl7:templateId[@root = '1.2.40.0.34.6.0.11.3.57'] and hl7:templateId[@root = '1.3.6.1.4.1.19376.1.3.1.1.2'] and hl7:templateId[@root = '1.2.40.0.34.11.6.3.2']]/hl7:id[@root = '1.2.40.0.34.3.1.1']/hl7:id
Item: (epims_entry_caseIdentificationArzt)
-->

   <rule fpi="RULC-1"
         context="*[hl7:observation[hl7:templateId[@root = '1.2.40.0.34.6.0.11.3.57'] and hl7:templateId[@root = '1.3.6.1.4.1.19376.1.3.1.1.2'] and hl7:templateId[@root = '1.2.40.0.34.11.6.3.2']]]/hl7:observation[hl7:templateId[@root = '1.2.40.0.34.6.0.11.3.57'] and hl7:templateId[@root = '1.3.6.1.4.1.19376.1.3.1.1.2'] and hl7:templateId[@root = '1.2.40.0.34.11.6.3.2']]/hl7:id[@root = '1.2.40.0.34.3.1.1']/hl7:id"
         id="d42e18420-false-d163420e0">
      <extends rule="II"/>
      <assert role="error"
              see="https://elga.art-decor.org/epims-html-20250116T123132/tmp-1.2.40.0.34.6.0.11.3.57-2020-02-20T150854.html"
              test="empty(@xsi:type) or resolve-QName(@xsi:type, .) = QName('urn:hl7-org:v3', 'II')">(epims_entry_caseIdentificationArzt): Wenn eine @xsi:type Instruktion anwesend ist MUSS diese den Wert "{urn:hl7-org:v3}:II" haben. Gefunden "{<value-of select="namespace-uri-from-QName(resolve-QName(@xsi:type,.))"/>}:<value-of select="local-name-from-QName(resolve-QName(@xsi:type,.))"/>"</assert>
   </rule>
   <!--
Template derived rules for ID: 1.2.40.0.34.6.0.11.3.57
Context: *[hl7:observation[hl7:templateId[@root = '1.2.40.0.34.6.0.11.3.57'] and hl7:templateId[@root = '1.3.6.1.4.1.19376.1.3.1.1.2'] and hl7:templateId[@root = '1.2.40.0.34.11.6.3.2']]]/hl7:observation[hl7:templateId[@root = '1.2.40.0.34.6.0.11.3.57'] and hl7:templateId[@root = '1.3.6.1.4.1.19376.1.3.1.1.2'] and hl7:templateId[@root = '1.2.40.0.34.11.6.3.2']]/hl7:templateId
Item: (epims_entry_caseIdentificationArzt)
-->

   <rule fpi="RULC-1"
         context="*[hl7:observation[hl7:templateId[@root = '1.2.40.0.34.6.0.11.3.57'] and hl7:templateId[@root = '1.3.6.1.4.1.19376.1.3.1.1.2'] and hl7:templateId[@root = '1.2.40.0.34.11.6.3.2']]]/hl7:observation[hl7:templateId[@root = '1.2.40.0.34.6.0.11.3.57'] and hl7:templateId[@root = '1.3.6.1.4.1.19376.1.3.1.1.2'] and hl7:templateId[@root = '1.2.40.0.34.11.6.3.2']]/hl7:templateId"
         id="d42e18428-false-d163430e0">
      <extends rule="II"/>
      <assert role="error"
              see="https://elga.art-decor.org/epims-html-20250116T123132/tmp-1.2.40.0.34.6.0.11.3.57-2020-02-20T150854.html"
              test="empty(@xsi:type) or resolve-QName(@xsi:type, .) = QName('urn:hl7-org:v3', 'II')">(epims_entry_caseIdentificationArzt): Wenn eine @xsi:type Instruktion anwesend ist MUSS diese den Wert "{urn:hl7-org:v3}:II" haben. Gefunden "{<value-of select="namespace-uri-from-QName(resolve-QName(@xsi:type,.))"/>}:<value-of select="local-name-from-QName(resolve-QName(@xsi:type,.))"/>"</assert>
   </rule>
   <!--
Template derived rules for ID: 1.2.40.0.34.6.0.11.3.57
Context: *[hl7:observation[hl7:templateId[@root = '1.2.40.0.34.6.0.11.3.57'] and hl7:templateId[@root = '1.3.6.1.4.1.19376.1.3.1.1.2'] and hl7:templateId[@root = '1.2.40.0.34.11.6.3.2']]]/hl7:observation[hl7:templateId[@root = '1.2.40.0.34.6.0.11.3.57'] and hl7:templateId[@root = '1.3.6.1.4.1.19376.1.3.1.1.2'] and hl7:templateId[@root = '1.2.40.0.34.11.6.3.2']]/hl7:code[(@code = '416341003' and @codeSystem = '2.16.840.1.113883.6.96')]
Item: (epims_entry_caseIdentificationArzt)
-->

   <rule fpi="RULC-1"
         context="*[hl7:observation[hl7:templateId[@root = '1.2.40.0.34.6.0.11.3.57'] and hl7:templateId[@root = '1.3.6.1.4.1.19376.1.3.1.1.2'] and hl7:templateId[@root = '1.2.40.0.34.11.6.3.2']]]/hl7:observation[hl7:templateId[@root = '1.2.40.0.34.6.0.11.3.57'] and hl7:templateId[@root = '1.3.6.1.4.1.19376.1.3.1.1.2'] and hl7:templateId[@root = '1.2.40.0.34.11.6.3.2']]/hl7:code[(@code = '416341003' and @codeSystem = '2.16.840.1.113883.6.96')]"
         id="d42e18439-false-d163441e0">
      <extends rule="CD"/>
      <assert role="error"
              see="https://elga.art-decor.org/epims-html-20250116T123132/tmp-1.2.40.0.34.6.0.11.3.57-2020-02-20T150854.html"
              test="empty(@xsi:type) or resolve-QName(@xsi:type, .) = QName('urn:hl7-org:v3', 'CD')">(epims_entry_caseIdentificationArzt): Wenn eine @xsi:type Instruktion anwesend ist MUSS diese den Wert "{urn:hl7-org:v3}:CD" haben. Gefunden "{<value-of select="namespace-uri-from-QName(resolve-QName(@xsi:type,.))"/>}:<value-of select="local-name-from-QName(resolve-QName(@xsi:type,.))"/>"</assert>
      <assert role="error"
              see="https://elga.art-decor.org/epims-html-20250116T123132/tmp-1.2.40.0.34.6.0.11.3.57-2020-02-20T150854.html"
              test="@nullFlavor or (@code='416341003' and @codeSystem='2.16.840.1.113883.6.96')">(epims_entry_caseIdentificationArzt): Der Elementinhalt MUSS einer von 'code '416341003' codeSystem '2.16.840.1.113883.6.96'' sein.</assert>
   </rule>
   <!--
Template derived rules for ID: 1.2.40.0.34.6.0.11.3.57
Context: *[hl7:observation[hl7:templateId[@root = '1.2.40.0.34.6.0.11.3.57'] and hl7:templateId[@root = '1.3.6.1.4.1.19376.1.3.1.1.2'] and hl7:templateId[@root = '1.2.40.0.34.11.6.3.2']]]/hl7:observation[hl7:templateId[@root = '1.2.40.0.34.6.0.11.3.57'] and hl7:templateId[@root = '1.3.6.1.4.1.19376.1.3.1.1.2'] and hl7:templateId[@root = '1.2.40.0.34.11.6.3.2']]/hl7:statusCode[@code = 'completed']
Item: (epims_entry_caseIdentificationArzt)
-->

   <rule fpi="RULC-1"
         context="*[hl7:observation[hl7:templateId[@root = '1.2.40.0.34.6.0.11.3.57'] and hl7:templateId[@root = '1.3.6.1.4.1.19376.1.3.1.1.2'] and hl7:templateId[@root = '1.2.40.0.34.11.6.3.2']]]/hl7:observation[hl7:templateId[@root = '1.2.40.0.34.6.0.11.3.57'] and hl7:templateId[@root = '1.3.6.1.4.1.19376.1.3.1.1.2'] and hl7:templateId[@root = '1.2.40.0.34.11.6.3.2']]/hl7:statusCode[@code = 'completed']"
         id="d42e18444-false-d163458e0">
      <extends rule="CS"/>
      <assert role="error"
              see="https://elga.art-decor.org/epims-html-20250116T123132/tmp-1.2.40.0.34.6.0.11.3.57-2020-02-20T150854.html"
              test="empty(@xsi:type) or resolve-QName(@xsi:type, .) = QName('urn:hl7-org:v3', 'CS')">(epims_entry_caseIdentificationArzt): Wenn eine @xsi:type Instruktion anwesend ist MUSS diese den Wert "{urn:hl7-org:v3}:CS" haben. Gefunden "{<value-of select="namespace-uri-from-QName(resolve-QName(@xsi:type,.))"/>}:<value-of select="local-name-from-QName(resolve-QName(@xsi:type,.))"/>"</assert>
      <assert role="error"
              see="https://elga.art-decor.org/epims-html-20250116T123132/tmp-1.2.40.0.34.6.0.11.3.57-2020-02-20T150854.html"
              test="@nullFlavor or (@code='completed')">(epims_entry_caseIdentificationArzt): Der Elementinhalt MUSS einer von 'code 'completed'' sein.</assert>
   </rule>
   <!--
Template derived rules for ID: 1.2.40.0.34.6.0.11.3.57
Context: *[hl7:observation[hl7:templateId[@root = '1.2.40.0.34.6.0.11.3.57'] and hl7:templateId[@root = '1.3.6.1.4.1.19376.1.3.1.1.2'] and hl7:templateId[@root = '1.2.40.0.34.11.6.3.2']]]/hl7:observation[hl7:templateId[@root = '1.2.40.0.34.6.0.11.3.57'] and hl7:templateId[@root = '1.3.6.1.4.1.19376.1.3.1.1.2'] and hl7:templateId[@root = '1.2.40.0.34.11.6.3.2']]/hl7:effectiveTime
Item: (epims_entry_caseIdentificationArzt)
-->

   <rule fpi="RULC-1"
         context="*[hl7:observation[hl7:templateId[@root = '1.2.40.0.34.6.0.11.3.57'] and hl7:templateId[@root = '1.3.6.1.4.1.19376.1.3.1.1.2'] and hl7:templateId[@root = '1.2.40.0.34.11.6.3.2']]]/hl7:observation[hl7:templateId[@root = '1.2.40.0.34.6.0.11.3.57'] and hl7:templateId[@root = '1.3.6.1.4.1.19376.1.3.1.1.2'] and hl7:templateId[@root = '1.2.40.0.34.11.6.3.2']]/hl7:effectiveTime"
         id="d42e18449-false-d163474e0">
      <extends rule="IVL_TS"/>
      <assert role="error"
              see="https://elga.art-decor.org/epims-html-20250116T123132/tmp-1.2.40.0.34.6.0.11.3.57-2020-02-20T150854.html"
              test="empty(@xsi:type) or resolve-QName(@xsi:type, .) = QName('urn:hl7-org:v3', 'IVL_TS')">(epims_entry_caseIdentificationArzt): Wenn eine @xsi:type Instruktion anwesend ist MUSS diese den Wert "{urn:hl7-org:v3}:IVL_TS" haben. Gefunden "{<value-of select="namespace-uri-from-QName(resolve-QName(@xsi:type,.))"/>}:<value-of select="local-name-from-QName(resolve-QName(@xsi:type,.))"/>"</assert>
   </rule>
   <!--
Template derived rules for ID: 1.2.40.0.34.6.0.11.3.57
Context: *[hl7:observation[hl7:templateId[@root = '1.2.40.0.34.6.0.11.3.57'] and hl7:templateId[@root = '1.3.6.1.4.1.19376.1.3.1.1.2'] and hl7:templateId[@root = '1.2.40.0.34.11.6.3.2']]]/hl7:observation[hl7:templateId[@root = '1.2.40.0.34.6.0.11.3.57'] and hl7:templateId[@root = '1.3.6.1.4.1.19376.1.3.1.1.2'] and hl7:templateId[@root = '1.2.40.0.34.11.6.3.2']]/hl7:value[concat(@code, @codeSystem) = doc('include/voc-1.2.40.0.34.6.0.10.29-DYNAMIC.xml')//valueSet[1]/conceptList/concept/concat(@code, @codeSystem) or @nullFlavor]
Item: (epims_entry_caseIdentificationArzt)
-->

   <rule fpi="RULC-1"
         context="*[hl7:observation[hl7:templateId[@root = '1.2.40.0.34.6.0.11.3.57'] and hl7:templateId[@root = '1.3.6.1.4.1.19376.1.3.1.1.2'] and hl7:templateId[@root = '1.2.40.0.34.11.6.3.2']]]/hl7:observation[hl7:templateId[@root = '1.2.40.0.34.6.0.11.3.57'] and hl7:templateId[@root = '1.3.6.1.4.1.19376.1.3.1.1.2'] and hl7:templateId[@root = '1.2.40.0.34.11.6.3.2']]/hl7:value[concat(@code, @codeSystem) = doc('include/voc-1.2.40.0.34.6.0.10.29-DYNAMIC.xml')//valueSet[1]/conceptList/concept/concat(@code, @codeSystem) or @nullFlavor]"
         id="d42e18461-false-d163487e0">
      <extends rule="CD"/>
      <assert role="error"
              see="https://elga.art-decor.org/epims-html-20250116T123132/tmp-1.2.40.0.34.6.0.11.3.57-2020-02-20T150854.html"
              test="empty(@xsi:type) or resolve-QName(@xsi:type, .) = QName('urn:hl7-org:v3', 'CD')">(epims_entry_caseIdentificationArzt): Wenn eine @xsi:type Instruktion anwesend ist MUSS diese den Wert "{urn:hl7-org:v3}:CD" haben. Gefunden "{<value-of select="namespace-uri-from-QName(resolve-QName(@xsi:type,.))"/>}:<value-of select="local-name-from-QName(resolve-QName(@xsi:type,.))"/>"</assert>
      <let name="theCode" value="@code"/>
      <let name="theCodeSystem" value="@codeSystem"/>
      <assert role="error"
              see="https://elga.art-decor.org/epims-html-20250116T123132/tmp-1.2.40.0.34.6.0.11.3.57-2020-02-20T150854.html"
              test="@nullFlavor or exists(doc('include/voc-1.2.40.0.34.6.0.10.29-DYNAMIC.xml')//valueSet[1][conceptList/concept[@code = $theCode][@codeSystem = $theCodeSystem]])">(epims_entry_caseIdentificationArzt): Der Elementinhalt MUSS einer von '1.2.40.0.34.6.0.10.29 EMS Lebensmittelbedingte Intoxikationen VS (DYNAMIC)' sein.</assert>
   </rule>
   <!--
Template derived rules for ID: 1.2.40.0.34.6.0.11.3.57
Context: *[hl7:observation[hl7:templateId[@root = '1.2.40.0.34.6.0.11.3.57'] and hl7:templateId[@root = '1.3.6.1.4.1.19376.1.3.1.1.2'] and hl7:templateId[@root = '1.2.40.0.34.11.6.3.2']]]/hl7:observation[hl7:templateId[@root = '1.2.40.0.34.6.0.11.3.57'] and hl7:templateId[@root = '1.3.6.1.4.1.19376.1.3.1.1.2'] and hl7:templateId[@root = '1.2.40.0.34.11.6.3.2']]/hl7:value[concat(@code, @codeSystem) = doc('include/voc-1.2.40.0.34.6.0.10.19-DYNAMIC.xml')//valueSet[1]/conceptList/concept/concat(@code, @codeSystem) or @nullFlavor]
Item: (epims_entry_caseIdentificationArzt)
-->

   <rule fpi="RULC-1"
         context="*[hl7:observation[hl7:templateId[@root = '1.2.40.0.34.6.0.11.3.57'] and hl7:templateId[@root = '1.3.6.1.4.1.19376.1.3.1.1.2'] and hl7:templateId[@root = '1.2.40.0.34.11.6.3.2']]]/hl7:observation[hl7:templateId[@root = '1.2.40.0.34.6.0.11.3.57'] and hl7:templateId[@root = '1.3.6.1.4.1.19376.1.3.1.1.2'] and hl7:templateId[@root = '1.2.40.0.34.11.6.3.2']]/hl7:value[concat(@code, @codeSystem) = doc('include/voc-1.2.40.0.34.6.0.10.19-DYNAMIC.xml')//valueSet[1]/conceptList/concept/concat(@code, @codeSystem) or @nullFlavor]"
         id="d42e18469-false-d163510e0">
      <extends rule="CD"/>
      <assert role="error"
              see="https://elga.art-decor.org/epims-html-20250116T123132/tmp-1.2.40.0.34.6.0.11.3.57-2020-02-20T150854.html"
              test="empty(@xsi:type) or resolve-QName(@xsi:type, .) = QName('urn:hl7-org:v3', 'CD')">(epims_entry_caseIdentificationArzt): Wenn eine @xsi:type Instruktion anwesend ist MUSS diese den Wert "{urn:hl7-org:v3}:CD" haben. Gefunden "{<value-of select="namespace-uri-from-QName(resolve-QName(@xsi:type,.))"/>}:<value-of select="local-name-from-QName(resolve-QName(@xsi:type,.))"/>"</assert>
      <let name="theCode" value="@code"/>
      <let name="theCodeSystem" value="@codeSystem"/>
      <assert role="error"
              see="https://elga.art-decor.org/epims-html-20250116T123132/tmp-1.2.40.0.34.6.0.11.3.57-2020-02-20T150854.html"
              test="@nullFlavor or exists(doc('include/voc-1.2.40.0.34.6.0.10.19-DYNAMIC.xml')//valueSet[1][conceptList/concept[@code = $theCode][@codeSystem = $theCodeSystem]])">(epims_entry_caseIdentificationArzt): Der Elementinhalt MUSS einer von '1.2.40.0.34.6.0.10.19 EMS Meldepflichtige Krankheiten VS (DYNAMIC)' sein.</assert>
      <let name="elmcount"
           value="count(hl7:qualifier[hl7:name[(@code = '8' and @codeSystem = '2.16.840.1.113883.3.7.1.0')]] | hl7:qualifier[hl7:name[(@code = 'Krankheitsmerkmal' and @codeSystem = '1.2.40.0.34.5.101')]])"/>
      <assert role="error"
              see="https://elga.art-decor.org/epims-html-20250116T123132/tmp-1.2.40.0.34.6.0.11.3.57-2020-02-20T150854.html"
              test="$elmcount &lt;= 1">(epims_entry_caseIdentificationArzt): Auswahl (hl7:qualifier[hl7:name[(@code = '8' and @codeSystem = '2.16.840.1.113883.3.7.1.0')]]  oder  hl7:qualifier[hl7:name[(@code = 'Krankheitsmerkmal' and @codeSystem = '1.2.40.0.34.5.101')]]) enthält zu viele Elemente [max 1x]</assert>
      <assert role="error"
              see="https://elga.art-decor.org/epims-html-20250116T123132/tmp-1.2.40.0.34.6.0.11.3.57-2020-02-20T150854.html"
              test="count(hl7:qualifier[hl7:name[(@code = '8' and @codeSystem = '2.16.840.1.113883.3.7.1.0')]]) &lt;= 1">(epims_entry_caseIdentificationArzt): Element hl7:qualifier[hl7:name[(@code = '8' and @codeSystem = '2.16.840.1.113883.3.7.1.0')]] kommt zu häufig vor [max 1x].</assert>
      <assert role="error"
              see="https://elga.art-decor.org/epims-html-20250116T123132/tmp-1.2.40.0.34.6.0.11.3.57-2020-02-20T150854.html"
              test="count(hl7:qualifier[hl7:name[(@code = 'Krankheitsmerkmal' and @codeSystem = '1.2.40.0.34.5.101')]]) &lt;= 1">(epims_entry_caseIdentificationArzt): Element hl7:qualifier[hl7:name[(@code = 'Krankheitsmerkmal' and @codeSystem = '1.2.40.0.34.5.101')]] kommt zu häufig vor [max 1x].</assert>
   </rule>
   <!--
Template derived rules for ID: 1.2.40.0.34.6.0.11.3.57
Context: *[hl7:observation[hl7:templateId[@root = '1.2.40.0.34.6.0.11.3.57'] and hl7:templateId[@root = '1.3.6.1.4.1.19376.1.3.1.1.2'] and hl7:templateId[@root = '1.2.40.0.34.11.6.3.2']]]/hl7:observation[hl7:templateId[@root = '1.2.40.0.34.6.0.11.3.57'] and hl7:templateId[@root = '1.3.6.1.4.1.19376.1.3.1.1.2'] and hl7:templateId[@root = '1.2.40.0.34.11.6.3.2']]/hl7:value[concat(@code, @codeSystem) = doc('include/voc-1.2.40.0.34.6.0.10.19-DYNAMIC.xml')//valueSet[1]/conceptList/concept/concat(@code, @codeSystem) or @nullFlavor]/hl7:qualifier[hl7:name[(@code = '8' and @codeSystem = '2.16.840.1.113883.3.7.1.0')]]
Item: (epims_entry_caseIdentificationArzt)
-->

   <rule fpi="RULC-1"
         context="*[hl7:observation[hl7:templateId[@root = '1.2.40.0.34.6.0.11.3.57'] and hl7:templateId[@root = '1.3.6.1.4.1.19376.1.3.1.1.2'] and hl7:templateId[@root = '1.2.40.0.34.11.6.3.2']]]/hl7:observation[hl7:templateId[@root = '1.2.40.0.34.6.0.11.3.57'] and hl7:templateId[@root = '1.3.6.1.4.1.19376.1.3.1.1.2'] and hl7:templateId[@root = '1.2.40.0.34.11.6.3.2']]/hl7:value[concat(@code, @codeSystem) = doc('include/voc-1.2.40.0.34.6.0.10.19-DYNAMIC.xml')//valueSet[1]/conceptList/concept/concat(@code, @codeSystem) or @nullFlavor]/hl7:qualifier[hl7:name[(@code = '8' and @codeSystem = '2.16.840.1.113883.3.7.1.0')]]"
         id="d42e18478-false-d163557e0">
      <extends rule="CR"/>
      <assert role="error"
              see="https://elga.art-decor.org/epims-html-20250116T123132/tmp-1.2.40.0.34.6.0.11.3.57-2020-02-20T150854.html"
              test="empty(@xsi:type) or resolve-QName(@xsi:type, .) = QName('urn:hl7-org:v3', 'CR')">(epims_entry_caseIdentificationArzt): Wenn eine @xsi:type Instruktion anwesend ist MUSS diese den Wert "{urn:hl7-org:v3}:CR" haben. Gefunden "{<value-of select="namespace-uri-from-QName(resolve-QName(@xsi:type,.))"/>}:<value-of select="local-name-from-QName(resolve-QName(@xsi:type,.))"/>"</assert>
      <assert role="error"
              see="https://elga.art-decor.org/epims-html-20250116T123132/tmp-1.2.40.0.34.6.0.11.3.57-2020-02-20T150854.html"
              test="count(hl7:name[(@code = '8' and @codeSystem = '2.16.840.1.113883.3.7.1.0')]) &gt;= 1">(epims_entry_caseIdentificationArzt): Element hl7:name[(@code = '8' and @codeSystem = '2.16.840.1.113883.3.7.1.0')] ist mandatory [min 1x].</assert>
      <assert role="error"
              see="https://elga.art-decor.org/epims-html-20250116T123132/tmp-1.2.40.0.34.6.0.11.3.57-2020-02-20T150854.html"
              test="count(hl7:name[(@code = '8' and @codeSystem = '2.16.840.1.113883.3.7.1.0')]) &lt;= 1">(epims_entry_caseIdentificationArzt): Element hl7:name[(@code = '8' and @codeSystem = '2.16.840.1.113883.3.7.1.0')] kommt zu häufig vor [max 1x].</assert>
      <assert role="error"
              see="https://elga.art-decor.org/epims-html-20250116T123132/tmp-1.2.40.0.34.6.0.11.3.57-2020-02-20T150854.html"
              test="count(hl7:value[concat(@code, @codeSystem) = doc('include/voc-1.2.40.0.34.10.168-DYNAMIC.xml')//valueSet[1]/conceptList/concept/concat(@code, @codeSystem)]) &gt;= 1">(epims_entry_caseIdentificationArzt): Element hl7:value[concat(@code, @codeSystem) = doc('include/voc-1.2.40.0.34.10.168-DYNAMIC.xml')//valueSet[1]/conceptList/concept/concat(@code, @codeSystem)] ist mandatory [min 1x].</assert>
      <assert role="error"
              see="https://elga.art-decor.org/epims-html-20250116T123132/tmp-1.2.40.0.34.6.0.11.3.57-2020-02-20T150854.html"
              test="count(hl7:value[concat(@code, @codeSystem) = doc('include/voc-1.2.40.0.34.10.168-DYNAMIC.xml')//valueSet[1]/conceptList/concept/concat(@code, @codeSystem)]) &lt;= 1">(epims_entry_caseIdentificationArzt): Element hl7:value[concat(@code, @codeSystem) = doc('include/voc-1.2.40.0.34.10.168-DYNAMIC.xml')//valueSet[1]/conceptList/concept/concat(@code, @codeSystem)] kommt zu häufig vor [max 1x].</assert>
   </rule>
   <!--
Template derived rules for ID: 1.2.40.0.34.6.0.11.3.57
Context: *[hl7:observation[hl7:templateId[@root = '1.2.40.0.34.6.0.11.3.57'] and hl7:templateId[@root = '1.3.6.1.4.1.19376.1.3.1.1.2'] and hl7:templateId[@root = '1.2.40.0.34.11.6.3.2']]]/hl7:observation[hl7:templateId[@root = '1.2.40.0.34.6.0.11.3.57'] and hl7:templateId[@root = '1.3.6.1.4.1.19376.1.3.1.1.2'] and hl7:templateId[@root = '1.2.40.0.34.11.6.3.2']]/hl7:value[concat(@code, @codeSystem) = doc('include/voc-1.2.40.0.34.6.0.10.19-DYNAMIC.xml')//valueSet[1]/conceptList/concept/concat(@code, @codeSystem) or @nullFlavor]/hl7:qualifier[hl7:name[(@code = '8' and @codeSystem = '2.16.840.1.113883.3.7.1.0')]]/hl7:name[(@code = '8' and @codeSystem = '2.16.840.1.113883.3.7.1.0')]
Item: (epims_entry_caseIdentificationArzt)
-->

   <rule fpi="RULC-1"
         context="*[hl7:observation[hl7:templateId[@root = '1.2.40.0.34.6.0.11.3.57'] and hl7:templateId[@root = '1.3.6.1.4.1.19376.1.3.1.1.2'] and hl7:templateId[@root = '1.2.40.0.34.11.6.3.2']]]/hl7:observation[hl7:templateId[@root = '1.2.40.0.34.6.0.11.3.57'] and hl7:templateId[@root = '1.3.6.1.4.1.19376.1.3.1.1.2'] and hl7:templateId[@root = '1.2.40.0.34.11.6.3.2']]/hl7:value[concat(@code, @codeSystem) = doc('include/voc-1.2.40.0.34.6.0.10.19-DYNAMIC.xml')//valueSet[1]/conceptList/concept/concat(@code, @codeSystem) or @nullFlavor]/hl7:qualifier[hl7:name[(@code = '8' and @codeSystem = '2.16.840.1.113883.3.7.1.0')]]/hl7:name[(@code = '8' and @codeSystem = '2.16.840.1.113883.3.7.1.0')]"
         id="d42e18480-false-d163589e0">
      <extends rule="CV"/>
      <assert role="error"
              see="https://elga.art-decor.org/epims-html-20250116T123132/tmp-1.2.40.0.34.6.0.11.3.57-2020-02-20T150854.html"
              test="empty(@xsi:type) or resolve-QName(@xsi:type, .) = QName('urn:hl7-org:v3', 'CV')">(epims_entry_caseIdentificationArzt): Wenn eine @xsi:type Instruktion anwesend ist MUSS diese den Wert "{urn:hl7-org:v3}:CV" haben. Gefunden "{<value-of select="namespace-uri-from-QName(resolve-QName(@xsi:type,.))"/>}:<value-of select="local-name-from-QName(resolve-QName(@xsi:type,.))"/>"</assert>
      <assert role="error"
              see="https://elga.art-decor.org/epims-html-20250116T123132/tmp-1.2.40.0.34.6.0.11.3.57-2020-02-20T150854.html"
              test="@nullFlavor or (@code='8' and @codeSystem='2.16.840.1.113883.3.7.1.0')">(epims_entry_caseIdentificationArzt): Der Elementinhalt MUSS einer von 'code '8' codeSystem '2.16.840.1.113883.3.7.1.0'' sein.</assert>
   </rule>
   <!--
Template derived rules for ID: 1.2.40.0.34.6.0.11.3.57
Context: *[hl7:observation[hl7:templateId[@root = '1.2.40.0.34.6.0.11.3.57'] and hl7:templateId[@root = '1.3.6.1.4.1.19376.1.3.1.1.2'] and hl7:templateId[@root = '1.2.40.0.34.11.6.3.2']]]/hl7:observation[hl7:templateId[@root = '1.2.40.0.34.6.0.11.3.57'] and hl7:templateId[@root = '1.3.6.1.4.1.19376.1.3.1.1.2'] and hl7:templateId[@root = '1.2.40.0.34.11.6.3.2']]/hl7:value[concat(@code, @codeSystem) = doc('include/voc-1.2.40.0.34.6.0.10.19-DYNAMIC.xml')//valueSet[1]/conceptList/concept/concat(@code, @codeSystem) or @nullFlavor]/hl7:qualifier[hl7:name[(@code = '8' and @codeSystem = '2.16.840.1.113883.3.7.1.0')]]/hl7:value[concat(@code, @codeSystem) = doc('include/voc-1.2.40.0.34.10.168-DYNAMIC.xml')//valueSet[1]/conceptList/concept/concat(@code, @codeSystem)]
Item: (epims_entry_caseIdentificationArzt)
-->

   <rule fpi="RULC-1"
         context="*[hl7:observation[hl7:templateId[@root = '1.2.40.0.34.6.0.11.3.57'] and hl7:templateId[@root = '1.3.6.1.4.1.19376.1.3.1.1.2'] and hl7:templateId[@root = '1.2.40.0.34.11.6.3.2']]]/hl7:observation[hl7:templateId[@root = '1.2.40.0.34.6.0.11.3.57'] and hl7:templateId[@root = '1.3.6.1.4.1.19376.1.3.1.1.2'] and hl7:templateId[@root = '1.2.40.0.34.11.6.3.2']]/hl7:value[concat(@code, @codeSystem) = doc('include/voc-1.2.40.0.34.6.0.10.19-DYNAMIC.xml')//valueSet[1]/conceptList/concept/concat(@code, @codeSystem) or @nullFlavor]/hl7:qualifier[hl7:name[(@code = '8' and @codeSystem = '2.16.840.1.113883.3.7.1.0')]]/hl7:value[concat(@code, @codeSystem) = doc('include/voc-1.2.40.0.34.10.168-DYNAMIC.xml')//valueSet[1]/conceptList/concept/concat(@code, @codeSystem)]"
         id="d42e18485-false-d163608e0">
      <extends rule="CD"/>
      <assert role="error"
              see="https://elga.art-decor.org/epims-html-20250116T123132/tmp-1.2.40.0.34.6.0.11.3.57-2020-02-20T150854.html"
              test="empty(@xsi:type) or resolve-QName(@xsi:type, .) = QName('urn:hl7-org:v3', 'CD')">(epims_entry_caseIdentificationArzt): Wenn eine @xsi:type Instruktion anwesend ist MUSS diese den Wert "{urn:hl7-org:v3}:CD" haben. Gefunden "{<value-of select="namespace-uri-from-QName(resolve-QName(@xsi:type,.))"/>}:<value-of select="local-name-from-QName(resolve-QName(@xsi:type,.))"/>"</assert>
      <let name="theCode" value="@code"/>
      <let name="theCodeSystem" value="@codeSystem"/>
      <assert role="error"
              see="https://elga.art-decor.org/epims-html-20250116T123132/tmp-1.2.40.0.34.6.0.11.3.57-2020-02-20T150854.html"
              test="@nullFlavor or exists(doc('include/voc-1.2.40.0.34.10.168-DYNAMIC.xml')//valueSet[1][conceptList/concept[@code = $theCode][@codeSystem = $theCodeSystem]])">(epims_entry_caseIdentificationArzt): Der Elementinhalt MUSS einer von '1.2.40.0.34.10.168 ELGA_Diagnosesicherheit (DYNAMIC)' sein.</assert>
   </rule>
   <!--
Template derived rules for ID: 1.2.40.0.34.6.0.11.3.57
Context: *[hl7:observation[hl7:templateId[@root = '1.2.40.0.34.6.0.11.3.57'] and hl7:templateId[@root = '1.3.6.1.4.1.19376.1.3.1.1.2'] and hl7:templateId[@root = '1.2.40.0.34.11.6.3.2']]]/hl7:observation[hl7:templateId[@root = '1.2.40.0.34.6.0.11.3.57'] and hl7:templateId[@root = '1.3.6.1.4.1.19376.1.3.1.1.2'] and hl7:templateId[@root = '1.2.40.0.34.11.6.3.2']]/hl7:value[concat(@code, @codeSystem) = doc('include/voc-1.2.40.0.34.6.0.10.19-DYNAMIC.xml')//valueSet[1]/conceptList/concept/concat(@code, @codeSystem) or @nullFlavor]/hl7:qualifier[hl7:name[(@code = 'Krankheitsmerkmal' and @codeSystem = '1.2.40.0.34.5.101')]]
Item: (epims_entry_caseIdentificationArzt)
-->

   <rule fpi="RULC-1"
         context="*[hl7:observation[hl7:templateId[@root = '1.2.40.0.34.6.0.11.3.57'] and hl7:templateId[@root = '1.3.6.1.4.1.19376.1.3.1.1.2'] and hl7:templateId[@root = '1.2.40.0.34.11.6.3.2']]]/hl7:observation[hl7:templateId[@root = '1.2.40.0.34.6.0.11.3.57'] and hl7:templateId[@root = '1.3.6.1.4.1.19376.1.3.1.1.2'] and hl7:templateId[@root = '1.2.40.0.34.11.6.3.2']]/hl7:value[concat(@code, @codeSystem) = doc('include/voc-1.2.40.0.34.6.0.10.19-DYNAMIC.xml')//valueSet[1]/conceptList/concept/concat(@code, @codeSystem) or @nullFlavor]/hl7:qualifier[hl7:name[(@code = 'Krankheitsmerkmal' and @codeSystem = '1.2.40.0.34.5.101')]]"
         id="d42e18491-false-d163629e0">
      <extends rule="CR"/>
      <assert role="error"
              see="https://elga.art-decor.org/epims-html-20250116T123132/tmp-1.2.40.0.34.6.0.11.3.57-2020-02-20T150854.html"
              test="empty(@xsi:type) or resolve-QName(@xsi:type, .) = QName('urn:hl7-org:v3', 'CR')">(epims_entry_caseIdentificationArzt): Wenn eine @xsi:type Instruktion anwesend ist MUSS diese den Wert "{urn:hl7-org:v3}:CR" haben. Gefunden "{<value-of select="namespace-uri-from-QName(resolve-QName(@xsi:type,.))"/>}:<value-of select="local-name-from-QName(resolve-QName(@xsi:type,.))"/>"</assert>
      <assert role="error"
              see="https://elga.art-decor.org/epims-html-20250116T123132/tmp-1.2.40.0.34.6.0.11.3.57-2020-02-20T150854.html"
              test="count(hl7:name[(@code = 'Krankheitsmerkmal' and @codeSystem = '1.2.40.0.34.5.101')]) &gt;= 1">(epims_entry_caseIdentificationArzt): Element hl7:name[(@code = 'Krankheitsmerkmal' and @codeSystem = '1.2.40.0.34.5.101')] ist mandatory [min 1x].</assert>
      <assert role="error"
              see="https://elga.art-decor.org/epims-html-20250116T123132/tmp-1.2.40.0.34.6.0.11.3.57-2020-02-20T150854.html"
              test="count(hl7:name[(@code = 'Krankheitsmerkmal' and @codeSystem = '1.2.40.0.34.5.101')]) &lt;= 1">(epims_entry_caseIdentificationArzt): Element hl7:name[(@code = 'Krankheitsmerkmal' and @codeSystem = '1.2.40.0.34.5.101')] kommt zu häufig vor [max 1x].</assert>
      <assert role="error"
              see="https://elga.art-decor.org/epims-html-20250116T123132/tmp-1.2.40.0.34.6.0.11.3.57-2020-02-20T150854.html"
              test="count(hl7:value[concat(@code, @codeSystem) = doc('include/voc-1.2.40.0.34.6.0.10.18-DYNAMIC.xml')//valueSet[1]/conceptList/concept/concat(@code, @codeSystem)]) &gt;= 1">(epims_entry_caseIdentificationArzt): Element hl7:value[concat(@code, @codeSystem) = doc('include/voc-1.2.40.0.34.6.0.10.18-DYNAMIC.xml')//valueSet[1]/conceptList/concept/concat(@code, @codeSystem)] ist mandatory [min 1x].</assert>
      <assert role="error"
              see="https://elga.art-decor.org/epims-html-20250116T123132/tmp-1.2.40.0.34.6.0.11.3.57-2020-02-20T150854.html"
              test="count(hl7:value[concat(@code, @codeSystem) = doc('include/voc-1.2.40.0.34.6.0.10.18-DYNAMIC.xml')//valueSet[1]/conceptList/concept/concat(@code, @codeSystem)]) &lt;= 1">(epims_entry_caseIdentificationArzt): Element hl7:value[concat(@code, @codeSystem) = doc('include/voc-1.2.40.0.34.6.0.10.18-DYNAMIC.xml')//valueSet[1]/conceptList/concept/concat(@code, @codeSystem)] kommt zu häufig vor [max 1x].</assert>
   </rule>
   <!--
Template derived rules for ID: 1.2.40.0.34.6.0.11.3.57
Context: *[hl7:observation[hl7:templateId[@root = '1.2.40.0.34.6.0.11.3.57'] and hl7:templateId[@root = '1.3.6.1.4.1.19376.1.3.1.1.2'] and hl7:templateId[@root = '1.2.40.0.34.11.6.3.2']]]/hl7:observation[hl7:templateId[@root = '1.2.40.0.34.6.0.11.3.57'] and hl7:templateId[@root = '1.3.6.1.4.1.19376.1.3.1.1.2'] and hl7:templateId[@root = '1.2.40.0.34.11.6.3.2']]/hl7:value[concat(@code, @codeSystem) = doc('include/voc-1.2.40.0.34.6.0.10.19-DYNAMIC.xml')//valueSet[1]/conceptList/concept/concat(@code, @codeSystem) or @nullFlavor]/hl7:qualifier[hl7:name[(@code = 'Krankheitsmerkmal' and @codeSystem = '1.2.40.0.34.5.101')]]/hl7:name[(@code = 'Krankheitsmerkmal' and @codeSystem = '1.2.40.0.34.5.101')]
Item: (epims_entry_caseIdentificationArzt)
-->

   <rule fpi="RULC-1"
         context="*[hl7:observation[hl7:templateId[@root = '1.2.40.0.34.6.0.11.3.57'] and hl7:templateId[@root = '1.3.6.1.4.1.19376.1.3.1.1.2'] and hl7:templateId[@root = '1.2.40.0.34.11.6.3.2']]]/hl7:observation[hl7:templateId[@root = '1.2.40.0.34.6.0.11.3.57'] and hl7:templateId[@root = '1.3.6.1.4.1.19376.1.3.1.1.2'] and hl7:templateId[@root = '1.2.40.0.34.11.6.3.2']]/hl7:value[concat(@code, @codeSystem) = doc('include/voc-1.2.40.0.34.6.0.10.19-DYNAMIC.xml')//valueSet[1]/conceptList/concept/concat(@code, @codeSystem) or @nullFlavor]/hl7:qualifier[hl7:name[(@code = 'Krankheitsmerkmal' and @codeSystem = '1.2.40.0.34.5.101')]]/hl7:name[(@code = 'Krankheitsmerkmal' and @codeSystem = '1.2.40.0.34.5.101')]"
         id="d42e18493-false-d163661e0">
      <extends rule="CV"/>
      <assert role="error"
              see="https://elga.art-decor.org/epims-html-20250116T123132/tmp-1.2.40.0.34.6.0.11.3.57-2020-02-20T150854.html"
              test="empty(@xsi:type) or resolve-QName(@xsi:type, .) = QName('urn:hl7-org:v3', 'CV')">(epims_entry_caseIdentificationArzt): Wenn eine @xsi:type Instruktion anwesend ist MUSS diese den Wert "{urn:hl7-org:v3}:CV" haben. Gefunden "{<value-of select="namespace-uri-from-QName(resolve-QName(@xsi:type,.))"/>}:<value-of select="local-name-from-QName(resolve-QName(@xsi:type,.))"/>"</assert>
      <assert role="error"
              see="https://elga.art-decor.org/epims-html-20250116T123132/tmp-1.2.40.0.34.6.0.11.3.57-2020-02-20T150854.html"
              test="@nullFlavor or (@code='Krankheitsmerkmal' and @codeSystem='1.2.40.0.34.5.101')">(epims_entry_caseIdentificationArzt): Der Elementinhalt MUSS einer von 'code 'Krankheitsmerkmal' codeSystem '1.2.40.0.34.5.101'' sein.</assert>
   </rule>
   <!--
Template derived rules for ID: 1.2.40.0.34.6.0.11.3.57
Context: *[hl7:observation[hl7:templateId[@root = '1.2.40.0.34.6.0.11.3.57'] and hl7:templateId[@root = '1.3.6.1.4.1.19376.1.3.1.1.2'] and hl7:templateId[@root = '1.2.40.0.34.11.6.3.2']]]/hl7:observation[hl7:templateId[@root = '1.2.40.0.34.6.0.11.3.57'] and hl7:templateId[@root = '1.3.6.1.4.1.19376.1.3.1.1.2'] and hl7:templateId[@root = '1.2.40.0.34.11.6.3.2']]/hl7:value[concat(@code, @codeSystem) = doc('include/voc-1.2.40.0.34.6.0.10.19-DYNAMIC.xml')//valueSet[1]/conceptList/concept/concat(@code, @codeSystem) or @nullFlavor]/hl7:qualifier[hl7:name[(@code = 'Krankheitsmerkmal' and @codeSystem = '1.2.40.0.34.5.101')]]/hl7:value[concat(@code, @codeSystem) = doc('include/voc-1.2.40.0.34.6.0.10.18-DYNAMIC.xml')//valueSet[1]/conceptList/concept/concat(@code, @codeSystem)]
Item: (epims_entry_caseIdentificationArzt)
-->

   <rule fpi="RULC-1"
         context="*[hl7:observation[hl7:templateId[@root = '1.2.40.0.34.6.0.11.3.57'] and hl7:templateId[@root = '1.3.6.1.4.1.19376.1.3.1.1.2'] and hl7:templateId[@root = '1.2.40.0.34.11.6.3.2']]]/hl7:observation[hl7:templateId[@root = '1.2.40.0.34.6.0.11.3.57'] and hl7:templateId[@root = '1.3.6.1.4.1.19376.1.3.1.1.2'] and hl7:templateId[@root = '1.2.40.0.34.11.6.3.2']]/hl7:value[concat(@code, @codeSystem) = doc('include/voc-1.2.40.0.34.6.0.10.19-DYNAMIC.xml')//valueSet[1]/conceptList/concept/concat(@code, @codeSystem) or @nullFlavor]/hl7:qualifier[hl7:name[(@code = 'Krankheitsmerkmal' and @codeSystem = '1.2.40.0.34.5.101')]]/hl7:value[concat(@code, @codeSystem) = doc('include/voc-1.2.40.0.34.6.0.10.18-DYNAMIC.xml')//valueSet[1]/conceptList/concept/concat(@code, @codeSystem)]"
         id="d42e18498-false-d163680e0">
      <extends rule="CD"/>
      <assert role="error"
              see="https://elga.art-decor.org/epims-html-20250116T123132/tmp-1.2.40.0.34.6.0.11.3.57-2020-02-20T150854.html"
              test="empty(@xsi:type) or resolve-QName(@xsi:type, .) = QName('urn:hl7-org:v3', 'CD')">(epims_entry_caseIdentificationArzt): Wenn eine @xsi:type Instruktion anwesend ist MUSS diese den Wert "{urn:hl7-org:v3}:CD" haben. Gefunden "{<value-of select="namespace-uri-from-QName(resolve-QName(@xsi:type,.))"/>}:<value-of select="local-name-from-QName(resolve-QName(@xsi:type,.))"/>"</assert>
      <let name="theCode" value="@code"/>
      <let name="theCodeSystem" value="@codeSystem"/>
      <assert role="error"
              see="https://elga.art-decor.org/epims-html-20250116T123132/tmp-1.2.40.0.34.6.0.11.3.57-2020-02-20T150854.html"
              test="@nullFlavor or exists(doc('include/voc-1.2.40.0.34.6.0.10.18-DYNAMIC.xml')//valueSet[1][conceptList/concept[@code = $theCode][@codeSystem = $theCodeSystem]])">(epims_entry_caseIdentificationArzt): Der Elementinhalt MUSS einer von '1.2.40.0.34.6.0.10.18 EMS Krankheitsmerkmale VS (DYNAMIC)' sein.</assert>
   </rule>
   <!--
Template derived rules for ID: 1.2.40.0.34.6.0.11.3.58
Context: *[hl7:observation[hl7:templateId[@root = '1.2.40.0.34.6.0.11.3.57'] and hl7:templateId[@root = '1.3.6.1.4.1.19376.1.3.1.1.2'] and hl7:templateId[@root = '1.2.40.0.34.11.6.3.2']]]/hl7:observation[hl7:templateId[@root = '1.2.40.0.34.6.0.11.3.57'] and hl7:templateId[@root = '1.3.6.1.4.1.19376.1.3.1.1.2'] and hl7:templateId[@root = '1.2.40.0.34.11.6.3.2']]/hl7:informant[@typeCode = 'INF'][hl7:relatedEntity[@classCode = 'PAT']]
Item: (epims_entry_informant)
-->

   <rule fpi="RULC-1"
         context="*[hl7:observation[hl7:templateId[@root = '1.2.40.0.34.6.0.11.3.57'] and hl7:templateId[@root = '1.3.6.1.4.1.19376.1.3.1.1.2'] and hl7:templateId[@root = '1.2.40.0.34.11.6.3.2']]]/hl7:observation[hl7:templateId[@root = '1.2.40.0.34.6.0.11.3.57'] and hl7:templateId[@root = '1.3.6.1.4.1.19376.1.3.1.1.2'] and hl7:templateId[@root = '1.2.40.0.34.11.6.3.2']]/hl7:informant[@typeCode = 'INF'][hl7:relatedEntity[@classCode = 'PAT']]"
         id="d163681e28-false-d163701e0">
      <assert role="error"
              see="https://elga.art-decor.org/epims-html-20250116T123132/tmp-1.2.40.0.34.6.0.11.3.58-2020-02-20T153320.html"
              test="string(@typeCode) = ('INF')">(epims_entry_informant): Der Wert von typeCode MUSS 'INF' sein. Gefunden: "<value-of select="@typeCode"/>"</assert>
      <assert role="error"
              see="https://elga.art-decor.org/epims-html-20250116T123132/tmp-1.2.40.0.34.6.0.11.3.58-2020-02-20T153320.html"
              test="count(hl7:relatedEntity[not(@nullFlavor)][@classCode = 'PAT']) &gt;= 1">(epims_entry_informant): Element hl7:relatedEntity[not(@nullFlavor)][@classCode = 'PAT'] ist mandatory [min 1x].</assert>
      <assert role="error"
              see="https://elga.art-decor.org/epims-html-20250116T123132/tmp-1.2.40.0.34.6.0.11.3.58-2020-02-20T153320.html"
              test="count(hl7:relatedEntity[not(@nullFlavor)][@classCode = 'PAT']) &lt;= 1">(epims_entry_informant): Element hl7:relatedEntity[not(@nullFlavor)][@classCode = 'PAT'] kommt zu häufig vor [max 1x].</assert>
   </rule>
   <!--
Template derived rules for ID: 1.2.40.0.34.6.0.11.3.58
Context: *[hl7:observation[hl7:templateId[@root = '1.2.40.0.34.6.0.11.3.57'] and hl7:templateId[@root = '1.3.6.1.4.1.19376.1.3.1.1.2'] and hl7:templateId[@root = '1.2.40.0.34.11.6.3.2']]]/hl7:observation[hl7:templateId[@root = '1.2.40.0.34.6.0.11.3.57'] and hl7:templateId[@root = '1.3.6.1.4.1.19376.1.3.1.1.2'] and hl7:templateId[@root = '1.2.40.0.34.11.6.3.2']]/hl7:informant[@typeCode = 'INF'][hl7:relatedEntity[@classCode = 'PAT']]/hl7:relatedEntity[not(@nullFlavor)][@classCode = 'PAT']
Item: (epims_entry_informant)
-->

   <rule fpi="RULC-1"
         context="*[hl7:observation[hl7:templateId[@root = '1.2.40.0.34.6.0.11.3.57'] and hl7:templateId[@root = '1.3.6.1.4.1.19376.1.3.1.1.2'] and hl7:templateId[@root = '1.2.40.0.34.11.6.3.2']]]/hl7:observation[hl7:templateId[@root = '1.2.40.0.34.6.0.11.3.57'] and hl7:templateId[@root = '1.3.6.1.4.1.19376.1.3.1.1.2'] and hl7:templateId[@root = '1.2.40.0.34.11.6.3.2']]/hl7:informant[@typeCode = 'INF'][hl7:relatedEntity[@classCode = 'PAT']]/hl7:relatedEntity[not(@nullFlavor)][@classCode = 'PAT']"
         id="d163681e32-false-d163721e0">
      <assert role="error"
              see="https://elga.art-decor.org/epims-html-20250116T123132/tmp-1.2.40.0.34.6.0.11.3.58-2020-02-20T153320.html"
              test="string(@classCode) = ('PAT')">(epims_entry_informant): Der Wert von classCode MUSS 'PAT' sein. Gefunden: "<value-of select="@classCode"/>"</assert>
      <assert role="error"
              see="https://elga.art-decor.org/epims-html-20250116T123132/tmp-1.2.40.0.34.6.0.11.3.58-2020-02-20T153320.html"
              test="count(hl7:effectiveTime[not(@nullFlavor)]) &gt;= 1">(epims_entry_informant): Element hl7:effectiveTime[not(@nullFlavor)] ist mandatory [min 1x].</assert>
      <assert role="error"
              see="https://elga.art-decor.org/epims-html-20250116T123132/tmp-1.2.40.0.34.6.0.11.3.58-2020-02-20T153320.html"
              test="count(hl7:effectiveTime[not(@nullFlavor)]) &lt;= 1">(epims_entry_informant): Element hl7:effectiveTime[not(@nullFlavor)] kommt zu häufig vor [max 1x].</assert>
   </rule>
   <!--
Template derived rules for ID: 1.2.40.0.34.6.0.11.3.58
Context: *[hl7:observation[hl7:templateId[@root = '1.2.40.0.34.6.0.11.3.57'] and hl7:templateId[@root = '1.3.6.1.4.1.19376.1.3.1.1.2'] and hl7:templateId[@root = '1.2.40.0.34.11.6.3.2']]]/hl7:observation[hl7:templateId[@root = '1.2.40.0.34.6.0.11.3.57'] and hl7:templateId[@root = '1.3.6.1.4.1.19376.1.3.1.1.2'] and hl7:templateId[@root = '1.2.40.0.34.11.6.3.2']]/hl7:informant[@typeCode = 'INF'][hl7:relatedEntity[@classCode = 'PAT']]/hl7:relatedEntity[not(@nullFlavor)][@classCode = 'PAT']/hl7:effectiveTime[not(@nullFlavor)]
Item: (epims_entry_informant)
-->

   <rule fpi="RULC-1"
         context="*[hl7:observation[hl7:templateId[@root = '1.2.40.0.34.6.0.11.3.57'] and hl7:templateId[@root = '1.3.6.1.4.1.19376.1.3.1.1.2'] and hl7:templateId[@root = '1.2.40.0.34.11.6.3.2']]]/hl7:observation[hl7:templateId[@root = '1.2.40.0.34.6.0.11.3.57'] and hl7:templateId[@root = '1.3.6.1.4.1.19376.1.3.1.1.2'] and hl7:templateId[@root = '1.2.40.0.34.11.6.3.2']]/hl7:informant[@typeCode = 'INF'][hl7:relatedEntity[@classCode = 'PAT']]/hl7:relatedEntity[not(@nullFlavor)][@classCode = 'PAT']/hl7:effectiveTime[not(@nullFlavor)]"
         id="d163681e36-false-d163741e0">
      <extends rule="TS.AT.TZ"/>
      <assert role="error"
              see="https://elga.art-decor.org/epims-html-20250116T123132/tmp-1.2.40.0.34.6.0.11.3.58-2020-02-20T153320.html"
              test="empty(@xsi:type) or resolve-QName(@xsi:type, .) = QName('urn:hl7-org:v3', 'TS')">(epims_entry_informant): Wenn eine @xsi:type Instruktion anwesend ist MUSS diese den Wert "{urn:hl7-org:v3}:TS" haben. Gefunden "{<value-of select="namespace-uri-from-QName(resolve-QName(@xsi:type,.))"/>}:<value-of select="local-name-from-QName(resolve-QName(@xsi:type,.))"/>"</assert>
      <assert role="error"
              see="https://elga.art-decor.org/epims-html-20250116T123132/tmp-1.2.40.0.34.6.0.11.3.58-2020-02-20T153320.html"
              test="not(*)">(epims_entry_informant): <value-of select="local-name()"/> with datatype TS.AT.TZ, SHOULD NOT have child elements.</assert>
   </rule>
</pattern>
