<?xml version="1.0" encoding="UTF-8"?>
<!--
Template derived pattern
===========================================
ID: 1.2.40.0.34.6.0.11.3.72
Name: Medikationseinnahme Entry
Description: 
-->
<pattern xmlns="http://purl.oclc.org/dsdl/schematron"
         id="template-1.2.40.0.34.6.0.11.3.72-2020-07-29T113517-closed">
   <title>Medikationseinnahme Entry</title>

   <!-- Checking undefined contents for template/element @isClosed="true". Match context that we did not already match -->
   <rule fpi="RUL-QQQ"
         context="*[hl7:substanceAdministration[hl7:templateId[@root = '1.2.40.0.34.6.0.11.3.72'] and hl7:templateId[@root = '2.16.840.1.113883.10.20.1.24'] and hl7:templateId[@root = '1.3.6.1.4.1.19376.1.5.3.1.4.7'] and hl7:templateId[@root = '1.3.6.1.4.1.19376.1.9.1.3.16'] and hl7:templateId[@root = '1.3.6.1.4.1.19376.1.5.3.1.4.7.1']]]/*[not(@xsi:nil = 'true')][not(self::hl7:substanceAdministration[hl7:templateId[@root = '1.2.40.0.34.6.0.11.3.72'] and hl7:templateId[@root = '2.16.840.1.113883.10.20.1.24'] and hl7:templateId[@root = '1.3.6.1.4.1.19376.1.5.3.1.4.7'] and hl7:templateId[@root = '1.3.6.1.4.1.19376.1.9.1.3.16'] and hl7:templateId[@root = '1.3.6.1.4.1.19376.1.5.3.1.4.7.1']])]"
         id="d42e77443-true-d5725607e0">
      <assert role="error"
              see="http://elga.art-decor.org/elgaambbef-html-20230118T144941/tmp-1.2.40.0.34.6.0.11.3.72-2020-07-29T113517.html"
              test="not(.)">(atcdabbr_entry_MedikationsEinnahmeEntry)/d42e77443-true-d5725607e0: '<value-of select="name(..)"/>' ist als geschlossen definiert und dieses Element '<name/>' ist nicht erlaubt oder nicht mit diesem Inhalt erlaubt. Dies kann templateId, code oder id betreffen. Erwartet:  hl7:substanceAdministration[hl7:templateId[@root = '1.2.40.0.34.6.0.11.3.72'] and hl7:templateId[@root = '2.16.840.1.113883.10.20.1.24'] and hl7:templateId[@root = '1.3.6.1.4.1.19376.1.5.3.1.4.7'] and hl7:templateId[@root = '1.3.6.1.4.1.19376.1.9.1.3.16'] and hl7:templateId[@root = '1.3.6.1.4.1.19376.1.5.3.1.4.7.1']] (rule-reference: d42e77443-true-d5725607e0)</assert>
   </rule>

   <!-- Checking undefined contents for template/element @isClosed="true". Match context that we did not already match -->
   <rule fpi="RUL-QQQ"
         context="*[hl7:substanceAdministration[hl7:templateId[@root = '1.2.40.0.34.6.0.11.3.72'] and hl7:templateId[@root = '2.16.840.1.113883.10.20.1.24'] and hl7:templateId[@root = '1.3.6.1.4.1.19376.1.5.3.1.4.7'] and hl7:templateId[@root = '1.3.6.1.4.1.19376.1.9.1.3.16'] and hl7:templateId[@root = '1.3.6.1.4.1.19376.1.5.3.1.4.7.1']]]/hl7:substanceAdministration[hl7:templateId[@root = '1.2.40.0.34.6.0.11.3.72'] and hl7:templateId[@root = '2.16.840.1.113883.10.20.1.24'] and hl7:templateId[@root = '1.3.6.1.4.1.19376.1.5.3.1.4.7'] and hl7:templateId[@root = '1.3.6.1.4.1.19376.1.9.1.3.16'] and hl7:templateId[@root = '1.3.6.1.4.1.19376.1.5.3.1.4.7.1']]/*[not(@xsi:nil = 'true')][not(self::hl7:templateId[@root = '1.2.40.0.34.6.0.11.3.72'] | self::hl7:templateId[@root = '2.16.840.1.113883.10.20.1.24'] | self::hl7:templateId[@root = '1.3.6.1.4.1.19376.1.5.3.1.4.7'] | self::hl7:templateId[@root = '1.3.6.1.4.1.19376.1.9.1.3.16'] | self::hl7:templateId[@root = '1.3.6.1.4.1.19376.1.5.3.1.4.7.1'] | self::hl7:id[not(@nullFlavor)] | self::hl7:code[@codeSystem = '2.16.840.1.113883.4.642.1.101'] | self::hl7:text[not(@nullFlavor)] | self::hl7:statusCode[@code = 'completed'] | self::hl7:effectiveTime | self::hl7:effectiveTime | self::hl7:effectiveTime | self::hl7:routeCode[@nullFlavor = 'NA'] | self::hl7:approachSiteCode[@nullFlavor = 'NA'] | self::hl7:doseQuantity | self::hl7:rateQuantity[@nullFlavor = 'NA'] | self::hl7:consumable[hl7:manufacturedProduct[hl7:templateId[@root = '1.3.6.1.4.1.19376.1.5.3.1.4.7.2'] and hl7:templateId[@root = '2.16.840.1.113883.10.20.1.53']]] | self::hl7:author[hl7:assignedAuthor] | self::hl7:author | self::hl7:entryRelationship[@typeCode='RSON'][hl7:act/hl7:templateId[@root='1.3.6.1.4.1.19376.1.5.3.1.4.4.1']] | self::hl7:entryRelationship[@typeCode='SUBJ'][hl7:act/hl7:templateId[@root='2.16.840.1.113883.10.20.1.43']] | self::hl7:entryRelationship[@typeCode='COMP'][hl7:supply] | self::hl7:entryRelationship[@typeCode='REFR'][hl7:substanceAdministration/hl7:templateId[@root='1.3.6.1.4.1.19376.1.9.1.3.10']] | self::hl7:entryRelationship[@typeCode='REFR'][hl7:substanceAdministration/hl7:templateId[@root='1.3.6.1.4.1.19376.1.9.1.3.11']] | self::hl7:entryRelationship[@typeCode='REFR'][hl7:substanceAdministration/hl7:templateId[@root='1.3.6.1.4.1.19376.1.9.1.3.12']] | self::hl7:entryRelationship[@typeCode='REFR'][hl7:substanceAdministration/hl7:templateId[@root='1.3.6.1.4.1.19376.1.9.1.3.13']] | self::hl7:entryRelationship[@typeCode='REFR'][hl7:substanceAdministration/hl7:templateId[@root='1.3.6.1.4.1.19376.1.9.1.3.14']] | self::hl7:reference[@typeCode = 'XCRPT'][hl7:externalDocument] | self::hl7:precondition[hl7:criterion])]"
         id="d42e77744-true-d5725872e0">
      <assert role="error"
              see="http://elga.art-decor.org/elgaambbef-html-20230118T144941/tmp-1.2.40.0.34.6.0.11.3.72-2020-07-29T113517.html"
              test="not(.)">(atcdabbr_entry_MedikationsEinnahmeEntry)/d42e77744-true-d5725872e0: '<value-of select="name(..)"/>' ist als geschlossen definiert und dieses Element '<name/>' ist nicht erlaubt oder nicht mit diesem Inhalt erlaubt. Dies kann templateId, code oder id betreffen. Erwartet:  hl7:templateId[@root = '1.2.40.0.34.6.0.11.3.72'] | hl7:templateId[@root = '2.16.840.1.113883.10.20.1.24'] | hl7:templateId[@root = '1.3.6.1.4.1.19376.1.5.3.1.4.7'] | hl7:templateId[@root = '1.3.6.1.4.1.19376.1.9.1.3.16'] | hl7:templateId[@root = '1.3.6.1.4.1.19376.1.5.3.1.4.7.1'] | hl7:id[not(@nullFlavor)] | hl7:code[@codeSystem = '2.16.840.1.113883.4.642.1.101'] | hl7:text[not(@nullFlavor)] | hl7:statusCode[@code = 'completed'] | hl7:effectiveTime | hl7:effectiveTime | hl7:effectiveTime | hl7:routeCode[@nullFlavor = 'NA'] | hl7:approachSiteCode[@nullFlavor = 'NA'] | hl7:doseQuantity | hl7:rateQuantity[@nullFlavor = 'NA'] | hl7:consumable[hl7:manufacturedProduct[hl7:templateId[@root = '1.3.6.1.4.1.19376.1.5.3.1.4.7.2'] and hl7:templateId[@root = '2.16.840.1.113883.10.20.1.53']]] | hl7:author[hl7:assignedAuthor] | hl7:author | hl7:entryRelationship[@typeCode='RSON'][hl7:act/hl7:templateId[@root='1.3.6.1.4.1.19376.1.5.3.1.4.4.1']] | hl7:entryRelationship[@typeCode='SUBJ'][hl7:act/hl7:templateId[@root='2.16.840.1.113883.10.20.1.43']] | hl7:entryRelationship[@typeCode='COMP'][hl7:supply] | hl7:entryRelationship[@typeCode='REFR'][hl7:substanceAdministration/hl7:templateId[@root='1.3.6.1.4.1.19376.1.9.1.3.10']] | hl7:entryRelationship[@typeCode='REFR'][hl7:substanceAdministration/hl7:templateId[@root='1.3.6.1.4.1.19376.1.9.1.3.11']] | hl7:entryRelationship[@typeCode='REFR'][hl7:substanceAdministration/hl7:templateId[@root='1.3.6.1.4.1.19376.1.9.1.3.12']] | hl7:entryRelationship[@typeCode='REFR'][hl7:substanceAdministration/hl7:templateId[@root='1.3.6.1.4.1.19376.1.9.1.3.13']] | hl7:entryRelationship[@typeCode='REFR'][hl7:substanceAdministration/hl7:templateId[@root='1.3.6.1.4.1.19376.1.9.1.3.14']] | hl7:reference[@typeCode = 'XCRPT'][hl7:externalDocument] | hl7:precondition[hl7:criterion] (rule-reference: d42e77744-true-d5725872e0)</assert>
   </rule>

   <!-- Checking undefined contents for template/element @isClosed="true". Match context that we did not already match -->
   <rule fpi="RUL-QQQ"
         context="*[hl7:substanceAdministration[hl7:templateId[@root = '1.2.40.0.34.6.0.11.3.72'] and hl7:templateId[@root = '2.16.840.1.113883.10.20.1.24'] and hl7:templateId[@root = '1.3.6.1.4.1.19376.1.5.3.1.4.7'] and hl7:templateId[@root = '1.3.6.1.4.1.19376.1.9.1.3.16'] and hl7:templateId[@root = '1.3.6.1.4.1.19376.1.5.3.1.4.7.1']]]/hl7:substanceAdministration[hl7:templateId[@root = '1.2.40.0.34.6.0.11.3.72'] and hl7:templateId[@root = '2.16.840.1.113883.10.20.1.24'] and hl7:templateId[@root = '1.3.6.1.4.1.19376.1.5.3.1.4.7'] and hl7:templateId[@root = '1.3.6.1.4.1.19376.1.9.1.3.16'] and hl7:templateId[@root = '1.3.6.1.4.1.19376.1.5.3.1.4.7.1']]/hl7:code[@codeSystem = '2.16.840.1.113883.4.642.1.101']/*[not(@xsi:nil = 'true')][not(self::hl7:translation | self::ips:designation)]"
         id="d42e77825-true-d5725927e0">
      <assert role="error"
              see="http://elga.art-decor.org/elgaambbef-html-20230118T144941/tmp-1.2.40.0.34.6.0.11.3.72-2020-07-29T113517.html"
              test="not(.)">(atcdabbr_entry_MedikationsEinnahmeEntry)/d42e77825-true-d5725927e0: '<value-of select="name(..)"/>' ist als geschlossen definiert und dieses Element '<name/>' ist nicht erlaubt oder nicht mit diesem Inhalt erlaubt. Dies kann templateId, code oder id betreffen. Erwartet:  hl7:translation | ips:designation (rule-reference: d42e77825-true-d5725927e0)</assert>
   </rule>

   <!-- Checking undefined contents for template/element @isClosed="true". Match context that we did not already match -->
   <rule fpi="RUL-QQQ"
         context="*[hl7:substanceAdministration[hl7:templateId[@root = '1.2.40.0.34.6.0.11.3.72'] and hl7:templateId[@root = '2.16.840.1.113883.10.20.1.24'] and hl7:templateId[@root = '1.3.6.1.4.1.19376.1.5.3.1.4.7'] and hl7:templateId[@root = '1.3.6.1.4.1.19376.1.9.1.3.16'] and hl7:templateId[@root = '1.3.6.1.4.1.19376.1.5.3.1.4.7.1']]]/hl7:substanceAdministration[hl7:templateId[@root = '1.2.40.0.34.6.0.11.3.72'] and hl7:templateId[@root = '2.16.840.1.113883.10.20.1.24'] and hl7:templateId[@root = '1.3.6.1.4.1.19376.1.5.3.1.4.7'] and hl7:templateId[@root = '1.3.6.1.4.1.19376.1.9.1.3.16'] and hl7:templateId[@root = '1.3.6.1.4.1.19376.1.5.3.1.4.7.1']]/hl7:text[not(@nullFlavor)]/*[not(@xsi:nil = 'true')][not(self::hl7:reference[not(@nullFlavor)])]"
         id="d42e77875-true-d5725951e0">
      <assert role="error"
              see="http://elga.art-decor.org/elgaambbef-html-20230118T144941/tmp-1.2.40.0.34.6.0.11.3.72-2020-07-29T113517.html"
              test="not(.)">(atcdabbr_entry_MedikationsEinnahmeEntry)/d42e77875-true-d5725951e0: '<value-of select="name(..)"/>' ist als geschlossen definiert und dieses Element '<name/>' ist nicht erlaubt oder nicht mit diesem Inhalt erlaubt. Dies kann templateId, code oder id betreffen. Erwartet:  hl7:reference[not(@nullFlavor)] (rule-reference: d42e77875-true-d5725951e0)</assert>
   </rule>

   <!-- Checking undefined contents for template/element @isClosed="true". Match context that we did not already match -->
   <rule fpi="RUL-QQQ"
         context="*[hl7:substanceAdministration[hl7:templateId[@root = '1.2.40.0.34.6.0.11.3.72'] and hl7:templateId[@root = '2.16.840.1.113883.10.20.1.24'] and hl7:templateId[@root = '1.3.6.1.4.1.19376.1.5.3.1.4.7'] and hl7:templateId[@root = '1.3.6.1.4.1.19376.1.9.1.3.16'] and hl7:templateId[@root = '1.3.6.1.4.1.19376.1.5.3.1.4.7.1']]]/hl7:substanceAdministration[hl7:templateId[@root = '1.2.40.0.34.6.0.11.3.72'] and hl7:templateId[@root = '2.16.840.1.113883.10.20.1.24'] and hl7:templateId[@root = '1.3.6.1.4.1.19376.1.5.3.1.4.7'] and hl7:templateId[@root = '1.3.6.1.4.1.19376.1.9.1.3.16'] and hl7:templateId[@root = '1.3.6.1.4.1.19376.1.5.3.1.4.7.1']]/hl7:consumable[hl7:manufacturedProduct[hl7:templateId[@root = '1.3.6.1.4.1.19376.1.5.3.1.4.7.2'] and hl7:templateId[@root = '2.16.840.1.113883.10.20.1.53']]]/*[not(@xsi:nil = 'true')][not(self::hl7:manufacturedProduct[hl7:templateId[@root = '1.3.6.1.4.1.19376.1.5.3.1.4.7.2'] and hl7:templateId[@root = '2.16.840.1.113883.10.20.1.53']])]"
         id="d42e78045-true-d5726020e0">
      <assert role="error"
              see="http://elga.art-decor.org/elgaambbef-html-20230118T144941/tmp-1.2.40.0.34.6.0.11.3.72-2020-07-29T113517.html"
              test="not(.)">(atcdabbr_entry_MedikationsEinnahmeEntry)/d42e78045-true-d5726020e0: '<value-of select="name(..)"/>' ist als geschlossen definiert und dieses Element '<name/>' ist nicht erlaubt oder nicht mit diesem Inhalt erlaubt. Dies kann templateId, code oder id betreffen. Erwartet:  hl7:manufacturedProduct[hl7:templateId[@root = '1.3.6.1.4.1.19376.1.5.3.1.4.7.2'] and hl7:templateId[@root = '2.16.840.1.113883.10.20.1.53']] (rule-reference: d42e78045-true-d5726020e0)</assert>
   </rule>

   <!-- Checking undefined contents for template/element @isClosed="true". Match context that we did not already match -->
   <rule fpi="RUL-QQQ"
         context="*[hl7:substanceAdministration[hl7:templateId[@root = '1.2.40.0.34.6.0.11.3.72'] and hl7:templateId[@root = '2.16.840.1.113883.10.20.1.24'] and hl7:templateId[@root = '1.3.6.1.4.1.19376.1.5.3.1.4.7'] and hl7:templateId[@root = '1.3.6.1.4.1.19376.1.9.1.3.16'] and hl7:templateId[@root = '1.3.6.1.4.1.19376.1.5.3.1.4.7.1']]]/hl7:substanceAdministration[hl7:templateId[@root = '1.2.40.0.34.6.0.11.3.72'] and hl7:templateId[@root = '2.16.840.1.113883.10.20.1.24'] and hl7:templateId[@root = '1.3.6.1.4.1.19376.1.5.3.1.4.7'] and hl7:templateId[@root = '1.3.6.1.4.1.19376.1.9.1.3.16'] and hl7:templateId[@root = '1.3.6.1.4.1.19376.1.5.3.1.4.7.1']]/hl7:consumable[hl7:manufacturedProduct[hl7:templateId[@root = '1.3.6.1.4.1.19376.1.5.3.1.4.7.2'] and hl7:templateId[@root = '2.16.840.1.113883.10.20.1.53']]]/hl7:manufacturedProduct[hl7:templateId[@root = '1.3.6.1.4.1.19376.1.5.3.1.4.7.2'] and hl7:templateId[@root = '2.16.840.1.113883.10.20.1.53']]/*[not(@xsi:nil = 'true')][not(self::hl7:templateId[@root = '1.3.6.1.4.1.19376.1.5.3.1.4.7.2'] | self::hl7:templateId[@root = '2.16.840.1.113883.10.20.1.53'] | self::hl7:manufacturedMaterial[hl7:templateId[@root = '1.2.40.0.34.11.2.3.4'] and hl7:templateId[@root = '1.3.6.1.4.1.19376.1.9.1.3.1']])]"
         id="d5726002e50-true-d5726054e0">
      <assert role="error"
              see="http://elga.art-decor.org/elgaambbef-html-20230118T144941/tmp-1.2.40.0.34.6.0.11.3.72-2020-07-29T113517.html"
              test="not(.)">(atcdabbr_entry_MedikationsEinnahmeEntry)/d5726002e50-true-d5726054e0: '<value-of select="name(..)"/>' ist als geschlossen definiert und dieses Element '<name/>' ist nicht erlaubt oder nicht mit diesem Inhalt erlaubt. Dies kann templateId, code oder id betreffen. Erwartet:  hl7:templateId[@root = '1.3.6.1.4.1.19376.1.5.3.1.4.7.2'] | hl7:templateId[@root = '2.16.840.1.113883.10.20.1.53'] | hl7:manufacturedMaterial[hl7:templateId[@root = '1.2.40.0.34.11.2.3.4'] and hl7:templateId[@root = '1.3.6.1.4.1.19376.1.9.1.3.1']] (rule-reference: d5726002e50-true-d5726054e0)</assert>
   </rule>

   <!-- Checking undefined contents for template/element @isClosed="true". Match context that we did not already match -->
   <rule fpi="RUL-QQQ"
         context="*[hl7:substanceAdministration[hl7:templateId[@root = '1.2.40.0.34.6.0.11.3.72'] and hl7:templateId[@root = '2.16.840.1.113883.10.20.1.24'] and hl7:templateId[@root = '1.3.6.1.4.1.19376.1.5.3.1.4.7'] and hl7:templateId[@root = '1.3.6.1.4.1.19376.1.9.1.3.16'] and hl7:templateId[@root = '1.3.6.1.4.1.19376.1.5.3.1.4.7.1']]]/hl7:substanceAdministration[hl7:templateId[@root = '1.2.40.0.34.6.0.11.3.72'] and hl7:templateId[@root = '2.16.840.1.113883.10.20.1.24'] and hl7:templateId[@root = '1.3.6.1.4.1.19376.1.5.3.1.4.7'] and hl7:templateId[@root = '1.3.6.1.4.1.19376.1.9.1.3.16'] and hl7:templateId[@root = '1.3.6.1.4.1.19376.1.5.3.1.4.7.1']]/hl7:consumable[hl7:manufacturedProduct[hl7:templateId[@root = '1.3.6.1.4.1.19376.1.5.3.1.4.7.2'] and hl7:templateId[@root = '2.16.840.1.113883.10.20.1.53']]]/hl7:manufacturedProduct[hl7:templateId[@root = '1.3.6.1.4.1.19376.1.5.3.1.4.7.2'] and hl7:templateId[@root = '2.16.840.1.113883.10.20.1.53']]/hl7:manufacturedMaterial[hl7:templateId[@root = '1.2.40.0.34.11.2.3.4'] and hl7:templateId[@root = '1.3.6.1.4.1.19376.1.9.1.3.1']]/*[not(@xsi:nil = 'true')][not(self::hl7:templateId[@root = '1.2.40.0.34.11.2.3.4'] | self::hl7:templateId[@root = '1.3.6.1.4.1.19376.1.9.1.3.1'] | self::hl7:code[@codeSystem = '1.2.40.0.34.4.16' or @codeSystem = '1.2.40.0.34.4.17' or @nullFlavor] | self::hl7:name | self::pharm:formCode[@codeSystem = '1.2.40.0.10.1.4.3.4.3.5' or @nullFlavor] | self::pharm:asContent[@classCode = 'CONT'][pharm:containerPackagedMedicine[@classCode = 'CONT'][@determinerCode = 'INSTANCE']] | self::pharm:ingredient[@classCode = 'ACTI'][pharm:ingredient[@classCode = 'MMAT'][@determinerCode = 'KIND']])]"
         id="d5726002e64-true-d5726120e0">
      <assert role="error"
              see="http://elga.art-decor.org/elgaambbef-html-20230118T144941/tmp-1.2.40.0.34.6.0.11.3.72-2020-07-29T113517.html"
              test="not(.)">(atcdabbr_entry_MedikationsEinnahmeEntry)/d5726002e64-true-d5726120e0: '<value-of select="name(..)"/>' ist als geschlossen definiert und dieses Element '<name/>' ist nicht erlaubt oder nicht mit diesem Inhalt erlaubt. Dies kann templateId, code oder id betreffen. Erwartet:  hl7:templateId[@root = '1.2.40.0.34.11.2.3.4'] | hl7:templateId[@root = '1.3.6.1.4.1.19376.1.9.1.3.1'] | hl7:code[@codeSystem = '1.2.40.0.34.4.16' or @codeSystem = '1.2.40.0.34.4.17' or @nullFlavor] | hl7:name | pharm:formCode[@codeSystem = '1.2.40.0.10.1.4.3.4.3.5' or @nullFlavor] | pharm:asContent[@classCode = 'CONT'][pharm:containerPackagedMedicine[@classCode = 'CONT'][@determinerCode = 'INSTANCE']] | pharm:ingredient[@classCode = 'ACTI'][pharm:ingredient[@classCode = 'MMAT'][@determinerCode = 'KIND']] (rule-reference: d5726002e64-true-d5726120e0)</assert>
   </rule>

   <!-- Checking undefined contents for template/element @isClosed="true". Match context that we did not already match -->
   <rule fpi="RUL-QQQ"
         context="*[hl7:substanceAdministration[hl7:templateId[@root = '1.2.40.0.34.6.0.11.3.72'] and hl7:templateId[@root = '2.16.840.1.113883.10.20.1.24'] and hl7:templateId[@root = '1.3.6.1.4.1.19376.1.5.3.1.4.7'] and hl7:templateId[@root = '1.3.6.1.4.1.19376.1.9.1.3.16'] and hl7:templateId[@root = '1.3.6.1.4.1.19376.1.5.3.1.4.7.1']]]/hl7:substanceAdministration[hl7:templateId[@root = '1.2.40.0.34.6.0.11.3.72'] and hl7:templateId[@root = '2.16.840.1.113883.10.20.1.24'] and hl7:templateId[@root = '1.3.6.1.4.1.19376.1.5.3.1.4.7'] and hl7:templateId[@root = '1.3.6.1.4.1.19376.1.9.1.3.16'] and hl7:templateId[@root = '1.3.6.1.4.1.19376.1.5.3.1.4.7.1']]/hl7:consumable[hl7:manufacturedProduct[hl7:templateId[@root = '1.3.6.1.4.1.19376.1.5.3.1.4.7.2'] and hl7:templateId[@root = '2.16.840.1.113883.10.20.1.53']]]/hl7:manufacturedProduct[hl7:templateId[@root = '1.3.6.1.4.1.19376.1.5.3.1.4.7.2'] and hl7:templateId[@root = '2.16.840.1.113883.10.20.1.53']]/hl7:manufacturedMaterial[hl7:templateId[@root = '1.2.40.0.34.11.2.3.4'] and hl7:templateId[@root = '1.3.6.1.4.1.19376.1.9.1.3.1']]/hl7:code[@codeSystem = '1.2.40.0.34.4.16' or @codeSystem = '1.2.40.0.34.4.17' or @nullFlavor]/*[not(@xsi:nil = 'true')][not(self::hl7:originalText | self::hl7:translation[@codeSystem = '1.2.40.0.34.4.17' or @nullFlavor])]"
         id="d5726002e80-true-d5726154e0">
      <assert role="error"
              see="http://elga.art-decor.org/elgaambbef-html-20230118T144941/tmp-1.2.40.0.34.6.0.11.3.72-2020-07-29T113517.html"
              test="not(.)">(atcdabbr_entry_MedikationsEinnahmeEntry)/d5726002e80-true-d5726154e0: '<value-of select="name(..)"/>' ist als geschlossen definiert und dieses Element '<name/>' ist nicht erlaubt oder nicht mit diesem Inhalt erlaubt. Dies kann templateId, code oder id betreffen. Erwartet:  hl7:originalText | hl7:translation[@codeSystem = '1.2.40.0.34.4.17' or @nullFlavor] (rule-reference: d5726002e80-true-d5726154e0)</assert>
   </rule>

   <!-- Checking undefined contents for template/element @isClosed="true". Match context that we did not already match -->
   <rule fpi="RUL-QQQ"
         context="*[hl7:substanceAdministration[hl7:templateId[@root = '1.2.40.0.34.6.0.11.3.72'] and hl7:templateId[@root = '2.16.840.1.113883.10.20.1.24'] and hl7:templateId[@root = '1.3.6.1.4.1.19376.1.5.3.1.4.7'] and hl7:templateId[@root = '1.3.6.1.4.1.19376.1.9.1.3.16'] and hl7:templateId[@root = '1.3.6.1.4.1.19376.1.5.3.1.4.7.1']]]/hl7:substanceAdministration[hl7:templateId[@root = '1.2.40.0.34.6.0.11.3.72'] and hl7:templateId[@root = '2.16.840.1.113883.10.20.1.24'] and hl7:templateId[@root = '1.3.6.1.4.1.19376.1.5.3.1.4.7'] and hl7:templateId[@root = '1.3.6.1.4.1.19376.1.9.1.3.16'] and hl7:templateId[@root = '1.3.6.1.4.1.19376.1.5.3.1.4.7.1']]/hl7:consumable[hl7:manufacturedProduct[hl7:templateId[@root = '1.3.6.1.4.1.19376.1.5.3.1.4.7.2'] and hl7:templateId[@root = '2.16.840.1.113883.10.20.1.53']]]/hl7:manufacturedProduct[hl7:templateId[@root = '1.3.6.1.4.1.19376.1.5.3.1.4.7.2'] and hl7:templateId[@root = '2.16.840.1.113883.10.20.1.53']]/hl7:manufacturedMaterial[hl7:templateId[@root = '1.2.40.0.34.11.2.3.4'] and hl7:templateId[@root = '1.3.6.1.4.1.19376.1.9.1.3.1']]/pharm:asContent[@classCode = 'CONT'][pharm:containerPackagedMedicine[@classCode = 'CONT'][@determinerCode = 'INSTANCE']]/*[not(@xsi:nil = 'true')][not(self::pharm:containerPackagedMedicine[not(@nullFlavor)][@classCode = 'CONT'][@determinerCode = 'INSTANCE'])]"
         id="d5726002e258-true-d5726190e0">
      <assert role="error"
              see="http://elga.art-decor.org/elgaambbef-html-20230118T144941/tmp-1.2.40.0.34.6.0.11.3.72-2020-07-29T113517.html"
              test="not(.)">(atcdabbr_entry_MedikationsEinnahmeEntry)/d5726002e258-true-d5726190e0: '<value-of select="name(..)"/>' ist als geschlossen definiert und dieses Element '<name/>' ist nicht erlaubt oder nicht mit diesem Inhalt erlaubt. Dies kann templateId, code oder id betreffen. Erwartet:  pharm:containerPackagedMedicine[not(@nullFlavor)][@classCode = 'CONT'][@determinerCode = 'INSTANCE'] (rule-reference: d5726002e258-true-d5726190e0)</assert>
   </rule>

   <!-- Checking undefined contents for template/element @isClosed="true". Match context that we did not already match -->
   <rule fpi="RUL-QQQ"
         context="*[hl7:substanceAdministration[hl7:templateId[@root = '1.2.40.0.34.6.0.11.3.72'] and hl7:templateId[@root = '2.16.840.1.113883.10.20.1.24'] and hl7:templateId[@root = '1.3.6.1.4.1.19376.1.5.3.1.4.7'] and hl7:templateId[@root = '1.3.6.1.4.1.19376.1.9.1.3.16'] and hl7:templateId[@root = '1.3.6.1.4.1.19376.1.5.3.1.4.7.1']]]/hl7:substanceAdministration[hl7:templateId[@root = '1.2.40.0.34.6.0.11.3.72'] and hl7:templateId[@root = '2.16.840.1.113883.10.20.1.24'] and hl7:templateId[@root = '1.3.6.1.4.1.19376.1.5.3.1.4.7'] and hl7:templateId[@root = '1.3.6.1.4.1.19376.1.9.1.3.16'] and hl7:templateId[@root = '1.3.6.1.4.1.19376.1.5.3.1.4.7.1']]/hl7:consumable[hl7:manufacturedProduct[hl7:templateId[@root = '1.3.6.1.4.1.19376.1.5.3.1.4.7.2'] and hl7:templateId[@root = '2.16.840.1.113883.10.20.1.53']]]/hl7:manufacturedProduct[hl7:templateId[@root = '1.3.6.1.4.1.19376.1.5.3.1.4.7.2'] and hl7:templateId[@root = '2.16.840.1.113883.10.20.1.53']]/hl7:manufacturedMaterial[hl7:templateId[@root = '1.2.40.0.34.11.2.3.4'] and hl7:templateId[@root = '1.3.6.1.4.1.19376.1.9.1.3.1']]/pharm:asContent[@classCode = 'CONT'][pharm:containerPackagedMedicine[@classCode = 'CONT'][@determinerCode = 'INSTANCE']]/pharm:containerPackagedMedicine[not(@nullFlavor)][@classCode = 'CONT'][@determinerCode = 'INSTANCE']/*[not(@xsi:nil = 'true')][not(self::pharm:capacityQuantity[not(@nullFlavor)])]"
         id="d5726002e271-true-d5726204e0">
      <assert role="error"
              see="http://elga.art-decor.org/elgaambbef-html-20230118T144941/tmp-1.2.40.0.34.6.0.11.3.72-2020-07-29T113517.html"
              test="not(.)">(atcdabbr_entry_MedikationsEinnahmeEntry)/d5726002e271-true-d5726204e0: '<value-of select="name(..)"/>' ist als geschlossen definiert und dieses Element '<name/>' ist nicht erlaubt oder nicht mit diesem Inhalt erlaubt. Dies kann templateId, code oder id betreffen. Erwartet:  pharm:capacityQuantity[not(@nullFlavor)] (rule-reference: d5726002e271-true-d5726204e0)</assert>
   </rule>

   <!-- Checking undefined contents for template/element @isClosed="true". Match context that we did not already match -->
   <rule fpi="RUL-QQQ"
         context="*[hl7:substanceAdministration[hl7:templateId[@root = '1.2.40.0.34.6.0.11.3.72'] and hl7:templateId[@root = '2.16.840.1.113883.10.20.1.24'] and hl7:templateId[@root = '1.3.6.1.4.1.19376.1.5.3.1.4.7'] and hl7:templateId[@root = '1.3.6.1.4.1.19376.1.9.1.3.16'] and hl7:templateId[@root = '1.3.6.1.4.1.19376.1.5.3.1.4.7.1']]]/hl7:substanceAdministration[hl7:templateId[@root = '1.2.40.0.34.6.0.11.3.72'] and hl7:templateId[@root = '2.16.840.1.113883.10.20.1.24'] and hl7:templateId[@root = '1.3.6.1.4.1.19376.1.5.3.1.4.7'] and hl7:templateId[@root = '1.3.6.1.4.1.19376.1.9.1.3.16'] and hl7:templateId[@root = '1.3.6.1.4.1.19376.1.5.3.1.4.7.1']]/hl7:consumable[hl7:manufacturedProduct[hl7:templateId[@root = '1.3.6.1.4.1.19376.1.5.3.1.4.7.2'] and hl7:templateId[@root = '2.16.840.1.113883.10.20.1.53']]]/hl7:manufacturedProduct[hl7:templateId[@root = '1.3.6.1.4.1.19376.1.5.3.1.4.7.2'] and hl7:templateId[@root = '2.16.840.1.113883.10.20.1.53']]/hl7:manufacturedMaterial[hl7:templateId[@root = '1.2.40.0.34.11.2.3.4'] and hl7:templateId[@root = '1.3.6.1.4.1.19376.1.9.1.3.1']]/pharm:ingredient[@classCode = 'ACTI'][pharm:ingredient[@classCode = 'MMAT'][@determinerCode = 'KIND']]/*[not(@xsi:nil = 'true')][not(self::pharm:ingredient[not(@nullFlavor)][@classCode = 'MMAT'][@determinerCode = 'KIND'])]"
         id="d5726002e304-true-d5726223e0">
      <assert role="error"
              see="http://elga.art-decor.org/elgaambbef-html-20230118T144941/tmp-1.2.40.0.34.6.0.11.3.72-2020-07-29T113517.html"
              test="not(.)">(atcdabbr_entry_MedikationsEinnahmeEntry)/d5726002e304-true-d5726223e0: '<value-of select="name(..)"/>' ist als geschlossen definiert und dieses Element '<name/>' ist nicht erlaubt oder nicht mit diesem Inhalt erlaubt. Dies kann templateId, code oder id betreffen. Erwartet:  pharm:ingredient[not(@nullFlavor)][@classCode = 'MMAT'][@determinerCode = 'KIND'] (rule-reference: d5726002e304-true-d5726223e0)</assert>
   </rule>

   <!-- Checking undefined contents for template/element @isClosed="true". Match context that we did not already match -->
   <rule fpi="RUL-QQQ"
         context="*[hl7:substanceAdministration[hl7:templateId[@root = '1.2.40.0.34.6.0.11.3.72'] and hl7:templateId[@root = '2.16.840.1.113883.10.20.1.24'] and hl7:templateId[@root = '1.3.6.1.4.1.19376.1.5.3.1.4.7'] and hl7:templateId[@root = '1.3.6.1.4.1.19376.1.9.1.3.16'] and hl7:templateId[@root = '1.3.6.1.4.1.19376.1.5.3.1.4.7.1']]]/hl7:substanceAdministration[hl7:templateId[@root = '1.2.40.0.34.6.0.11.3.72'] and hl7:templateId[@root = '2.16.840.1.113883.10.20.1.24'] and hl7:templateId[@root = '1.3.6.1.4.1.19376.1.5.3.1.4.7'] and hl7:templateId[@root = '1.3.6.1.4.1.19376.1.9.1.3.16'] and hl7:templateId[@root = '1.3.6.1.4.1.19376.1.5.3.1.4.7.1']]/hl7:consumable[hl7:manufacturedProduct[hl7:templateId[@root = '1.3.6.1.4.1.19376.1.5.3.1.4.7.2'] and hl7:templateId[@root = '2.16.840.1.113883.10.20.1.53']]]/hl7:manufacturedProduct[hl7:templateId[@root = '1.3.6.1.4.1.19376.1.5.3.1.4.7.2'] and hl7:templateId[@root = '2.16.840.1.113883.10.20.1.53']]/hl7:manufacturedMaterial[hl7:templateId[@root = '1.2.40.0.34.11.2.3.4'] and hl7:templateId[@root = '1.3.6.1.4.1.19376.1.9.1.3.1']]/pharm:ingredient[@classCode = 'ACTI'][pharm:ingredient[@classCode = 'MMAT'][@determinerCode = 'KIND']]/pharm:ingredient[not(@nullFlavor)][@classCode = 'MMAT'][@determinerCode = 'KIND']/*[not(@xsi:nil = 'true')][not(self::pharm:code[@codeSystem = '2.16.840.1.113883.6.73' or @codeSystem = '1.2.40.0.34.5.156' or @nullFlavor] | self::pharm:name[not(@nullFlavor)])]"
         id="d5726002e340-true-d5726244e0">
      <assert role="error"
              see="http://elga.art-decor.org/elgaambbef-html-20230118T144941/tmp-1.2.40.0.34.6.0.11.3.72-2020-07-29T113517.html"
              test="not(.)">(atcdabbr_entry_MedikationsEinnahmeEntry)/d5726002e340-true-d5726244e0: '<value-of select="name(..)"/>' ist als geschlossen definiert und dieses Element '<name/>' ist nicht erlaubt oder nicht mit diesem Inhalt erlaubt. Dies kann templateId, code oder id betreffen. Erwartet:  pharm:code[@codeSystem = '2.16.840.1.113883.6.73' or @codeSystem = '1.2.40.0.34.5.156' or @nullFlavor] | pharm:name[not(@nullFlavor)] (rule-reference: d5726002e340-true-d5726244e0)</assert>
   </rule>

   <!-- Checking undefined contents for template/element @isClosed="true". Match context that we did not already match -->
   <rule fpi="RUL-QQQ"
         context="*[hl7:substanceAdministration[hl7:templateId[@root = '1.2.40.0.34.6.0.11.3.72'] and hl7:templateId[@root = '2.16.840.1.113883.10.20.1.24'] and hl7:templateId[@root = '1.3.6.1.4.1.19376.1.5.3.1.4.7'] and hl7:templateId[@root = '1.3.6.1.4.1.19376.1.9.1.3.16'] and hl7:templateId[@root = '1.3.6.1.4.1.19376.1.5.3.1.4.7.1']]]/hl7:substanceAdministration[hl7:templateId[@root = '1.2.40.0.34.6.0.11.3.72'] and hl7:templateId[@root = '2.16.840.1.113883.10.20.1.24'] and hl7:templateId[@root = '1.3.6.1.4.1.19376.1.5.3.1.4.7'] and hl7:templateId[@root = '1.3.6.1.4.1.19376.1.9.1.3.16'] and hl7:templateId[@root = '1.3.6.1.4.1.19376.1.5.3.1.4.7.1']]/hl7:consumable[hl7:manufacturedProduct[hl7:templateId[@root = '1.3.6.1.4.1.19376.1.5.3.1.4.7.2'] and hl7:templateId[@root = '2.16.840.1.113883.10.20.1.53']]]/hl7:manufacturedProduct[hl7:templateId[@root = '1.3.6.1.4.1.19376.1.5.3.1.4.7.2'] and hl7:templateId[@root = '2.16.840.1.113883.10.20.1.53']]/hl7:manufacturedMaterial[hl7:templateId[@root = '1.2.40.0.34.11.2.3.4'] and hl7:templateId[@root = '1.3.6.1.4.1.19376.1.9.1.3.1']]/pharm:ingredient[@classCode = 'ACTI'][pharm:ingredient[@classCode = 'MMAT'][@determinerCode = 'KIND']]/pharm:ingredient[not(@nullFlavor)][@classCode = 'MMAT'][@determinerCode = 'KIND']/pharm:code[@codeSystem = '2.16.840.1.113883.6.73' or @codeSystem = '1.2.40.0.34.5.156' or @nullFlavor]/*[not(@xsi:nil = 'true')][not(self::hl7:originalText | self::hl7:translation)]"
         id="d5726002e349-true-d5726264e0">
      <assert role="error"
              see="http://elga.art-decor.org/elgaambbef-html-20230118T144941/tmp-1.2.40.0.34.6.0.11.3.72-2020-07-29T113517.html"
              test="not(.)">(atcdabbr_entry_MedikationsEinnahmeEntry)/d5726002e349-true-d5726264e0: '<value-of select="name(..)"/>' ist als geschlossen definiert und dieses Element '<name/>' ist nicht erlaubt oder nicht mit diesem Inhalt erlaubt. Dies kann templateId, code oder id betreffen. Erwartet:  hl7:originalText | hl7:translation (rule-reference: d5726002e349-true-d5726264e0)</assert>
   </rule>

   <!-- Checking undefined contents for template/element @isClosed="true". Match context that we did not already match -->
   <rule fpi="RUL-QQQ"
         context="*[hl7:substanceAdministration[hl7:templateId[@root = '1.2.40.0.34.6.0.11.3.72'] and hl7:templateId[@root = '2.16.840.1.113883.10.20.1.24'] and hl7:templateId[@root = '1.3.6.1.4.1.19376.1.5.3.1.4.7'] and hl7:templateId[@root = '1.3.6.1.4.1.19376.1.9.1.3.16'] and hl7:templateId[@root = '1.3.6.1.4.1.19376.1.5.3.1.4.7.1']]]/hl7:substanceAdministration[hl7:templateId[@root = '1.2.40.0.34.6.0.11.3.72'] and hl7:templateId[@root = '2.16.840.1.113883.10.20.1.24'] and hl7:templateId[@root = '1.3.6.1.4.1.19376.1.5.3.1.4.7'] and hl7:templateId[@root = '1.3.6.1.4.1.19376.1.9.1.3.16'] and hl7:templateId[@root = '1.3.6.1.4.1.19376.1.5.3.1.4.7.1']]/hl7:author[hl7:assignedAuthor]/*[not(@xsi:nil = 'true')][not(self::hl7:functionCode | self::hl7:time[not(@nullFlavor)] | self::hl7:time[@nullFlavor='UNK'] | self::hl7:assignedAuthor)]"
         id="d42e78096-true-d5726406e0">
      <assert role="error"
              see="http://elga.art-decor.org/elgaambbef-html-20230118T144941/tmp-1.2.40.0.34.6.0.11.3.72-2020-07-29T113517.html"
              test="not(.)">(atcdabbr_entry_MedikationsEinnahmeEntry)/d42e78096-true-d5726406e0: '<value-of select="name(..)"/>' ist als geschlossen definiert und dieses Element '<name/>' ist nicht erlaubt oder nicht mit diesem Inhalt erlaubt. Dies kann templateId, code oder id betreffen. Erwartet:  hl7:functionCode | hl7:time[not(@nullFlavor)] | hl7:time[@nullFlavor='UNK'] | hl7:assignedAuthor (rule-reference: d42e78096-true-d5726406e0)</assert>
   </rule>

   <!-- Checking undefined contents for template/element @isClosed="true". Match context that we did not already match -->
   <rule fpi="RUL-QQQ"
         context="*[hl7:substanceAdministration[hl7:templateId[@root = '1.2.40.0.34.6.0.11.3.72'] and hl7:templateId[@root = '2.16.840.1.113883.10.20.1.24'] and hl7:templateId[@root = '1.3.6.1.4.1.19376.1.5.3.1.4.7'] and hl7:templateId[@root = '1.3.6.1.4.1.19376.1.9.1.3.16'] and hl7:templateId[@root = '1.3.6.1.4.1.19376.1.5.3.1.4.7.1']]]/hl7:substanceAdministration[hl7:templateId[@root = '1.2.40.0.34.6.0.11.3.72'] and hl7:templateId[@root = '2.16.840.1.113883.10.20.1.24'] and hl7:templateId[@root = '1.3.6.1.4.1.19376.1.5.3.1.4.7'] and hl7:templateId[@root = '1.3.6.1.4.1.19376.1.9.1.3.16'] and hl7:templateId[@root = '1.3.6.1.4.1.19376.1.5.3.1.4.7.1']]/hl7:author[hl7:assignedAuthor]/hl7:assignedAuthor/*[not(@xsi:nil = 'true')][not(self::hl7:id[not(@nullFlavor)] | self::hl7:id[@nullFlavor='UNK'] | self::hl7:code[not(@nullFlavor)] | self::hl7:addr[not(@nullFlavor)] | self::hl7:telecom[not(@nullFlavor)] | self::hl7:assignedPerson | self::hl7:assignedAuthoringDevice | self::hl7:representedOrganization)]"
         id="d5726284e42-true-d5726514e0">
      <assert role="error"
              see="http://elga.art-decor.org/elgaambbef-html-20230118T144941/tmp-1.2.40.0.34.6.0.11.3.72-2020-07-29T113517.html"
              test="not(.)">(atcdabbr_entry_MedikationsEinnahmeEntry)/d5726284e42-true-d5726514e0: '<value-of select="name(..)"/>' ist als geschlossen definiert und dieses Element '<name/>' ist nicht erlaubt oder nicht mit diesem Inhalt erlaubt. Dies kann templateId, code oder id betreffen. Erwartet:  hl7:id[not(@nullFlavor)] | hl7:id[@nullFlavor='UNK'] | hl7:code[not(@nullFlavor)] | hl7:addr[not(@nullFlavor)] | hl7:telecom[not(@nullFlavor)] | hl7:assignedPerson | hl7:assignedAuthoringDevice | hl7:representedOrganization (rule-reference: d5726284e42-true-d5726514e0)</assert>
   </rule>

   <!-- Checking undefined contents for template/element @isClosed="true". Match context that we did not already match -->
   <rule fpi="RUL-QQQ"
         context="*[hl7:substanceAdministration[hl7:templateId[@root = '1.2.40.0.34.6.0.11.3.72'] and hl7:templateId[@root = '2.16.840.1.113883.10.20.1.24'] and hl7:templateId[@root = '1.3.6.1.4.1.19376.1.5.3.1.4.7'] and hl7:templateId[@root = '1.3.6.1.4.1.19376.1.9.1.3.16'] and hl7:templateId[@root = '1.3.6.1.4.1.19376.1.5.3.1.4.7.1']]]/hl7:substanceAdministration[hl7:templateId[@root = '1.2.40.0.34.6.0.11.3.72'] and hl7:templateId[@root = '2.16.840.1.113883.10.20.1.24'] and hl7:templateId[@root = '1.3.6.1.4.1.19376.1.5.3.1.4.7'] and hl7:templateId[@root = '1.3.6.1.4.1.19376.1.9.1.3.16'] and hl7:templateId[@root = '1.3.6.1.4.1.19376.1.5.3.1.4.7.1']]/hl7:author[hl7:assignedAuthor]/hl7:assignedAuthor/hl7:addr[not(@nullFlavor)]/*[not(@xsi:nil = 'true')][not(self::hl7:streetAddressLine | self::hl7:streetName | self::hl7:houseNumber | self::hl7:postalCode[not(@nullFlavor)] | self::hl7:city[not(@nullFlavor)] | self::hl7:state | self::hl7:country[not(@nullFlavor)] | self::hl7:additionalLocator)]"
         id="d5726284e61-true-d5726573e0">
      <assert role="error"
              see="http://elga.art-decor.org/elgaambbef-html-20230118T144941/tmp-1.2.40.0.34.6.0.11.3.72-2020-07-29T113517.html"
              test="not(.)">(atcdabbr_entry_MedikationsEinnahmeEntry)/d5726284e61-true-d5726573e0: '<value-of select="name(..)"/>' ist als geschlossen definiert und dieses Element '<name/>' ist nicht erlaubt oder nicht mit diesem Inhalt erlaubt. Dies kann templateId, code oder id betreffen. Erwartet:  hl7:streetAddressLine | hl7:streetName | hl7:houseNumber | hl7:postalCode[not(@nullFlavor)] | hl7:city[not(@nullFlavor)] | hl7:state | hl7:country[not(@nullFlavor)] | hl7:additionalLocator (rule-reference: d5726284e61-true-d5726573e0)</assert>
   </rule>

   <!-- Checking undefined contents for template/element @isClosed="true". Match context that we did not already match -->
   <rule fpi="RUL-QQQ"
         context="*[hl7:substanceAdministration[hl7:templateId[@root = '1.2.40.0.34.6.0.11.3.72'] and hl7:templateId[@root = '2.16.840.1.113883.10.20.1.24'] and hl7:templateId[@root = '1.3.6.1.4.1.19376.1.5.3.1.4.7'] and hl7:templateId[@root = '1.3.6.1.4.1.19376.1.9.1.3.16'] and hl7:templateId[@root = '1.3.6.1.4.1.19376.1.5.3.1.4.7.1']]]/hl7:substanceAdministration[hl7:templateId[@root = '1.2.40.0.34.6.0.11.3.72'] and hl7:templateId[@root = '2.16.840.1.113883.10.20.1.24'] and hl7:templateId[@root = '1.3.6.1.4.1.19376.1.5.3.1.4.7'] and hl7:templateId[@root = '1.3.6.1.4.1.19376.1.9.1.3.16'] and hl7:templateId[@root = '1.3.6.1.4.1.19376.1.5.3.1.4.7.1']]/hl7:author[hl7:assignedAuthor]/hl7:assignedAuthor/hl7:assignedPerson/*[not(@xsi:nil = 'true')][not(self::hl7:name[not(@nullFlavor)] | self::hl7:name[@nullFlavor='UNK'] | self::hl7:name[@nullFlavor='MSK'])]"
         id="d5726284e104-true-d5726630e0">
      <assert role="error"
              see="http://elga.art-decor.org/elgaambbef-html-20230118T144941/tmp-1.2.40.0.34.6.0.11.3.72-2020-07-29T113517.html"
              test="not(.)">(atcdabbr_entry_MedikationsEinnahmeEntry)/d5726284e104-true-d5726630e0: '<value-of select="name(..)"/>' ist als geschlossen definiert und dieses Element '<name/>' ist nicht erlaubt oder nicht mit diesem Inhalt erlaubt. Dies kann templateId, code oder id betreffen. Erwartet:  hl7:name[not(@nullFlavor)] | hl7:name[@nullFlavor='UNK'] | hl7:name[@nullFlavor='MSK'] (rule-reference: d5726284e104-true-d5726630e0)</assert>
   </rule>

   <!-- Checking undefined contents for template/element @isClosed="true". Match context that we did not already match -->
   <rule fpi="RUL-QQQ"
         context="*[hl7:substanceAdministration[hl7:templateId[@root = '1.2.40.0.34.6.0.11.3.72'] and hl7:templateId[@root = '2.16.840.1.113883.10.20.1.24'] and hl7:templateId[@root = '1.3.6.1.4.1.19376.1.5.3.1.4.7'] and hl7:templateId[@root = '1.3.6.1.4.1.19376.1.9.1.3.16'] and hl7:templateId[@root = '1.3.6.1.4.1.19376.1.5.3.1.4.7.1']]]/hl7:substanceAdministration[hl7:templateId[@root = '1.2.40.0.34.6.0.11.3.72'] and hl7:templateId[@root = '2.16.840.1.113883.10.20.1.24'] and hl7:templateId[@root = '1.3.6.1.4.1.19376.1.5.3.1.4.7'] and hl7:templateId[@root = '1.3.6.1.4.1.19376.1.9.1.3.16'] and hl7:templateId[@root = '1.3.6.1.4.1.19376.1.5.3.1.4.7.1']]/hl7:author[hl7:assignedAuthor]/hl7:assignedAuthor/hl7:assignedPerson/hl7:name[not(@nullFlavor)]/*[not(@xsi:nil = 'true')][not(self::hl7:prefix | self::hl7:family[not(@nullFlavor)] | self::hl7:given[not(@nullFlavor)] | self::hl7:suffix)]"
         id="d5726634e91-true-d5726664e0">
      <assert role="error"
              see="http://elga.art-decor.org/elgaambbef-html-20230118T144941/tmp-1.2.40.0.34.6.0.11.9.6-2021-02-19T133649.html"
              test="not(.)">(atcdabbr_other_PersonNameCompilationG2)/d5726634e91-true-d5726664e0: '<value-of select="name(..)"/>' ist als geschlossen definiert und dieses Element '<name/>' ist nicht erlaubt oder nicht mit diesem Inhalt erlaubt. Dies kann templateId, code oder id betreffen. Erwartet:  hl7:prefix | hl7:family[not(@nullFlavor)] | hl7:given[not(@nullFlavor)] | hl7:suffix (rule-reference: d5726634e91-true-d5726664e0)</assert>
   </rule>

   <!-- Checking undefined contents for template/element @isClosed="true". Match context that we did not already match -->
   <rule fpi="RUL-QQQ"
         context="*[hl7:substanceAdministration[hl7:templateId[@root = '1.2.40.0.34.6.0.11.3.72'] and hl7:templateId[@root = '2.16.840.1.113883.10.20.1.24'] and hl7:templateId[@root = '1.3.6.1.4.1.19376.1.5.3.1.4.7'] and hl7:templateId[@root = '1.3.6.1.4.1.19376.1.9.1.3.16'] and hl7:templateId[@root = '1.3.6.1.4.1.19376.1.5.3.1.4.7.1']]]/hl7:substanceAdministration[hl7:templateId[@root = '1.2.40.0.34.6.0.11.3.72'] and hl7:templateId[@root = '2.16.840.1.113883.10.20.1.24'] and hl7:templateId[@root = '1.3.6.1.4.1.19376.1.5.3.1.4.7'] and hl7:templateId[@root = '1.3.6.1.4.1.19376.1.9.1.3.16'] and hl7:templateId[@root = '1.3.6.1.4.1.19376.1.5.3.1.4.7.1']]/hl7:author[hl7:assignedAuthor]/hl7:assignedAuthor/hl7:assignedAuthoringDevice/*[not(@xsi:nil = 'true')][not(self::hl7:manufacturerModelName[not(@nullFlavor)] | self::hl7:softwareName[not(@nullFlavor)])]"
         id="d5726284e127-true-d5726712e0">
      <assert role="error"
              see="http://elga.art-decor.org/elgaambbef-html-20230118T144941/tmp-1.2.40.0.34.6.0.11.3.72-2020-07-29T113517.html"
              test="not(.)">(atcdabbr_entry_MedikationsEinnahmeEntry)/d5726284e127-true-d5726712e0: '<value-of select="name(..)"/>' ist als geschlossen definiert und dieses Element '<name/>' ist nicht erlaubt oder nicht mit diesem Inhalt erlaubt. Dies kann templateId, code oder id betreffen. Erwartet:  hl7:manufacturerModelName[not(@nullFlavor)] | hl7:softwareName[not(@nullFlavor)] (rule-reference: d5726284e127-true-d5726712e0)</assert>
   </rule>

   <!-- Checking undefined contents for template/element @isClosed="true". Match context that we did not already match -->
   <rule fpi="RUL-QQQ"
         context="*[hl7:substanceAdministration[hl7:templateId[@root = '1.2.40.0.34.6.0.11.3.72'] and hl7:templateId[@root = '2.16.840.1.113883.10.20.1.24'] and hl7:templateId[@root = '1.3.6.1.4.1.19376.1.5.3.1.4.7'] and hl7:templateId[@root = '1.3.6.1.4.1.19376.1.9.1.3.16'] and hl7:templateId[@root = '1.3.6.1.4.1.19376.1.5.3.1.4.7.1']]]/hl7:substanceAdministration[hl7:templateId[@root = '1.2.40.0.34.6.0.11.3.72'] and hl7:templateId[@root = '2.16.840.1.113883.10.20.1.24'] and hl7:templateId[@root = '1.3.6.1.4.1.19376.1.5.3.1.4.7'] and hl7:templateId[@root = '1.3.6.1.4.1.19376.1.9.1.3.16'] and hl7:templateId[@root = '1.3.6.1.4.1.19376.1.5.3.1.4.7.1']]/hl7:author[hl7:assignedAuthor]/hl7:assignedAuthor/hl7:representedOrganization/*[not(@xsi:nil = 'true')][not(self::hl7:id[not(@nullFlavor)] | self::hl7:name[not(@nullFlavor)] | self::hl7:telecom[not(@nullFlavor)] | self::hl7:addr[not(@nullFlavor)])]"
         id="d5726284e143-true-d5726757e0">
      <assert role="error"
              see="http://elga.art-decor.org/elgaambbef-html-20230118T144941/tmp-1.2.40.0.34.6.0.11.3.72-2020-07-29T113517.html"
              test="not(.)">(atcdabbr_entry_MedikationsEinnahmeEntry)/d5726284e143-true-d5726757e0: '<value-of select="name(..)"/>' ist als geschlossen definiert und dieses Element '<name/>' ist nicht erlaubt oder nicht mit diesem Inhalt erlaubt. Dies kann templateId, code oder id betreffen. Erwartet:  hl7:id[not(@nullFlavor)] | hl7:name[not(@nullFlavor)] | hl7:telecom[not(@nullFlavor)] | hl7:addr[not(@nullFlavor)] (rule-reference: d5726284e143-true-d5726757e0)</assert>
   </rule>

   <!-- Checking undefined contents for template/element @isClosed="true". Match context that we did not already match -->
   <rule fpi="RUL-QQQ"
         context="*[hl7:substanceAdministration[hl7:templateId[@root = '1.2.40.0.34.6.0.11.3.72'] and hl7:templateId[@root = '2.16.840.1.113883.10.20.1.24'] and hl7:templateId[@root = '1.3.6.1.4.1.19376.1.5.3.1.4.7'] and hl7:templateId[@root = '1.3.6.1.4.1.19376.1.9.1.3.16'] and hl7:templateId[@root = '1.3.6.1.4.1.19376.1.5.3.1.4.7.1']]]/hl7:substanceAdministration[hl7:templateId[@root = '1.2.40.0.34.6.0.11.3.72'] and hl7:templateId[@root = '2.16.840.1.113883.10.20.1.24'] and hl7:templateId[@root = '1.3.6.1.4.1.19376.1.5.3.1.4.7'] and hl7:templateId[@root = '1.3.6.1.4.1.19376.1.9.1.3.16'] and hl7:templateId[@root = '1.3.6.1.4.1.19376.1.5.3.1.4.7.1']]/hl7:author[hl7:assignedAuthor]/hl7:assignedAuthor/hl7:representedOrganization/hl7:addr[not(@nullFlavor)]/*[not(@xsi:nil = 'true')][not(self::hl7:streetAddressLine | self::hl7:streetName | self::hl7:houseNumber | self::hl7:postalCode[not(@nullFlavor)] | self::hl7:city[not(@nullFlavor)] | self::hl7:state | self::hl7:country[not(@nullFlavor)] | self::hl7:additionalLocator)]"
         id="d5726727e66-true-d5726820e0">
      <assert role="error"
              see="http://elga.art-decor.org/elgaambbef-html-20230118T144941/tmp-1.2.40.0.34.6.0.11.3.72-2020-07-29T113517.html"
              test="not(.)">(atcdabbr_entry_MedikationsEinnahmeEntry)/d5726727e66-true-d5726820e0: '<value-of select="name(..)"/>' ist als geschlossen definiert und dieses Element '<name/>' ist nicht erlaubt oder nicht mit diesem Inhalt erlaubt. Dies kann templateId, code oder id betreffen. Erwartet:  hl7:streetAddressLine | hl7:streetName | hl7:houseNumber | hl7:postalCode[not(@nullFlavor)] | hl7:city[not(@nullFlavor)] | hl7:state | hl7:country[not(@nullFlavor)] | hl7:additionalLocator (rule-reference: d5726727e66-true-d5726820e0)</assert>
   </rule>

   <!-- Checking undefined contents for template/element @isClosed="true". Match context that we did not already match -->
   <rule fpi="RUL-QQQ"
         context="*[hl7:substanceAdministration[hl7:templateId[@root = '1.2.40.0.34.6.0.11.3.72'] and hl7:templateId[@root = '2.16.840.1.113883.10.20.1.24'] and hl7:templateId[@root = '1.3.6.1.4.1.19376.1.5.3.1.4.7'] and hl7:templateId[@root = '1.3.6.1.4.1.19376.1.9.1.3.16'] and hl7:templateId[@root = '1.3.6.1.4.1.19376.1.5.3.1.4.7.1']]]/hl7:substanceAdministration[hl7:templateId[@root = '1.2.40.0.34.6.0.11.3.72'] and hl7:templateId[@root = '2.16.840.1.113883.10.20.1.24'] and hl7:templateId[@root = '1.3.6.1.4.1.19376.1.5.3.1.4.7'] and hl7:templateId[@root = '1.3.6.1.4.1.19376.1.9.1.3.16'] and hl7:templateId[@root = '1.3.6.1.4.1.19376.1.5.3.1.4.7.1']]/hl7:entryRelationship[@typeCode='RSON'][hl7:act/hl7:templateId[@root='1.3.6.1.4.1.19376.1.5.3.1.4.4.1']]/*[not(@xsi:nil = 'true')][not(self::hl7:act[hl7:templateId[@root = '1.3.6.1.4.1.19376.1.5.3.1.4.4.1']])]"
         id="d42e78111-true-d5726879e0">
      <assert role="error"
              see="http://elga.art-decor.org/elgaambbef-html-20230118T144941/tmp-1.2.40.0.34.6.0.11.3.72-2020-07-29T113517.html"
              test="not(.)">(atcdabbr_entry_MedikationsEinnahmeEntry)/d42e78111-true-d5726879e0: '<value-of select="name(..)"/>' ist als geschlossen definiert und dieses Element '<name/>' ist nicht erlaubt oder nicht mit diesem Inhalt erlaubt. Dies kann templateId, code oder id betreffen. Erwartet:  hl7:act[hl7:templateId[@root = '1.3.6.1.4.1.19376.1.5.3.1.4.4.1']] (rule-reference: d42e78111-true-d5726879e0)</assert>
   </rule>

   <!-- Checking undefined contents for template/element @isClosed="true". Match context that we did not already match -->
   <rule fpi="RUL-QQQ"
         context="*[hl7:substanceAdministration[hl7:templateId[@root = '1.2.40.0.34.6.0.11.3.72'] and hl7:templateId[@root = '2.16.840.1.113883.10.20.1.24'] and hl7:templateId[@root = '1.3.6.1.4.1.19376.1.5.3.1.4.7'] and hl7:templateId[@root = '1.3.6.1.4.1.19376.1.9.1.3.16'] and hl7:templateId[@root = '1.3.6.1.4.1.19376.1.5.3.1.4.7.1']]]/hl7:substanceAdministration[hl7:templateId[@root = '1.2.40.0.34.6.0.11.3.72'] and hl7:templateId[@root = '2.16.840.1.113883.10.20.1.24'] and hl7:templateId[@root = '1.3.6.1.4.1.19376.1.5.3.1.4.7'] and hl7:templateId[@root = '1.3.6.1.4.1.19376.1.9.1.3.16'] and hl7:templateId[@root = '1.3.6.1.4.1.19376.1.5.3.1.4.7.1']]/hl7:entryRelationship[@typeCode='RSON'][hl7:act/hl7:templateId[@root='1.3.6.1.4.1.19376.1.5.3.1.4.4.1']]/hl7:act[hl7:templateId[@root = '1.3.6.1.4.1.19376.1.5.3.1.4.4.1']]/*[not(@xsi:nil = 'true')][not(self::hl7:templateId[@root = '1.3.6.1.4.1.19376.1.5.3.1.4.4.1'] | self::hl7:id[not(@nullFlavor)])]"
         id="d42e78125-true-d5726901e0">
      <assert role="error"
              see="http://elga.art-decor.org/elgaambbef-html-20230118T144941/tmp-1.2.40.0.34.6.0.11.3.72-2020-07-29T113517.html"
              test="not(.)">(atcdabbr_entry_MedikationsEinnahmeEntry)/d42e78125-true-d5726901e0: '<value-of select="name(..)"/>' ist als geschlossen definiert und dieses Element '<name/>' ist nicht erlaubt oder nicht mit diesem Inhalt erlaubt. Dies kann templateId, code oder id betreffen. Erwartet:  hl7:templateId[@root = '1.3.6.1.4.1.19376.1.5.3.1.4.4.1'] | hl7:id[not(@nullFlavor)] (rule-reference: d42e78125-true-d5726901e0)</assert>
   </rule>

   <!-- Checking undefined contents for template/element @isClosed="true". Match context that we did not already match -->
   <rule fpi="RUL-QQQ"
         context="*[hl7:substanceAdministration[hl7:templateId[@root = '1.2.40.0.34.6.0.11.3.72'] and hl7:templateId[@root = '2.16.840.1.113883.10.20.1.24'] and hl7:templateId[@root = '1.3.6.1.4.1.19376.1.5.3.1.4.7'] and hl7:templateId[@root = '1.3.6.1.4.1.19376.1.9.1.3.16'] and hl7:templateId[@root = '1.3.6.1.4.1.19376.1.5.3.1.4.7.1']]]/hl7:substanceAdministration[hl7:templateId[@root = '1.2.40.0.34.6.0.11.3.72'] and hl7:templateId[@root = '2.16.840.1.113883.10.20.1.24'] and hl7:templateId[@root = '1.3.6.1.4.1.19376.1.5.3.1.4.7'] and hl7:templateId[@root = '1.3.6.1.4.1.19376.1.9.1.3.16'] and hl7:templateId[@root = '1.3.6.1.4.1.19376.1.5.3.1.4.7.1']]/hl7:entryRelationship[@typeCode='SUBJ'][hl7:act/hl7:templateId[@root='2.16.840.1.113883.10.20.1.43']]/*[not(@xsi:nil = 'true')][not(self::hl7:act[hl7:templateId[@root = '2.16.840.1.113883.10.20.1.43'] and hl7:templateId[@root = '1.3.6.1.4.1.19376.1.5.3.1.4.3.1']])]"
         id="d42e78145-true-d5726928e0">
      <assert role="error"
              see="http://elga.art-decor.org/elgaambbef-html-20230118T144941/tmp-1.2.40.0.34.6.0.11.3.72-2020-07-29T113517.html"
              test="not(.)">(atcdabbr_entry_MedikationsEinnahmeEntry)/d42e78145-true-d5726928e0: '<value-of select="name(..)"/>' ist als geschlossen definiert und dieses Element '<name/>' ist nicht erlaubt oder nicht mit diesem Inhalt erlaubt. Dies kann templateId, code oder id betreffen. Erwartet:  hl7:act[hl7:templateId[@root = '2.16.840.1.113883.10.20.1.43'] and hl7:templateId[@root = '1.3.6.1.4.1.19376.1.5.3.1.4.3.1']] (rule-reference: d42e78145-true-d5726928e0)</assert>
   </rule>

   <!-- Checking undefined contents for template/element @isClosed="true". Match context that we did not already match -->
   <rule fpi="RUL-QQQ"
         context="*[hl7:substanceAdministration[hl7:templateId[@root = '1.2.40.0.34.6.0.11.3.72'] and hl7:templateId[@root = '2.16.840.1.113883.10.20.1.24'] and hl7:templateId[@root = '1.3.6.1.4.1.19376.1.5.3.1.4.7'] and hl7:templateId[@root = '1.3.6.1.4.1.19376.1.9.1.3.16'] and hl7:templateId[@root = '1.3.6.1.4.1.19376.1.5.3.1.4.7.1']]]/hl7:substanceAdministration[hl7:templateId[@root = '1.2.40.0.34.6.0.11.3.72'] and hl7:templateId[@root = '2.16.840.1.113883.10.20.1.24'] and hl7:templateId[@root = '1.3.6.1.4.1.19376.1.5.3.1.4.7'] and hl7:templateId[@root = '1.3.6.1.4.1.19376.1.9.1.3.16'] and hl7:templateId[@root = '1.3.6.1.4.1.19376.1.5.3.1.4.7.1']]/hl7:entryRelationship[@typeCode='SUBJ'][hl7:act/hl7:templateId[@root='2.16.840.1.113883.10.20.1.43']]/hl7:act[hl7:templateId[@root = '2.16.840.1.113883.10.20.1.43'] and hl7:templateId[@root = '1.3.6.1.4.1.19376.1.5.3.1.4.3.1']]/*[not(@xsi:nil = 'true')][not(self::hl7:templateId[@root = '2.16.840.1.113883.10.20.1.43'] | self::hl7:templateId[@root = '1.3.6.1.4.1.19376.1.5.3.1.4.3.1'] | self::hl7:code[(@code = 'FINSTRUCT' and @codeSystem = '1.3.6.1.4.1.19376.1.5.3.2')] | self::hl7:text[not(@nullFlavor)] | self::hl7:statusCode[@code = 'completed'])]"
         id="d42e78156-true-d5726972e0">
      <assert role="error"
              see="http://elga.art-decor.org/elgaambbef-html-20230118T144941/tmp-1.2.40.0.34.6.0.11.3.72-2020-07-29T113517.html"
              test="not(.)">(atcdabbr_entry_MedikationsEinnahmeEntry)/d42e78156-true-d5726972e0: '<value-of select="name(..)"/>' ist als geschlossen definiert und dieses Element '<name/>' ist nicht erlaubt oder nicht mit diesem Inhalt erlaubt. Dies kann templateId, code oder id betreffen. Erwartet:  hl7:templateId[@root = '2.16.840.1.113883.10.20.1.43'] | hl7:templateId[@root = '1.3.6.1.4.1.19376.1.5.3.1.4.3.1'] | hl7:code[(@code = 'FINSTRUCT' and @codeSystem = '1.3.6.1.4.1.19376.1.5.3.2')] | hl7:text[not(@nullFlavor)] | hl7:statusCode[@code = 'completed'] (rule-reference: d42e78156-true-d5726972e0)</assert>
   </rule>

   <!-- Checking undefined contents for template/element @isClosed="true". Match context that we did not already match -->
   <rule fpi="RUL-QQQ"
         context="*[hl7:substanceAdministration[hl7:templateId[@root = '1.2.40.0.34.6.0.11.3.72'] and hl7:templateId[@root = '2.16.840.1.113883.10.20.1.24'] and hl7:templateId[@root = '1.3.6.1.4.1.19376.1.5.3.1.4.7'] and hl7:templateId[@root = '1.3.6.1.4.1.19376.1.9.1.3.16'] and hl7:templateId[@root = '1.3.6.1.4.1.19376.1.5.3.1.4.7.1']]]/hl7:substanceAdministration[hl7:templateId[@root = '1.2.40.0.34.6.0.11.3.72'] and hl7:templateId[@root = '2.16.840.1.113883.10.20.1.24'] and hl7:templateId[@root = '1.3.6.1.4.1.19376.1.5.3.1.4.7'] and hl7:templateId[@root = '1.3.6.1.4.1.19376.1.9.1.3.16'] and hl7:templateId[@root = '1.3.6.1.4.1.19376.1.5.3.1.4.7.1']]/hl7:entryRelationship[@typeCode='SUBJ'][hl7:act/hl7:templateId[@root='2.16.840.1.113883.10.20.1.43']]/hl7:act[hl7:templateId[@root = '2.16.840.1.113883.10.20.1.43'] and hl7:templateId[@root = '1.3.6.1.4.1.19376.1.5.3.1.4.3.1']]/hl7:text[not(@nullFlavor)]/*[not(@xsi:nil = 'true')][not(self::hl7:reference[not(@nullFlavor)])]"
         id="d42e78178-true-d5727004e0">
      <assert role="error"
              see="http://elga.art-decor.org/elgaambbef-html-20230118T144941/tmp-1.2.40.0.34.6.0.11.3.72-2020-07-29T113517.html"
              test="not(.)">(atcdabbr_entry_MedikationsEinnahmeEntry)/d42e78178-true-d5727004e0: '<value-of select="name(..)"/>' ist als geschlossen definiert und dieses Element '<name/>' ist nicht erlaubt oder nicht mit diesem Inhalt erlaubt. Dies kann templateId, code oder id betreffen. Erwartet:  hl7:reference[not(@nullFlavor)] (rule-reference: d42e78178-true-d5727004e0)</assert>
   </rule>

   <!-- Checking undefined contents for template/element @isClosed="true". Match context that we did not already match -->
   <rule fpi="RUL-QQQ"
         context="*[hl7:substanceAdministration[hl7:templateId[@root = '1.2.40.0.34.6.0.11.3.72'] and hl7:templateId[@root = '2.16.840.1.113883.10.20.1.24'] and hl7:templateId[@root = '1.3.6.1.4.1.19376.1.5.3.1.4.7'] and hl7:templateId[@root = '1.3.6.1.4.1.19376.1.9.1.3.16'] and hl7:templateId[@root = '1.3.6.1.4.1.19376.1.5.3.1.4.7.1']]]/hl7:substanceAdministration[hl7:templateId[@root = '1.2.40.0.34.6.0.11.3.72'] and hl7:templateId[@root = '2.16.840.1.113883.10.20.1.24'] and hl7:templateId[@root = '1.3.6.1.4.1.19376.1.5.3.1.4.7'] and hl7:templateId[@root = '1.3.6.1.4.1.19376.1.9.1.3.16'] and hl7:templateId[@root = '1.3.6.1.4.1.19376.1.5.3.1.4.7.1']]/hl7:entryRelationship[@typeCode='COMP'][hl7:supply]/*[not(@xsi:nil = 'true')][not(self::hl7:supply[not(@nullFlavor)][@classCode = 'SPLY'][@moodCode = 'RQO'])]"
         id="d42e78201-true-d5727027e0">
      <assert role="error"
              see="http://elga.art-decor.org/elgaambbef-html-20230118T144941/tmp-1.2.40.0.34.6.0.11.3.72-2020-07-29T113517.html"
              test="not(.)">(atcdabbr_entry_MedikationsEinnahmeEntry)/d42e78201-true-d5727027e0: '<value-of select="name(..)"/>' ist als geschlossen definiert und dieses Element '<name/>' ist nicht erlaubt oder nicht mit diesem Inhalt erlaubt. Dies kann templateId, code oder id betreffen. Erwartet:  hl7:supply[not(@nullFlavor)][@classCode = 'SPLY'][@moodCode = 'RQO'] (rule-reference: d42e78201-true-d5727027e0)</assert>
   </rule>

   <!-- Checking undefined contents for template/element @isClosed="true". Match context that we did not already match -->
   <rule fpi="RUL-QQQ"
         context="*[hl7:substanceAdministration[hl7:templateId[@root = '1.2.40.0.34.6.0.11.3.72'] and hl7:templateId[@root = '2.16.840.1.113883.10.20.1.24'] and hl7:templateId[@root = '1.3.6.1.4.1.19376.1.5.3.1.4.7'] and hl7:templateId[@root = '1.3.6.1.4.1.19376.1.9.1.3.16'] and hl7:templateId[@root = '1.3.6.1.4.1.19376.1.5.3.1.4.7.1']]]/hl7:substanceAdministration[hl7:templateId[@root = '1.2.40.0.34.6.0.11.3.72'] and hl7:templateId[@root = '2.16.840.1.113883.10.20.1.24'] and hl7:templateId[@root = '1.3.6.1.4.1.19376.1.5.3.1.4.7'] and hl7:templateId[@root = '1.3.6.1.4.1.19376.1.9.1.3.16'] and hl7:templateId[@root = '1.3.6.1.4.1.19376.1.5.3.1.4.7.1']]/hl7:entryRelationship[@typeCode='COMP'][hl7:supply]/hl7:supply[not(@nullFlavor)][@classCode = 'SPLY'][@moodCode = 'RQO']/*[not(@xsi:nil = 'true')][not(self::hl7:independentInd[not(@nullFlavor)] | self::hl7:quantity)]"
         id="d42e78226-true-d5727046e0">
      <assert role="error"
              see="http://elga.art-decor.org/elgaambbef-html-20230118T144941/tmp-1.2.40.0.34.6.0.11.3.72-2020-07-29T113517.html"
              test="not(.)">(atcdabbr_entry_MedikationsEinnahmeEntry)/d42e78226-true-d5727046e0: '<value-of select="name(..)"/>' ist als geschlossen definiert und dieses Element '<name/>' ist nicht erlaubt oder nicht mit diesem Inhalt erlaubt. Dies kann templateId, code oder id betreffen. Erwartet:  hl7:independentInd[not(@nullFlavor)] | hl7:quantity (rule-reference: d42e78226-true-d5727046e0)</assert>
   </rule>

   <!-- Checking undefined contents for template/element @isClosed="true". Match context that we did not already match -->
   <rule fpi="RUL-QQQ"
         context="*[hl7:substanceAdministration[hl7:templateId[@root = '1.2.40.0.34.6.0.11.3.72'] and hl7:templateId[@root = '2.16.840.1.113883.10.20.1.24'] and hl7:templateId[@root = '1.3.6.1.4.1.19376.1.5.3.1.4.7'] and hl7:templateId[@root = '1.3.6.1.4.1.19376.1.9.1.3.16'] and hl7:templateId[@root = '1.3.6.1.4.1.19376.1.5.3.1.4.7.1']]]/hl7:substanceAdministration[hl7:templateId[@root = '1.2.40.0.34.6.0.11.3.72'] and hl7:templateId[@root = '2.16.840.1.113883.10.20.1.24'] and hl7:templateId[@root = '1.3.6.1.4.1.19376.1.5.3.1.4.7'] and hl7:templateId[@root = '1.3.6.1.4.1.19376.1.9.1.3.16'] and hl7:templateId[@root = '1.3.6.1.4.1.19376.1.5.3.1.4.7.1']]/hl7:entryRelationship[@typeCode='REFR'][hl7:substanceAdministration/hl7:templateId[@root='1.3.6.1.4.1.19376.1.9.1.3.10']]/*[not(@xsi:nil = 'true')][not(self::hl7:substanceAdministration[hl7:templateId[@root = '1.3.6.1.4.1.19376.1.9.1.3.10']])]"
         id="d42e78274-true-d5727070e0">
      <assert role="error"
              see="http://elga.art-decor.org/elgaambbef-html-20230118T144941/tmp-1.2.40.0.34.6.0.11.3.72-2020-07-29T113517.html"
              test="not(.)">(atcdabbr_entry_MedikationsEinnahmeEntry)/d42e78274-true-d5727070e0: '<value-of select="name(..)"/>' ist als geschlossen definiert und dieses Element '<name/>' ist nicht erlaubt oder nicht mit diesem Inhalt erlaubt. Dies kann templateId, code oder id betreffen. Erwartet:  hl7:substanceAdministration[hl7:templateId[@root = '1.3.6.1.4.1.19376.1.9.1.3.10']] (rule-reference: d42e78274-true-d5727070e0)</assert>
   </rule>

   <!-- Checking undefined contents for template/element @isClosed="true". Match context that we did not already match -->
   <rule fpi="RUL-QQQ"
         context="*[hl7:substanceAdministration[hl7:templateId[@root = '1.2.40.0.34.6.0.11.3.72'] and hl7:templateId[@root = '2.16.840.1.113883.10.20.1.24'] and hl7:templateId[@root = '1.3.6.1.4.1.19376.1.5.3.1.4.7'] and hl7:templateId[@root = '1.3.6.1.4.1.19376.1.9.1.3.16'] and hl7:templateId[@root = '1.3.6.1.4.1.19376.1.5.3.1.4.7.1']]]/hl7:substanceAdministration[hl7:templateId[@root = '1.2.40.0.34.6.0.11.3.72'] and hl7:templateId[@root = '2.16.840.1.113883.10.20.1.24'] and hl7:templateId[@root = '1.3.6.1.4.1.19376.1.5.3.1.4.7'] and hl7:templateId[@root = '1.3.6.1.4.1.19376.1.9.1.3.16'] and hl7:templateId[@root = '1.3.6.1.4.1.19376.1.5.3.1.4.7.1']]/hl7:entryRelationship[@typeCode='REFR'][hl7:substanceAdministration/hl7:templateId[@root='1.3.6.1.4.1.19376.1.9.1.3.10']]/hl7:substanceAdministration[hl7:templateId[@root = '1.3.6.1.4.1.19376.1.9.1.3.10']]/*[not(@xsi:nil = 'true')][not(self::hl7:templateId[@root = '1.3.6.1.4.1.19376.1.9.1.3.10'] | self::hl7:id[not(@nullFlavor)] | self::hl7:code[(@code = 'MTPItem' and @codeSystem = '1.3.6.1.4.1.19376.1.9.2.2')] | self::hl7:consumable[not(@nullFlavor)][hl7:manufacturedProduct])]"
         id="d42e78288-true-d5727104e0">
      <assert role="error"
              see="http://elga.art-decor.org/elgaambbef-html-20230118T144941/tmp-1.2.40.0.34.6.0.11.3.72-2020-07-29T113517.html"
              test="not(.)">(atcdabbr_entry_MedikationsEinnahmeEntry)/d42e78288-true-d5727104e0: '<value-of select="name(..)"/>' ist als geschlossen definiert und dieses Element '<name/>' ist nicht erlaubt oder nicht mit diesem Inhalt erlaubt. Dies kann templateId, code oder id betreffen. Erwartet:  hl7:templateId[@root = '1.3.6.1.4.1.19376.1.9.1.3.10'] | hl7:id[not(@nullFlavor)] | hl7:code[(@code = 'MTPItem' and @codeSystem = '1.3.6.1.4.1.19376.1.9.2.2')] | hl7:consumable[not(@nullFlavor)][hl7:manufacturedProduct] (rule-reference: d42e78288-true-d5727104e0)</assert>
   </rule>

   <!-- Checking undefined contents for template/element @isClosed="true". Match context that we did not already match -->
   <rule fpi="RUL-QQQ"
         context="*[hl7:substanceAdministration[hl7:templateId[@root = '1.2.40.0.34.6.0.11.3.72'] and hl7:templateId[@root = '2.16.840.1.113883.10.20.1.24'] and hl7:templateId[@root = '1.3.6.1.4.1.19376.1.5.3.1.4.7'] and hl7:templateId[@root = '1.3.6.1.4.1.19376.1.9.1.3.16'] and hl7:templateId[@root = '1.3.6.1.4.1.19376.1.5.3.1.4.7.1']]]/hl7:substanceAdministration[hl7:templateId[@root = '1.2.40.0.34.6.0.11.3.72'] and hl7:templateId[@root = '2.16.840.1.113883.10.20.1.24'] and hl7:templateId[@root = '1.3.6.1.4.1.19376.1.5.3.1.4.7'] and hl7:templateId[@root = '1.3.6.1.4.1.19376.1.9.1.3.16'] and hl7:templateId[@root = '1.3.6.1.4.1.19376.1.5.3.1.4.7.1']]/hl7:entryRelationship[@typeCode='REFR'][hl7:substanceAdministration/hl7:templateId[@root='1.3.6.1.4.1.19376.1.9.1.3.10']]/hl7:substanceAdministration[hl7:templateId[@root = '1.3.6.1.4.1.19376.1.9.1.3.10']]/hl7:consumable[not(@nullFlavor)][hl7:manufacturedProduct]/*[not(@xsi:nil = 'true')][not(self::hl7:manufacturedProduct[not(@nullFlavor)][hl7:manufacturedMaterial[@nullFlavor = 'NA']])]"
         id="d42e78322-true-d5727135e0">
      <assert role="error"
              see="http://elga.art-decor.org/elgaambbef-html-20230118T144941/tmp-1.2.40.0.34.6.0.11.3.72-2020-07-29T113517.html"
              test="not(.)">(atcdabbr_entry_MedikationsEinnahmeEntry)/d42e78322-true-d5727135e0: '<value-of select="name(..)"/>' ist als geschlossen definiert und dieses Element '<name/>' ist nicht erlaubt oder nicht mit diesem Inhalt erlaubt. Dies kann templateId, code oder id betreffen. Erwartet:  hl7:manufacturedProduct[not(@nullFlavor)][hl7:manufacturedMaterial[@nullFlavor = 'NA']] (rule-reference: d42e78322-true-d5727135e0)</assert>
   </rule>

   <!-- Checking undefined contents for template/element @isClosed="true". Match context that we did not already match -->
   <rule fpi="RUL-QQQ"
         context="*[hl7:substanceAdministration[hl7:templateId[@root = '1.2.40.0.34.6.0.11.3.72'] and hl7:templateId[@root = '2.16.840.1.113883.10.20.1.24'] and hl7:templateId[@root = '1.3.6.1.4.1.19376.1.5.3.1.4.7'] and hl7:templateId[@root = '1.3.6.1.4.1.19376.1.9.1.3.16'] and hl7:templateId[@root = '1.3.6.1.4.1.19376.1.5.3.1.4.7.1']]]/hl7:substanceAdministration[hl7:templateId[@root = '1.2.40.0.34.6.0.11.3.72'] and hl7:templateId[@root = '2.16.840.1.113883.10.20.1.24'] and hl7:templateId[@root = '1.3.6.1.4.1.19376.1.5.3.1.4.7'] and hl7:templateId[@root = '1.3.6.1.4.1.19376.1.9.1.3.16'] and hl7:templateId[@root = '1.3.6.1.4.1.19376.1.5.3.1.4.7.1']]/hl7:entryRelationship[@typeCode='REFR'][hl7:substanceAdministration/hl7:templateId[@root='1.3.6.1.4.1.19376.1.9.1.3.10']]/hl7:substanceAdministration[hl7:templateId[@root = '1.3.6.1.4.1.19376.1.9.1.3.10']]/hl7:consumable[not(@nullFlavor)][hl7:manufacturedProduct]/hl7:manufacturedProduct[not(@nullFlavor)][hl7:manufacturedMaterial[@nullFlavor = 'NA']]/*[not(@xsi:nil = 'true')][not(self::hl7:manufacturedMaterial[@nullFlavor = 'NA'])]"
         id="d42e78324-true-d5727149e0">
      <assert role="error"
              see="http://elga.art-decor.org/elgaambbef-html-20230118T144941/tmp-1.2.40.0.34.6.0.11.3.72-2020-07-29T113517.html"
              test="not(.)">(atcdabbr_entry_MedikationsEinnahmeEntry)/d42e78324-true-d5727149e0: '<value-of select="name(..)"/>' ist als geschlossen definiert und dieses Element '<name/>' ist nicht erlaubt oder nicht mit diesem Inhalt erlaubt. Dies kann templateId, code oder id betreffen. Erwartet:  hl7:manufacturedMaterial[@nullFlavor = 'NA'] (rule-reference: d42e78324-true-d5727149e0)</assert>
   </rule>

   <!-- Checking undefined contents for template/element @isClosed="true". Match context that we did not already match -->
   <rule fpi="RUL-QQQ"
         context="*[hl7:substanceAdministration[hl7:templateId[@root = '1.2.40.0.34.6.0.11.3.72'] and hl7:templateId[@root = '2.16.840.1.113883.10.20.1.24'] and hl7:templateId[@root = '1.3.6.1.4.1.19376.1.5.3.1.4.7'] and hl7:templateId[@root = '1.3.6.1.4.1.19376.1.9.1.3.16'] and hl7:templateId[@root = '1.3.6.1.4.1.19376.1.5.3.1.4.7.1']]]/hl7:substanceAdministration[hl7:templateId[@root = '1.2.40.0.34.6.0.11.3.72'] and hl7:templateId[@root = '2.16.840.1.113883.10.20.1.24'] and hl7:templateId[@root = '1.3.6.1.4.1.19376.1.5.3.1.4.7'] and hl7:templateId[@root = '1.3.6.1.4.1.19376.1.9.1.3.16'] and hl7:templateId[@root = '1.3.6.1.4.1.19376.1.5.3.1.4.7.1']]/hl7:entryRelationship[@typeCode='REFR'][hl7:substanceAdministration/hl7:templateId[@root='1.3.6.1.4.1.19376.1.9.1.3.11']]/*[not(@xsi:nil = 'true')][not(self::hl7:substanceAdministration[hl7:templateId[@root = '1.3.6.1.4.1.19376.1.9.1.3.11']])]"
         id="d42e78335-true-d5727168e0">
      <assert role="error"
              see="http://elga.art-decor.org/elgaambbef-html-20230118T144941/tmp-1.2.40.0.34.6.0.11.3.72-2020-07-29T113517.html"
              test="not(.)">(atcdabbr_entry_MedikationsEinnahmeEntry)/d42e78335-true-d5727168e0: '<value-of select="name(..)"/>' ist als geschlossen definiert und dieses Element '<name/>' ist nicht erlaubt oder nicht mit diesem Inhalt erlaubt. Dies kann templateId, code oder id betreffen. Erwartet:  hl7:substanceAdministration[hl7:templateId[@root = '1.3.6.1.4.1.19376.1.9.1.3.11']] (rule-reference: d42e78335-true-d5727168e0)</assert>
   </rule>

   <!-- Checking undefined contents for template/element @isClosed="true". Match context that we did not already match -->
   <rule fpi="RUL-QQQ"
         context="*[hl7:substanceAdministration[hl7:templateId[@root = '1.2.40.0.34.6.0.11.3.72'] and hl7:templateId[@root = '2.16.840.1.113883.10.20.1.24'] and hl7:templateId[@root = '1.3.6.1.4.1.19376.1.5.3.1.4.7'] and hl7:templateId[@root = '1.3.6.1.4.1.19376.1.9.1.3.16'] and hl7:templateId[@root = '1.3.6.1.4.1.19376.1.5.3.1.4.7.1']]]/hl7:substanceAdministration[hl7:templateId[@root = '1.2.40.0.34.6.0.11.3.72'] and hl7:templateId[@root = '2.16.840.1.113883.10.20.1.24'] and hl7:templateId[@root = '1.3.6.1.4.1.19376.1.5.3.1.4.7'] and hl7:templateId[@root = '1.3.6.1.4.1.19376.1.9.1.3.16'] and hl7:templateId[@root = '1.3.6.1.4.1.19376.1.5.3.1.4.7.1']]/hl7:entryRelationship[@typeCode='REFR'][hl7:substanceAdministration/hl7:templateId[@root='1.3.6.1.4.1.19376.1.9.1.3.11']]/hl7:substanceAdministration[hl7:templateId[@root = '1.3.6.1.4.1.19376.1.9.1.3.11']]/*[not(@xsi:nil = 'true')][not(self::hl7:templateId[@root = '1.3.6.1.4.1.19376.1.9.1.3.11'] | self::hl7:id[not(@nullFlavor)] | self::hl7:code[(@code = 'PREItem' and @codeSystem = '1.3.6.1.4.1.19376.1.9.2.2')] | self::hl7:consumable[not(@nullFlavor)][hl7:manufacturedProduct])]"
         id="d42e78344-true-d5727202e0">
      <assert role="error"
              see="http://elga.art-decor.org/elgaambbef-html-20230118T144941/tmp-1.2.40.0.34.6.0.11.3.72-2020-07-29T113517.html"
              test="not(.)">(atcdabbr_entry_MedikationsEinnahmeEntry)/d42e78344-true-d5727202e0: '<value-of select="name(..)"/>' ist als geschlossen definiert und dieses Element '<name/>' ist nicht erlaubt oder nicht mit diesem Inhalt erlaubt. Dies kann templateId, code oder id betreffen. Erwartet:  hl7:templateId[@root = '1.3.6.1.4.1.19376.1.9.1.3.11'] | hl7:id[not(@nullFlavor)] | hl7:code[(@code = 'PREItem' and @codeSystem = '1.3.6.1.4.1.19376.1.9.2.2')] | hl7:consumable[not(@nullFlavor)][hl7:manufacturedProduct] (rule-reference: d42e78344-true-d5727202e0)</assert>
   </rule>

   <!-- Checking undefined contents for template/element @isClosed="true". Match context that we did not already match -->
   <rule fpi="RUL-QQQ"
         context="*[hl7:substanceAdministration[hl7:templateId[@root = '1.2.40.0.34.6.0.11.3.72'] and hl7:templateId[@root = '2.16.840.1.113883.10.20.1.24'] and hl7:templateId[@root = '1.3.6.1.4.1.19376.1.5.3.1.4.7'] and hl7:templateId[@root = '1.3.6.1.4.1.19376.1.9.1.3.16'] and hl7:templateId[@root = '1.3.6.1.4.1.19376.1.5.3.1.4.7.1']]]/hl7:substanceAdministration[hl7:templateId[@root = '1.2.40.0.34.6.0.11.3.72'] and hl7:templateId[@root = '2.16.840.1.113883.10.20.1.24'] and hl7:templateId[@root = '1.3.6.1.4.1.19376.1.5.3.1.4.7'] and hl7:templateId[@root = '1.3.6.1.4.1.19376.1.9.1.3.16'] and hl7:templateId[@root = '1.3.6.1.4.1.19376.1.5.3.1.4.7.1']]/hl7:entryRelationship[@typeCode='REFR'][hl7:substanceAdministration/hl7:templateId[@root='1.3.6.1.4.1.19376.1.9.1.3.11']]/hl7:substanceAdministration[hl7:templateId[@root = '1.3.6.1.4.1.19376.1.9.1.3.11']]/hl7:consumable[not(@nullFlavor)][hl7:manufacturedProduct]/*[not(@xsi:nil = 'true')][not(self::hl7:manufacturedProduct[not(@nullFlavor)][hl7:manufacturedMaterial[@nullFlavor = 'NA']])]"
         id="d42e78378-true-d5727233e0">
      <assert role="error"
              see="http://elga.art-decor.org/elgaambbef-html-20230118T144941/tmp-1.2.40.0.34.6.0.11.3.72-2020-07-29T113517.html"
              test="not(.)">(atcdabbr_entry_MedikationsEinnahmeEntry)/d42e78378-true-d5727233e0: '<value-of select="name(..)"/>' ist als geschlossen definiert und dieses Element '<name/>' ist nicht erlaubt oder nicht mit diesem Inhalt erlaubt. Dies kann templateId, code oder id betreffen. Erwartet:  hl7:manufacturedProduct[not(@nullFlavor)][hl7:manufacturedMaterial[@nullFlavor = 'NA']] (rule-reference: d42e78378-true-d5727233e0)</assert>
   </rule>

   <!-- Checking undefined contents for template/element @isClosed="true". Match context that we did not already match -->
   <rule fpi="RUL-QQQ"
         context="*[hl7:substanceAdministration[hl7:templateId[@root = '1.2.40.0.34.6.0.11.3.72'] and hl7:templateId[@root = '2.16.840.1.113883.10.20.1.24'] and hl7:templateId[@root = '1.3.6.1.4.1.19376.1.5.3.1.4.7'] and hl7:templateId[@root = '1.3.6.1.4.1.19376.1.9.1.3.16'] and hl7:templateId[@root = '1.3.6.1.4.1.19376.1.5.3.1.4.7.1']]]/hl7:substanceAdministration[hl7:templateId[@root = '1.2.40.0.34.6.0.11.3.72'] and hl7:templateId[@root = '2.16.840.1.113883.10.20.1.24'] and hl7:templateId[@root = '1.3.6.1.4.1.19376.1.5.3.1.4.7'] and hl7:templateId[@root = '1.3.6.1.4.1.19376.1.9.1.3.16'] and hl7:templateId[@root = '1.3.6.1.4.1.19376.1.5.3.1.4.7.1']]/hl7:entryRelationship[@typeCode='REFR'][hl7:substanceAdministration/hl7:templateId[@root='1.3.6.1.4.1.19376.1.9.1.3.11']]/hl7:substanceAdministration[hl7:templateId[@root = '1.3.6.1.4.1.19376.1.9.1.3.11']]/hl7:consumable[not(@nullFlavor)][hl7:manufacturedProduct]/hl7:manufacturedProduct[not(@nullFlavor)][hl7:manufacturedMaterial[@nullFlavor = 'NA']]/*[not(@xsi:nil = 'true')][not(self::hl7:manufacturedMaterial[@nullFlavor = 'NA'])]"
         id="d42e78380-true-d5727247e0">
      <assert role="error"
              see="http://elga.art-decor.org/elgaambbef-html-20230118T144941/tmp-1.2.40.0.34.6.0.11.3.72-2020-07-29T113517.html"
              test="not(.)">(atcdabbr_entry_MedikationsEinnahmeEntry)/d42e78380-true-d5727247e0: '<value-of select="name(..)"/>' ist als geschlossen definiert und dieses Element '<name/>' ist nicht erlaubt oder nicht mit diesem Inhalt erlaubt. Dies kann templateId, code oder id betreffen. Erwartet:  hl7:manufacturedMaterial[@nullFlavor = 'NA'] (rule-reference: d42e78380-true-d5727247e0)</assert>
   </rule>

   <!-- Checking undefined contents for template/element @isClosed="true". Match context that we did not already match -->
   <rule fpi="RUL-QQQ"
         context="*[hl7:substanceAdministration[hl7:templateId[@root = '1.2.40.0.34.6.0.11.3.72'] and hl7:templateId[@root = '2.16.840.1.113883.10.20.1.24'] and hl7:templateId[@root = '1.3.6.1.4.1.19376.1.5.3.1.4.7'] and hl7:templateId[@root = '1.3.6.1.4.1.19376.1.9.1.3.16'] and hl7:templateId[@root = '1.3.6.1.4.1.19376.1.5.3.1.4.7.1']]]/hl7:substanceAdministration[hl7:templateId[@root = '1.2.40.0.34.6.0.11.3.72'] and hl7:templateId[@root = '2.16.840.1.113883.10.20.1.24'] and hl7:templateId[@root = '1.3.6.1.4.1.19376.1.5.3.1.4.7'] and hl7:templateId[@root = '1.3.6.1.4.1.19376.1.9.1.3.16'] and hl7:templateId[@root = '1.3.6.1.4.1.19376.1.5.3.1.4.7.1']]/hl7:entryRelationship[@typeCode='REFR'][hl7:substanceAdministration/hl7:templateId[@root='1.3.6.1.4.1.19376.1.9.1.3.12']]/*[not(@xsi:nil = 'true')][not(self::hl7:substanceAdministration[hl7:templateId[@root = '1.3.6.1.4.1.19376.1.9.1.3.12']])]"
         id="d42e78391-true-d5727266e0">
      <assert role="error"
              see="http://elga.art-decor.org/elgaambbef-html-20230118T144941/tmp-1.2.40.0.34.6.0.11.3.72-2020-07-29T113517.html"
              test="not(.)">(atcdabbr_entry_MedikationsEinnahmeEntry)/d42e78391-true-d5727266e0: '<value-of select="name(..)"/>' ist als geschlossen definiert und dieses Element '<name/>' ist nicht erlaubt oder nicht mit diesem Inhalt erlaubt. Dies kann templateId, code oder id betreffen. Erwartet:  hl7:substanceAdministration[hl7:templateId[@root = '1.3.6.1.4.1.19376.1.9.1.3.12']] (rule-reference: d42e78391-true-d5727266e0)</assert>
   </rule>

   <!-- Checking undefined contents for template/element @isClosed="true". Match context that we did not already match -->
   <rule fpi="RUL-QQQ"
         context="*[hl7:substanceAdministration[hl7:templateId[@root = '1.2.40.0.34.6.0.11.3.72'] and hl7:templateId[@root = '2.16.840.1.113883.10.20.1.24'] and hl7:templateId[@root = '1.3.6.1.4.1.19376.1.5.3.1.4.7'] and hl7:templateId[@root = '1.3.6.1.4.1.19376.1.9.1.3.16'] and hl7:templateId[@root = '1.3.6.1.4.1.19376.1.5.3.1.4.7.1']]]/hl7:substanceAdministration[hl7:templateId[@root = '1.2.40.0.34.6.0.11.3.72'] and hl7:templateId[@root = '2.16.840.1.113883.10.20.1.24'] and hl7:templateId[@root = '1.3.6.1.4.1.19376.1.5.3.1.4.7'] and hl7:templateId[@root = '1.3.6.1.4.1.19376.1.9.1.3.16'] and hl7:templateId[@root = '1.3.6.1.4.1.19376.1.5.3.1.4.7.1']]/hl7:entryRelationship[@typeCode='REFR'][hl7:substanceAdministration/hl7:templateId[@root='1.3.6.1.4.1.19376.1.9.1.3.12']]/hl7:substanceAdministration[hl7:templateId[@root = '1.3.6.1.4.1.19376.1.9.1.3.12']]/*[not(@xsi:nil = 'true')][not(self::hl7:templateId[@root = '1.3.6.1.4.1.19376.1.9.1.3.12'] | self::hl7:id[not(@nullFlavor)] | self::hl7:code[(@code = 'DISItem' and @codeSystem = '1.3.6.1.4.1.19376.1.9.2.2')])]"
         id="d42e78400-true-d5727295e0">
      <assert role="error"
              see="http://elga.art-decor.org/elgaambbef-html-20230118T144941/tmp-1.2.40.0.34.6.0.11.3.72-2020-07-29T113517.html"
              test="not(.)">(atcdabbr_entry_MedikationsEinnahmeEntry)/d42e78400-true-d5727295e0: '<value-of select="name(..)"/>' ist als geschlossen definiert und dieses Element '<name/>' ist nicht erlaubt oder nicht mit diesem Inhalt erlaubt. Dies kann templateId, code oder id betreffen. Erwartet:  hl7:templateId[@root = '1.3.6.1.4.1.19376.1.9.1.3.12'] | hl7:id[not(@nullFlavor)] | hl7:code[(@code = 'DISItem' and @codeSystem = '1.3.6.1.4.1.19376.1.9.2.2')] (rule-reference: d42e78400-true-d5727295e0)</assert>
   </rule>

   <!-- Checking undefined contents for template/element @isClosed="true". Match context that we did not already match -->
   <rule fpi="RUL-QQQ"
         context="*[hl7:substanceAdministration[hl7:templateId[@root = '1.2.40.0.34.6.0.11.3.72'] and hl7:templateId[@root = '2.16.840.1.113883.10.20.1.24'] and hl7:templateId[@root = '1.3.6.1.4.1.19376.1.5.3.1.4.7'] and hl7:templateId[@root = '1.3.6.1.4.1.19376.1.9.1.3.16'] and hl7:templateId[@root = '1.3.6.1.4.1.19376.1.5.3.1.4.7.1']]]/hl7:substanceAdministration[hl7:templateId[@root = '1.2.40.0.34.6.0.11.3.72'] and hl7:templateId[@root = '2.16.840.1.113883.10.20.1.24'] and hl7:templateId[@root = '1.3.6.1.4.1.19376.1.5.3.1.4.7'] and hl7:templateId[@root = '1.3.6.1.4.1.19376.1.9.1.3.16'] and hl7:templateId[@root = '1.3.6.1.4.1.19376.1.5.3.1.4.7.1']]/hl7:entryRelationship[@typeCode='REFR'][hl7:substanceAdministration/hl7:templateId[@root='1.3.6.1.4.1.19376.1.9.1.3.13']]/*[not(@xsi:nil = 'true')][not(self::hl7:substanceAdministration[hl7:templateId[@root = '1.3.6.1.4.1.19376.1.9.1.3.13']])]"
         id="d42e78435-true-d5727326e0">
      <assert role="error"
              see="http://elga.art-decor.org/elgaambbef-html-20230118T144941/tmp-1.2.40.0.34.6.0.11.3.72-2020-07-29T113517.html"
              test="not(.)">(atcdabbr_entry_MedikationsEinnahmeEntry)/d42e78435-true-d5727326e0: '<value-of select="name(..)"/>' ist als geschlossen definiert und dieses Element '<name/>' ist nicht erlaubt oder nicht mit diesem Inhalt erlaubt. Dies kann templateId, code oder id betreffen. Erwartet:  hl7:substanceAdministration[hl7:templateId[@root = '1.3.6.1.4.1.19376.1.9.1.3.13']] (rule-reference: d42e78435-true-d5727326e0)</assert>
   </rule>

   <!-- Checking undefined contents for template/element @isClosed="true". Match context that we did not already match -->
   <rule fpi="RUL-QQQ"
         context="*[hl7:substanceAdministration[hl7:templateId[@root = '1.2.40.0.34.6.0.11.3.72'] and hl7:templateId[@root = '2.16.840.1.113883.10.20.1.24'] and hl7:templateId[@root = '1.3.6.1.4.1.19376.1.5.3.1.4.7'] and hl7:templateId[@root = '1.3.6.1.4.1.19376.1.9.1.3.16'] and hl7:templateId[@root = '1.3.6.1.4.1.19376.1.5.3.1.4.7.1']]]/hl7:substanceAdministration[hl7:templateId[@root = '1.2.40.0.34.6.0.11.3.72'] and hl7:templateId[@root = '2.16.840.1.113883.10.20.1.24'] and hl7:templateId[@root = '1.3.6.1.4.1.19376.1.5.3.1.4.7'] and hl7:templateId[@root = '1.3.6.1.4.1.19376.1.9.1.3.16'] and hl7:templateId[@root = '1.3.6.1.4.1.19376.1.5.3.1.4.7.1']]/hl7:entryRelationship[@typeCode='REFR'][hl7:substanceAdministration/hl7:templateId[@root='1.3.6.1.4.1.19376.1.9.1.3.13']]/hl7:substanceAdministration[hl7:templateId[@root = '1.3.6.1.4.1.19376.1.9.1.3.13']]/*[not(@xsi:nil = 'true')][not(self::hl7:templateId[@root = '1.3.6.1.4.1.19376.1.9.1.3.13'] | self::hl7:id[not(@nullFlavor)] | self::hl7:code[(@code = 'PADVItem' and @codeSystem = '1.3.6.1.4.1.19376.1.9.2.2')])]"
         id="d42e78444-true-d5727355e0">
      <assert role="error"
              see="http://elga.art-decor.org/elgaambbef-html-20230118T144941/tmp-1.2.40.0.34.6.0.11.3.72-2020-07-29T113517.html"
              test="not(.)">(atcdabbr_entry_MedikationsEinnahmeEntry)/d42e78444-true-d5727355e0: '<value-of select="name(..)"/>' ist als geschlossen definiert und dieses Element '<name/>' ist nicht erlaubt oder nicht mit diesem Inhalt erlaubt. Dies kann templateId, code oder id betreffen. Erwartet:  hl7:templateId[@root = '1.3.6.1.4.1.19376.1.9.1.3.13'] | hl7:id[not(@nullFlavor)] | hl7:code[(@code = 'PADVItem' and @codeSystem = '1.3.6.1.4.1.19376.1.9.2.2')] (rule-reference: d42e78444-true-d5727355e0)</assert>
   </rule>

   <!-- Checking undefined contents for template/element @isClosed="true". Match context that we did not already match -->
   <rule fpi="RUL-QQQ"
         context="*[hl7:substanceAdministration[hl7:templateId[@root = '1.2.40.0.34.6.0.11.3.72'] and hl7:templateId[@root = '2.16.840.1.113883.10.20.1.24'] and hl7:templateId[@root = '1.3.6.1.4.1.19376.1.5.3.1.4.7'] and hl7:templateId[@root = '1.3.6.1.4.1.19376.1.9.1.3.16'] and hl7:templateId[@root = '1.3.6.1.4.1.19376.1.5.3.1.4.7.1']]]/hl7:substanceAdministration[hl7:templateId[@root = '1.2.40.0.34.6.0.11.3.72'] and hl7:templateId[@root = '2.16.840.1.113883.10.20.1.24'] and hl7:templateId[@root = '1.3.6.1.4.1.19376.1.5.3.1.4.7'] and hl7:templateId[@root = '1.3.6.1.4.1.19376.1.9.1.3.16'] and hl7:templateId[@root = '1.3.6.1.4.1.19376.1.5.3.1.4.7.1']]/hl7:entryRelationship[@typeCode='REFR'][hl7:substanceAdministration/hl7:templateId[@root='1.3.6.1.4.1.19376.1.9.1.3.14']]/*[not(@xsi:nil = 'true')][not(self::hl7:substanceAdministration[hl7:templateId[@root = '1.3.6.1.4.1.19376.1.9.1.3.14']])]"
         id="d42e78479-true-d5727386e0">
      <assert role="error"
              see="http://elga.art-decor.org/elgaambbef-html-20230118T144941/tmp-1.2.40.0.34.6.0.11.3.72-2020-07-29T113517.html"
              test="not(.)">(atcdabbr_entry_MedikationsEinnahmeEntry)/d42e78479-true-d5727386e0: '<value-of select="name(..)"/>' ist als geschlossen definiert und dieses Element '<name/>' ist nicht erlaubt oder nicht mit diesem Inhalt erlaubt. Dies kann templateId, code oder id betreffen. Erwartet:  hl7:substanceAdministration[hl7:templateId[@root = '1.3.6.1.4.1.19376.1.9.1.3.14']] (rule-reference: d42e78479-true-d5727386e0)</assert>
   </rule>

   <!-- Checking undefined contents for template/element @isClosed="true". Match context that we did not already match -->
   <rule fpi="RUL-QQQ"
         context="*[hl7:substanceAdministration[hl7:templateId[@root = '1.2.40.0.34.6.0.11.3.72'] and hl7:templateId[@root = '2.16.840.1.113883.10.20.1.24'] and hl7:templateId[@root = '1.3.6.1.4.1.19376.1.5.3.1.4.7'] and hl7:templateId[@root = '1.3.6.1.4.1.19376.1.9.1.3.16'] and hl7:templateId[@root = '1.3.6.1.4.1.19376.1.5.3.1.4.7.1']]]/hl7:substanceAdministration[hl7:templateId[@root = '1.2.40.0.34.6.0.11.3.72'] and hl7:templateId[@root = '2.16.840.1.113883.10.20.1.24'] and hl7:templateId[@root = '1.3.6.1.4.1.19376.1.5.3.1.4.7'] and hl7:templateId[@root = '1.3.6.1.4.1.19376.1.9.1.3.16'] and hl7:templateId[@root = '1.3.6.1.4.1.19376.1.5.3.1.4.7.1']]/hl7:entryRelationship[@typeCode='REFR'][hl7:substanceAdministration/hl7:templateId[@root='1.3.6.1.4.1.19376.1.9.1.3.14']]/hl7:substanceAdministration[hl7:templateId[@root = '1.3.6.1.4.1.19376.1.9.1.3.14']]/*[not(@xsi:nil = 'true')][not(self::hl7:templateId[@root = '1.3.6.1.4.1.19376.1.9.1.3.14'] | self::hl7:id[not(@nullFlavor)] | self::hl7:code[(@code = 'CMAItem' and @codeSystem = '1.3.6.1.4.1.19376.1.9.2.2')] | self::hl7:consumable[not(@nullFlavor)][hl7:manufacturedProduct])]"
         id="d42e78488-true-d5727420e0">
      <assert role="error"
              see="http://elga.art-decor.org/elgaambbef-html-20230118T144941/tmp-1.2.40.0.34.6.0.11.3.72-2020-07-29T113517.html"
              test="not(.)">(atcdabbr_entry_MedikationsEinnahmeEntry)/d42e78488-true-d5727420e0: '<value-of select="name(..)"/>' ist als geschlossen definiert und dieses Element '<name/>' ist nicht erlaubt oder nicht mit diesem Inhalt erlaubt. Dies kann templateId, code oder id betreffen. Erwartet:  hl7:templateId[@root = '1.3.6.1.4.1.19376.1.9.1.3.14'] | hl7:id[not(@nullFlavor)] | hl7:code[(@code = 'CMAItem' and @codeSystem = '1.3.6.1.4.1.19376.1.9.2.2')] | hl7:consumable[not(@nullFlavor)][hl7:manufacturedProduct] (rule-reference: d42e78488-true-d5727420e0)</assert>
   </rule>

   <!-- Checking undefined contents for template/element @isClosed="true". Match context that we did not already match -->
   <rule fpi="RUL-QQQ"
         context="*[hl7:substanceAdministration[hl7:templateId[@root = '1.2.40.0.34.6.0.11.3.72'] and hl7:templateId[@root = '2.16.840.1.113883.10.20.1.24'] and hl7:templateId[@root = '1.3.6.1.4.1.19376.1.5.3.1.4.7'] and hl7:templateId[@root = '1.3.6.1.4.1.19376.1.9.1.3.16'] and hl7:templateId[@root = '1.3.6.1.4.1.19376.1.5.3.1.4.7.1']]]/hl7:substanceAdministration[hl7:templateId[@root = '1.2.40.0.34.6.0.11.3.72'] and hl7:templateId[@root = '2.16.840.1.113883.10.20.1.24'] and hl7:templateId[@root = '1.3.6.1.4.1.19376.1.5.3.1.4.7'] and hl7:templateId[@root = '1.3.6.1.4.1.19376.1.9.1.3.16'] and hl7:templateId[@root = '1.3.6.1.4.1.19376.1.5.3.1.4.7.1']]/hl7:entryRelationship[@typeCode='REFR'][hl7:substanceAdministration/hl7:templateId[@root='1.3.6.1.4.1.19376.1.9.1.3.14']]/hl7:substanceAdministration[hl7:templateId[@root = '1.3.6.1.4.1.19376.1.9.1.3.14']]/hl7:consumable[not(@nullFlavor)][hl7:manufacturedProduct]/*[not(@xsi:nil = 'true')][not(self::hl7:manufacturedProduct[not(@nullFlavor)][hl7:manufacturedMaterial[@nullFlavor = 'NA']])]"
         id="d42e78525-true-d5727451e0">
      <assert role="error"
              see="http://elga.art-decor.org/elgaambbef-html-20230118T144941/tmp-1.2.40.0.34.6.0.11.3.72-2020-07-29T113517.html"
              test="not(.)">(atcdabbr_entry_MedikationsEinnahmeEntry)/d42e78525-true-d5727451e0: '<value-of select="name(..)"/>' ist als geschlossen definiert und dieses Element '<name/>' ist nicht erlaubt oder nicht mit diesem Inhalt erlaubt. Dies kann templateId, code oder id betreffen. Erwartet:  hl7:manufacturedProduct[not(@nullFlavor)][hl7:manufacturedMaterial[@nullFlavor = 'NA']] (rule-reference: d42e78525-true-d5727451e0)</assert>
   </rule>

   <!-- Checking undefined contents for template/element @isClosed="true". Match context that we did not already match -->
   <rule fpi="RUL-QQQ"
         context="*[hl7:substanceAdministration[hl7:templateId[@root = '1.2.40.0.34.6.0.11.3.72'] and hl7:templateId[@root = '2.16.840.1.113883.10.20.1.24'] and hl7:templateId[@root = '1.3.6.1.4.1.19376.1.5.3.1.4.7'] and hl7:templateId[@root = '1.3.6.1.4.1.19376.1.9.1.3.16'] and hl7:templateId[@root = '1.3.6.1.4.1.19376.1.5.3.1.4.7.1']]]/hl7:substanceAdministration[hl7:templateId[@root = '1.2.40.0.34.6.0.11.3.72'] and hl7:templateId[@root = '2.16.840.1.113883.10.20.1.24'] and hl7:templateId[@root = '1.3.6.1.4.1.19376.1.5.3.1.4.7'] and hl7:templateId[@root = '1.3.6.1.4.1.19376.1.9.1.3.16'] and hl7:templateId[@root = '1.3.6.1.4.1.19376.1.5.3.1.4.7.1']]/hl7:entryRelationship[@typeCode='REFR'][hl7:substanceAdministration/hl7:templateId[@root='1.3.6.1.4.1.19376.1.9.1.3.14']]/hl7:substanceAdministration[hl7:templateId[@root = '1.3.6.1.4.1.19376.1.9.1.3.14']]/hl7:consumable[not(@nullFlavor)][hl7:manufacturedProduct]/hl7:manufacturedProduct[not(@nullFlavor)][hl7:manufacturedMaterial[@nullFlavor = 'NA']]/*[not(@xsi:nil = 'true')][not(self::hl7:manufacturedMaterial[@nullFlavor = 'NA'])]"
         id="d42e78527-true-d5727465e0">
      <assert role="error"
              see="http://elga.art-decor.org/elgaambbef-html-20230118T144941/tmp-1.2.40.0.34.6.0.11.3.72-2020-07-29T113517.html"
              test="not(.)">(atcdabbr_entry_MedikationsEinnahmeEntry)/d42e78527-true-d5727465e0: '<value-of select="name(..)"/>' ist als geschlossen definiert und dieses Element '<name/>' ist nicht erlaubt oder nicht mit diesem Inhalt erlaubt. Dies kann templateId, code oder id betreffen. Erwartet:  hl7:manufacturedMaterial[@nullFlavor = 'NA'] (rule-reference: d42e78527-true-d5727465e0)</assert>
   </rule>

   <!-- Checking undefined contents for template/element @isClosed="true". Match context that we did not already match -->
   <rule fpi="RUL-QQQ"
         context="*[hl7:substanceAdministration[hl7:templateId[@root = '1.2.40.0.34.6.0.11.3.72'] and hl7:templateId[@root = '2.16.840.1.113883.10.20.1.24'] and hl7:templateId[@root = '1.3.6.1.4.1.19376.1.5.3.1.4.7'] and hl7:templateId[@root = '1.3.6.1.4.1.19376.1.9.1.3.16'] and hl7:templateId[@root = '1.3.6.1.4.1.19376.1.5.3.1.4.7.1']]]/hl7:substanceAdministration[hl7:templateId[@root = '1.2.40.0.34.6.0.11.3.72'] and hl7:templateId[@root = '2.16.840.1.113883.10.20.1.24'] and hl7:templateId[@root = '1.3.6.1.4.1.19376.1.5.3.1.4.7'] and hl7:templateId[@root = '1.3.6.1.4.1.19376.1.9.1.3.16'] and hl7:templateId[@root = '1.3.6.1.4.1.19376.1.5.3.1.4.7.1']]/hl7:reference[@typeCode = 'XCRPT'][hl7:externalDocument]/*[not(@xsi:nil = 'true')][not(self::hl7:externalDocument[not(@nullFlavor)])]"
         id="d42e78539-true-d5727484e0">
      <assert role="error"
              see="http://elga.art-decor.org/elgaambbef-html-20230118T144941/tmp-1.2.40.0.34.6.0.11.3.72-2020-07-29T113517.html"
              test="not(.)">(atcdabbr_entry_MedikationsEinnahmeEntry)/d42e78539-true-d5727484e0: '<value-of select="name(..)"/>' ist als geschlossen definiert und dieses Element '<name/>' ist nicht erlaubt oder nicht mit diesem Inhalt erlaubt. Dies kann templateId, code oder id betreffen. Erwartet:  hl7:externalDocument[not(@nullFlavor)] (rule-reference: d42e78539-true-d5727484e0)</assert>
   </rule>

   <!-- Checking undefined contents for template/element @isClosed="true". Match context that we did not already match -->
   <rule fpi="RUL-QQQ"
         context="*[hl7:substanceAdministration[hl7:templateId[@root = '1.2.40.0.34.6.0.11.3.72'] and hl7:templateId[@root = '2.16.840.1.113883.10.20.1.24'] and hl7:templateId[@root = '1.3.6.1.4.1.19376.1.5.3.1.4.7'] and hl7:templateId[@root = '1.3.6.1.4.1.19376.1.9.1.3.16'] and hl7:templateId[@root = '1.3.6.1.4.1.19376.1.5.3.1.4.7.1']]]/hl7:substanceAdministration[hl7:templateId[@root = '1.2.40.0.34.6.0.11.3.72'] and hl7:templateId[@root = '2.16.840.1.113883.10.20.1.24'] and hl7:templateId[@root = '1.3.6.1.4.1.19376.1.5.3.1.4.7'] and hl7:templateId[@root = '1.3.6.1.4.1.19376.1.9.1.3.16'] and hl7:templateId[@root = '1.3.6.1.4.1.19376.1.5.3.1.4.7.1']]/hl7:reference[@typeCode = 'XCRPT'][hl7:externalDocument]/hl7:externalDocument[not(@nullFlavor)]/*[not(@xsi:nil = 'true')][not(self::hl7:id[not(@nullFlavor)])]"
         id="d42e78551-true-d5727498e0">
      <assert role="error"
              see="http://elga.art-decor.org/elgaambbef-html-20230118T144941/tmp-1.2.40.0.34.6.0.11.3.72-2020-07-29T113517.html"
              test="not(.)">(atcdabbr_entry_MedikationsEinnahmeEntry)/d42e78551-true-d5727498e0: '<value-of select="name(..)"/>' ist als geschlossen definiert und dieses Element '<name/>' ist nicht erlaubt oder nicht mit diesem Inhalt erlaubt. Dies kann templateId, code oder id betreffen. Erwartet:  hl7:id[not(@nullFlavor)] (rule-reference: d42e78551-true-d5727498e0)</assert>
   </rule>

   <!-- Checking undefined contents for template/element @isClosed="true". Match context that we did not already match -->
   <rule fpi="RUL-QQQ"
         context="*[hl7:substanceAdministration[hl7:templateId[@root = '1.2.40.0.34.6.0.11.3.72'] and hl7:templateId[@root = '2.16.840.1.113883.10.20.1.24'] and hl7:templateId[@root = '1.3.6.1.4.1.19376.1.5.3.1.4.7'] and hl7:templateId[@root = '1.3.6.1.4.1.19376.1.9.1.3.16'] and hl7:templateId[@root = '1.3.6.1.4.1.19376.1.5.3.1.4.7.1']]]/hl7:substanceAdministration[hl7:templateId[@root = '1.2.40.0.34.6.0.11.3.72'] and hl7:templateId[@root = '2.16.840.1.113883.10.20.1.24'] and hl7:templateId[@root = '1.3.6.1.4.1.19376.1.5.3.1.4.7'] and hl7:templateId[@root = '1.3.6.1.4.1.19376.1.9.1.3.16'] and hl7:templateId[@root = '1.3.6.1.4.1.19376.1.5.3.1.4.7.1']]/hl7:precondition[hl7:criterion]/*[not(@xsi:nil = 'true')][not(self::hl7:criterion[not(@nullFlavor)])]"
         id="d42e78562-true-d5727517e0">
      <assert role="error"
              see="http://elga.art-decor.org/elgaambbef-html-20230118T144941/tmp-1.2.40.0.34.6.0.11.3.72-2020-07-29T113517.html"
              test="not(.)">(atcdabbr_entry_MedikationsEinnahmeEntry)/d42e78562-true-d5727517e0: '<value-of select="name(..)"/>' ist als geschlossen definiert und dieses Element '<name/>' ist nicht erlaubt oder nicht mit diesem Inhalt erlaubt. Dies kann templateId, code oder id betreffen. Erwartet:  hl7:criterion[not(@nullFlavor)] (rule-reference: d42e78562-true-d5727517e0)</assert>
   </rule>

   <!-- Checking undefined contents for template/element @isClosed="true". Match context that we did not already match -->
   <rule fpi="RUL-QQQ"
         context="*[hl7:substanceAdministration[hl7:templateId[@root = '1.2.40.0.34.6.0.11.3.72'] and hl7:templateId[@root = '2.16.840.1.113883.10.20.1.24'] and hl7:templateId[@root = '1.3.6.1.4.1.19376.1.5.3.1.4.7'] and hl7:templateId[@root = '1.3.6.1.4.1.19376.1.9.1.3.16'] and hl7:templateId[@root = '1.3.6.1.4.1.19376.1.5.3.1.4.7.1']]]/hl7:substanceAdministration[hl7:templateId[@root = '1.2.40.0.34.6.0.11.3.72'] and hl7:templateId[@root = '2.16.840.1.113883.10.20.1.24'] and hl7:templateId[@root = '1.3.6.1.4.1.19376.1.5.3.1.4.7'] and hl7:templateId[@root = '1.3.6.1.4.1.19376.1.9.1.3.16'] and hl7:templateId[@root = '1.3.6.1.4.1.19376.1.5.3.1.4.7.1']]/hl7:precondition[hl7:criterion]/hl7:criterion[not(@nullFlavor)]/*[not(@xsi:nil = 'true')][not(self::hl7:text[not(@nullFlavor)])]"
         id="d42e78567-true-d5727531e0">
      <assert role="error"
              see="http://elga.art-decor.org/elgaambbef-html-20230118T144941/tmp-1.2.40.0.34.6.0.11.3.72-2020-07-29T113517.html"
              test="not(.)">(atcdabbr_entry_MedikationsEinnahmeEntry)/d42e78567-true-d5727531e0: '<value-of select="name(..)"/>' ist als geschlossen definiert und dieses Element '<name/>' ist nicht erlaubt oder nicht mit diesem Inhalt erlaubt. Dies kann templateId, code oder id betreffen. Erwartet:  hl7:text[not(@nullFlavor)] (rule-reference: d42e78567-true-d5727531e0)</assert>
   </rule>

   <!-- Checking undefined contents for template/element @isClosed="true". Match context that we did not already match -->
   <rule fpi="RUL-QQQ"
         context="*[hl7:substanceAdministration[hl7:templateId[@root = '1.2.40.0.34.6.0.11.3.72'] and hl7:templateId[@root = '2.16.840.1.113883.10.20.1.24'] and hl7:templateId[@root = '1.3.6.1.4.1.19376.1.5.3.1.4.7'] and hl7:templateId[@root = '1.3.6.1.4.1.19376.1.9.1.3.16'] and hl7:templateId[@root = '1.3.6.1.4.1.19376.1.5.3.1.4.7.1']]]/hl7:substanceAdministration[hl7:templateId[@root = '1.2.40.0.34.6.0.11.3.72'] and hl7:templateId[@root = '2.16.840.1.113883.10.20.1.24'] and hl7:templateId[@root = '1.3.6.1.4.1.19376.1.5.3.1.4.7'] and hl7:templateId[@root = '1.3.6.1.4.1.19376.1.9.1.3.16'] and hl7:templateId[@root = '1.3.6.1.4.1.19376.1.5.3.1.4.7.1']]/hl7:precondition[hl7:criterion]/hl7:criterion[not(@nullFlavor)]/hl7:text[not(@nullFlavor)]/*[not(@xsi:nil = 'true')][not(self::hl7:reference[not(@nullFlavor)])]"
         id="d42e78569-true-d5727545e0">
      <assert role="error"
              see="http://elga.art-decor.org/elgaambbef-html-20230118T144941/tmp-1.2.40.0.34.6.0.11.3.72-2020-07-29T113517.html"
              test="not(.)">(atcdabbr_entry_MedikationsEinnahmeEntry)/d42e78569-true-d5727545e0: '<value-of select="name(..)"/>' ist als geschlossen definiert und dieses Element '<name/>' ist nicht erlaubt oder nicht mit diesem Inhalt erlaubt. Dies kann templateId, code oder id betreffen. Erwartet:  hl7:reference[not(@nullFlavor)] (rule-reference: d42e78569-true-d5727545e0)</assert>
   </rule>
</pattern>
