<?xml version="1.0" encoding="UTF-8"?>
<!--
Template derived pattern
===========================================
ID: 1.2.40.0.34.6.0.11.3.98
Name: EMS Problem Concern Entry
Description: Dieses Element enthält das EMS Problem Entry, welches nähere Angaben zu der klinischen Manifestation gibt.
-->
<pattern xmlns="http://purl.oclc.org/dsdl/schematron"
         id="template-1.2.40.0.34.6.0.11.3.98-2020-05-12T163139-closed">
   <title>EMS Problem Concern Entry</title>

   <!-- Checking undefined contents for template/element @isClosed="true". Match context that we did not already match -->
   <rule fpi="RUL-QQQ"
         context="*[hl7:act[hl7:templateId[@root = '1.2.40.0.34.6.0.11.3.98'] and hl7:templateId[@root = '1.2.40.0.34.6.0.11.3.7'] and hl7:templateId[@root = '2.16.840.1.113883.10.20.1.27'] and hl7:templateId[@root = '1.3.6.1.4.1.19376.1.5.3.1.4.5.1'] and hl7:templateId[@root = '1.3.6.1.4.1.19376.1.5.3.1.4.5.2']]]/*[not(@xsi:nil = 'true')][not(self::hl7:act[hl7:templateId[@root = '1.2.40.0.34.6.0.11.3.98'] and hl7:templateId[@root = '1.2.40.0.34.6.0.11.3.7'] and hl7:templateId[@root = '2.16.840.1.113883.10.20.1.27'] and hl7:templateId[@root = '1.3.6.1.4.1.19376.1.5.3.1.4.5.1'] and hl7:templateId[@root = '1.3.6.1.4.1.19376.1.5.3.1.4.5.2']])]"
         id="d42e23589-true-d298188e0">
      <assert role="error"
              see="https://elga.art-decor.org/epims-html-20250116T123132/tmp-1.2.40.0.34.6.0.11.3.98-2020-05-12T163139.html"
              test="not(.)">(epims_entry_ProblemConcern)/d42e23589-true-d298188e0: '<value-of select="name(..)"/>' ist als geschlossen definiert und dieses Element '<name/>' ist nicht erlaubt oder nicht mit diesem Inhalt erlaubt. Dies kann templateId, code oder id betreffen. Erwartet:  hl7:act[hl7:templateId[@root = '1.2.40.0.34.6.0.11.3.98'] and hl7:templateId[@root = '1.2.40.0.34.6.0.11.3.7'] and hl7:templateId[@root = '2.16.840.1.113883.10.20.1.27'] and hl7:templateId[@root = '1.3.6.1.4.1.19376.1.5.3.1.4.5.1'] and hl7:templateId[@root = '1.3.6.1.4.1.19376.1.5.3.1.4.5.2']] (rule-reference: d42e23589-true-d298188e0)</assert>
   </rule>

   <!-- Checking undefined contents for template/element @isClosed="true". Match context that we did not already match -->
   <rule fpi="RUL-QQQ"
         context="*[hl7:act[hl7:templateId[@root = '1.2.40.0.34.6.0.11.3.98'] and hl7:templateId[@root = '1.2.40.0.34.6.0.11.3.7'] and hl7:templateId[@root = '2.16.840.1.113883.10.20.1.27'] and hl7:templateId[@root = '1.3.6.1.4.1.19376.1.5.3.1.4.5.1'] and hl7:templateId[@root = '1.3.6.1.4.1.19376.1.5.3.1.4.5.2']]]/hl7:act[hl7:templateId[@root = '1.2.40.0.34.6.0.11.3.98'] and hl7:templateId[@root = '1.2.40.0.34.6.0.11.3.7'] and hl7:templateId[@root = '2.16.840.1.113883.10.20.1.27'] and hl7:templateId[@root = '1.3.6.1.4.1.19376.1.5.3.1.4.5.1'] and hl7:templateId[@root = '1.3.6.1.4.1.19376.1.5.3.1.4.5.2']]/*[not(@xsi:nil = 'true')][not(self::hl7:templateId[@root = '1.2.40.0.34.6.0.11.3.98'] | self::hl7:templateId[@root = '1.2.40.0.34.6.0.11.3.7'] | self::hl7:templateId[@root = '2.16.840.1.113883.10.20.1.27'] | self::hl7:templateId[@root = '1.3.6.1.4.1.19376.1.5.3.1.4.5.1'] | self::hl7:templateId[@root = '1.3.6.1.4.1.19376.1.5.3.1.4.5.2'] | self::hl7:id[not(@nullFlavor)] | self::hl7:code[@nullFlavor = 'NA'] | self::hl7:statusCode[@code = 'active'] | self::hl7:effectiveTime | self::hl7:entryRelationship[@typeCode='SUBJ'][not(@nullFlavor)])]"
         id="d42e23632-true-d298264e0">
      <assert role="error"
              see="https://elga.art-decor.org/epims-html-20250116T123132/tmp-1.2.40.0.34.6.0.11.3.98-2020-05-12T163139.html"
              test="not(.)">(epims_entry_ProblemConcern)/d42e23632-true-d298264e0: '<value-of select="name(..)"/>' ist als geschlossen definiert und dieses Element '<name/>' ist nicht erlaubt oder nicht mit diesem Inhalt erlaubt. Dies kann templateId, code oder id betreffen. Erwartet:  hl7:templateId[@root = '1.2.40.0.34.6.0.11.3.98'] | hl7:templateId[@root = '1.2.40.0.34.6.0.11.3.7'] | hl7:templateId[@root = '2.16.840.1.113883.10.20.1.27'] | hl7:templateId[@root = '1.3.6.1.4.1.19376.1.5.3.1.4.5.1'] | hl7:templateId[@root = '1.3.6.1.4.1.19376.1.5.3.1.4.5.2'] | hl7:id[not(@nullFlavor)] | hl7:code[@nullFlavor = 'NA'] | hl7:statusCode[@code = 'active'] | hl7:effectiveTime | hl7:entryRelationship[@typeCode='SUBJ'][not(@nullFlavor)] (rule-reference: d42e23632-true-d298264e0)</assert>
   </rule>

   <!-- Checking undefined contents for template/element @isClosed="true". Match context that we did not already match -->
   <rule fpi="RUL-QQQ"
         context="*[hl7:act[hl7:templateId[@root = '1.2.40.0.34.6.0.11.3.98'] and hl7:templateId[@root = '1.2.40.0.34.6.0.11.3.7'] and hl7:templateId[@root = '2.16.840.1.113883.10.20.1.27'] and hl7:templateId[@root = '1.3.6.1.4.1.19376.1.5.3.1.4.5.1'] and hl7:templateId[@root = '1.3.6.1.4.1.19376.1.5.3.1.4.5.2']]]/hl7:act[hl7:templateId[@root = '1.2.40.0.34.6.0.11.3.98'] and hl7:templateId[@root = '1.2.40.0.34.6.0.11.3.7'] and hl7:templateId[@root = '2.16.840.1.113883.10.20.1.27'] and hl7:templateId[@root = '1.3.6.1.4.1.19376.1.5.3.1.4.5.1'] and hl7:templateId[@root = '1.3.6.1.4.1.19376.1.5.3.1.4.5.2']]/hl7:effectiveTime/*[not(@xsi:nil = 'true')][not(self::hl7:low | self::hl7:high)]"
         id="d42e23703-true-d298329e0">
      <assert role="error"
              see="https://elga.art-decor.org/epims-html-20250116T123132/tmp-1.2.40.0.34.6.0.11.3.98-2020-05-12T163139.html"
              test="not(.)">(epims_entry_ProblemConcern)/d42e23703-true-d298329e0: '<value-of select="name(..)"/>' ist als geschlossen definiert und dieses Element '<name/>' ist nicht erlaubt oder nicht mit diesem Inhalt erlaubt. Dies kann templateId, code oder id betreffen. Erwartet:  hl7:low | hl7:high (rule-reference: d42e23703-true-d298329e0)</assert>
   </rule>

   <!-- Checking undefined contents for template/element @isClosed="true". Match context that we did not already match -->
   <rule fpi="RUL-QQQ"
         context="*[hl7:act[hl7:templateId[@root = '1.2.40.0.34.6.0.11.3.98'] and hl7:templateId[@root = '1.2.40.0.34.6.0.11.3.7'] and hl7:templateId[@root = '2.16.840.1.113883.10.20.1.27'] and hl7:templateId[@root = '1.3.6.1.4.1.19376.1.5.3.1.4.5.1'] and hl7:templateId[@root = '1.3.6.1.4.1.19376.1.5.3.1.4.5.2']]]/hl7:act[hl7:templateId[@root = '1.2.40.0.34.6.0.11.3.98'] and hl7:templateId[@root = '1.2.40.0.34.6.0.11.3.7'] and hl7:templateId[@root = '2.16.840.1.113883.10.20.1.27'] and hl7:templateId[@root = '1.3.6.1.4.1.19376.1.5.3.1.4.5.1'] and hl7:templateId[@root = '1.3.6.1.4.1.19376.1.5.3.1.4.5.2']]/hl7:entryRelationship[@typeCode='SUBJ'][not(@nullFlavor)]/*[not(@xsi:nil = 'true')][not(self::hl7:observation[hl7:templateId[@root = '1.2.40.0.34.6.0.11.3.99'] and hl7:templateId[@root = '1.2.40.0.34.6.0.11.3.6'] and hl7:templateId[@root = '2.16.840.1.113883.10.20.1.28'] and hl7:templateId[@root = '1.3.6.1.4.1.19376.1.5.3.1.4.5']])]"
         id="d42e23733-true-d298368e0">
      <assert role="error"
              see="https://elga.art-decor.org/epims-html-20250116T123132/tmp-1.2.40.0.34.6.0.11.3.98-2020-05-12T163139.html"
              test="not(.)">(epims_entry_ProblemConcern)/d42e23733-true-d298368e0: '<value-of select="name(..)"/>' ist als geschlossen definiert und dieses Element '<name/>' ist nicht erlaubt oder nicht mit diesem Inhalt erlaubt. Dies kann templateId, code oder id betreffen. Erwartet:  hl7:observation[hl7:templateId[@root = '1.2.40.0.34.6.0.11.3.99'] and hl7:templateId[@root = '1.2.40.0.34.6.0.11.3.6'] and hl7:templateId[@root = '2.16.840.1.113883.10.20.1.28'] and hl7:templateId[@root = '1.3.6.1.4.1.19376.1.5.3.1.4.5']] (rule-reference: d42e23733-true-d298368e0)</assert>
   </rule>

   <!-- Checking undefined contents for template/element @isClosed="true". Match context that we did not already match -->
   <rule fpi="RUL-QQQ"
         context="*[hl7:act[hl7:templateId[@root = '1.2.40.0.34.6.0.11.3.98'] and hl7:templateId[@root = '1.2.40.0.34.6.0.11.3.7'] and hl7:templateId[@root = '2.16.840.1.113883.10.20.1.27'] and hl7:templateId[@root = '1.3.6.1.4.1.19376.1.5.3.1.4.5.1'] and hl7:templateId[@root = '1.3.6.1.4.1.19376.1.5.3.1.4.5.2']]]/hl7:act[hl7:templateId[@root = '1.2.40.0.34.6.0.11.3.98'] and hl7:templateId[@root = '1.2.40.0.34.6.0.11.3.7'] and hl7:templateId[@root = '2.16.840.1.113883.10.20.1.27'] and hl7:templateId[@root = '1.3.6.1.4.1.19376.1.5.3.1.4.5.1'] and hl7:templateId[@root = '1.3.6.1.4.1.19376.1.5.3.1.4.5.2']]/hl7:entryRelationship[@typeCode='SUBJ'][not(@nullFlavor)]/hl7:observation[hl7:templateId[@root = '1.2.40.0.34.6.0.11.3.99'] and hl7:templateId[@root = '1.2.40.0.34.6.0.11.3.6'] and hl7:templateId[@root = '2.16.840.1.113883.10.20.1.28'] and hl7:templateId[@root = '1.3.6.1.4.1.19376.1.5.3.1.4.5']]/*[not(@xsi:nil = 'true')][not(self::hl7:templateId[@root = '1.2.40.0.34.6.0.11.3.99'] | self::hl7:templateId[@root = '1.2.40.0.34.6.0.11.3.6'] | self::hl7:templateId[@root = '2.16.840.1.113883.10.20.1.28'] | self::hl7:templateId[@root = '1.3.6.1.4.1.19376.1.5.3.1.4.5'] | self::hl7:id | self::hl7:code[(@code = '404684003' and @codeSystem = '2.16.840.1.113883.6.96')] | self::hl7:text | self::hl7:statusCode[@code = 'completed'] | self::hl7:effectiveTime | self::hl7:value[concat(@code, @codeSystem) = doc('include/voc-1.2.40.0.34.6.0.10.25-DYNAMIC.xml')//valueSet[1]/conceptList/concept/concat(@code, @codeSystem)])]"
         id="d298344e5-true-d298450e0">
      <assert role="error"
              see="https://elga.art-decor.org/epims-html-20250116T123132/tmp-1.2.40.0.34.6.0.11.3.98-2020-05-12T163139.html"
              test="not(.)">(epims_entry_ProblemConcern)/d298344e5-true-d298450e0: '<value-of select="name(..)"/>' ist als geschlossen definiert und dieses Element '<name/>' ist nicht erlaubt oder nicht mit diesem Inhalt erlaubt. Dies kann templateId, code oder id betreffen. Erwartet:  hl7:templateId[@root = '1.2.40.0.34.6.0.11.3.99'] | hl7:templateId[@root = '1.2.40.0.34.6.0.11.3.6'] | hl7:templateId[@root = '2.16.840.1.113883.10.20.1.28'] | hl7:templateId[@root = '1.3.6.1.4.1.19376.1.5.3.1.4.5'] | hl7:id | hl7:code[(@code = '404684003' and @codeSystem = '2.16.840.1.113883.6.96')] | hl7:text | hl7:statusCode[@code = 'completed'] | hl7:effectiveTime | hl7:value[concat(@code, @codeSystem) = doc('include/voc-1.2.40.0.34.6.0.10.25-DYNAMIC.xml')//valueSet[1]/conceptList/concept/concat(@code, @codeSystem)] (rule-reference: d298344e5-true-d298450e0)</assert>
   </rule>

   <!-- Checking undefined contents for template/element @isClosed="true". Match context that we did not already match -->
   <rule fpi="RUL-QQQ"
         context="*[hl7:act[hl7:templateId[@root = '1.2.40.0.34.6.0.11.3.98'] and hl7:templateId[@root = '1.2.40.0.34.6.0.11.3.7'] and hl7:templateId[@root = '2.16.840.1.113883.10.20.1.27'] and hl7:templateId[@root = '1.3.6.1.4.1.19376.1.5.3.1.4.5.1'] and hl7:templateId[@root = '1.3.6.1.4.1.19376.1.5.3.1.4.5.2']]]/hl7:act[hl7:templateId[@root = '1.2.40.0.34.6.0.11.3.98'] and hl7:templateId[@root = '1.2.40.0.34.6.0.11.3.7'] and hl7:templateId[@root = '2.16.840.1.113883.10.20.1.27'] and hl7:templateId[@root = '1.3.6.1.4.1.19376.1.5.3.1.4.5.1'] and hl7:templateId[@root = '1.3.6.1.4.1.19376.1.5.3.1.4.5.2']]/hl7:entryRelationship[@typeCode='SUBJ'][not(@nullFlavor)]/hl7:observation[hl7:templateId[@root = '1.2.40.0.34.6.0.11.3.99'] and hl7:templateId[@root = '1.2.40.0.34.6.0.11.3.6'] and hl7:templateId[@root = '2.16.840.1.113883.10.20.1.28'] and hl7:templateId[@root = '1.3.6.1.4.1.19376.1.5.3.1.4.5']]/hl7:text/*[not(@xsi:nil = 'true')][not(self::hl7:reference[not(@nullFlavor)])]"
         id="d298489e54-true-d298501e0">
      <assert role="error"
              see="https://elga.art-decor.org/epims-html-20250116T123132/tmp-1.2.40.0.34.6.0.11.9.1-2021-05-06T093820.html"
              test="not(.)">(atcdabrr_other_NarrativeTextReference)/d298489e54-true-d298501e0: '<value-of select="name(..)"/>' ist als geschlossen definiert und dieses Element '<name/>' ist nicht erlaubt oder nicht mit diesem Inhalt erlaubt. Dies kann templateId, code oder id betreffen. Erwartet:  hl7:reference[not(@nullFlavor)] (rule-reference: d298489e54-true-d298501e0)</assert>
   </rule>

   <!-- Checking undefined contents for template/element @isClosed="true". Match context that we did not already match -->
   <rule fpi="RUL-QQQ"
         context="*[hl7:act[hl7:templateId[@root = '1.2.40.0.34.6.0.11.3.98'] and hl7:templateId[@root = '1.2.40.0.34.6.0.11.3.7'] and hl7:templateId[@root = '2.16.840.1.113883.10.20.1.27'] and hl7:templateId[@root = '1.3.6.1.4.1.19376.1.5.3.1.4.5.1'] and hl7:templateId[@root = '1.3.6.1.4.1.19376.1.5.3.1.4.5.2']]]/hl7:act[hl7:templateId[@root = '1.2.40.0.34.6.0.11.3.98'] and hl7:templateId[@root = '1.2.40.0.34.6.0.11.3.7'] and hl7:templateId[@root = '2.16.840.1.113883.10.20.1.27'] and hl7:templateId[@root = '1.3.6.1.4.1.19376.1.5.3.1.4.5.1'] and hl7:templateId[@root = '1.3.6.1.4.1.19376.1.5.3.1.4.5.2']]/hl7:entryRelationship[@typeCode='SUBJ'][not(@nullFlavor)]/hl7:observation[hl7:templateId[@root = '1.2.40.0.34.6.0.11.3.99'] and hl7:templateId[@root = '1.2.40.0.34.6.0.11.3.6'] and hl7:templateId[@root = '2.16.840.1.113883.10.20.1.28'] and hl7:templateId[@root = '1.3.6.1.4.1.19376.1.5.3.1.4.5']]/hl7:effectiveTime/*[not(@xsi:nil = 'true')][not(self::hl7:low[not(@nullFlavor)] | self::hl7:high)]"
         id="d298344e85-true-d298531e0">
      <assert role="error"
              see="https://elga.art-decor.org/epims-html-20250116T123132/tmp-1.2.40.0.34.6.0.11.3.98-2020-05-12T163139.html"
              test="not(.)">(epims_entry_ProblemConcern)/d298344e85-true-d298531e0: '<value-of select="name(..)"/>' ist als geschlossen definiert und dieses Element '<name/>' ist nicht erlaubt oder nicht mit diesem Inhalt erlaubt. Dies kann templateId, code oder id betreffen. Erwartet:  hl7:low[not(@nullFlavor)] | hl7:high (rule-reference: d298344e85-true-d298531e0)</assert>
   </rule>
</pattern>
