<?xml version="1.0" encoding="UTF-8"?>
<!--
Template derived pattern
===========================================
ID: 1.2.40.0.34.6.0.11.0.17
Name: Befund bildgebende Diagnostik
Description: Document Level Template Befund bildgebende Diagnostik                                             
                                                             IN BEARBEITUNG                                              
            
-->
<pattern xmlns="http://purl.oclc.org/dsdl/schematron"
         id="template-1.2.40.0.34.6.0.11.0.17-2024-06-28T102807-closed">
   <title>Befund bildgebende Diagnostik</title>
</pattern>
