<?xml version="1.0" encoding="UTF-8"?>
<!--
Template derived pattern
===========================================
ID: 1.2.40.0.34.6.0.11.3.168
Name: Zusatzklassifikation
Description: 
-->
<pattern xmlns="http://purl.oclc.org/dsdl/schematron"
         id="template-1.2.40.0.34.6.0.11.3.168-2021-05-19T150409">
   <title>Zusatzklassifikation</title>
   <!--
Template derived rules for ID: 1.2.40.0.34.6.0.11.3.168
Context: *[hl7:observation[hl7:templateId[@root = '1.2.40.0.34.6.0.11.3.168']]]
Item: (atcdabbr_entry_Zusatzklassifikation)
-->

   <!--
Template derived rules for ID: 1.2.40.0.34.6.0.11.3.168
Context: *[hl7:observation[hl7:templateId[@root = '1.2.40.0.34.6.0.11.3.168']]]/hl7:observation[hl7:templateId[@root = '1.2.40.0.34.6.0.11.3.168']]
Item: (atcdabbr_entry_Zusatzklassifikation)
-->

   <rule fpi="RULC-1"
         context="*[hl7:observation[hl7:templateId[@root = '1.2.40.0.34.6.0.11.3.168']]]/hl7:observation[hl7:templateId[@root = '1.2.40.0.34.6.0.11.3.168']]"
         id="d42e41557-false-d1874075e0">
      <assert role="error"
              see="https://elga.art-decor.org/elgabgd-html-20250116T125424/tmp-1.2.40.0.34.6.0.11.3.168-2021-05-19T150409.html"
              test="string(@classCode) = ('OBS')">(atcdabbr_entry_Zusatzklassifikation): Der Wert von classCode MUSS 'OBS' sein. Gefunden: "<value-of select="@classCode"/>"</assert>
      <assert role="error"
              see="https://elga.art-decor.org/elgabgd-html-20250116T125424/tmp-1.2.40.0.34.6.0.11.3.168-2021-05-19T150409.html"
              test="string(@moodCode) = ('EVN')">(atcdabbr_entry_Zusatzklassifikation): Der Wert von moodCode MUSS 'EVN' sein. Gefunden: "<value-of select="@moodCode"/>"</assert>
      <assert role="error"
              see="https://elga.art-decor.org/elgabgd-html-20250116T125424/tmp-1.2.40.0.34.6.0.11.3.168-2021-05-19T150409.html"
              test="count(hl7:templateId[@root = '1.2.40.0.34.6.0.11.3.168']) &gt;= 1">(atcdabbr_entry_Zusatzklassifikation): Element hl7:templateId[@root = '1.2.40.0.34.6.0.11.3.168'] ist mandatory [min 1x].</assert>
      <assert role="error"
              see="https://elga.art-decor.org/elgabgd-html-20250116T125424/tmp-1.2.40.0.34.6.0.11.3.168-2021-05-19T150409.html"
              test="count(hl7:templateId[@root = '1.2.40.0.34.6.0.11.3.168']) &lt;= 1">(atcdabbr_entry_Zusatzklassifikation): Element hl7:templateId[@root = '1.2.40.0.34.6.0.11.3.168'] kommt zu häufig vor [max 1x].</assert>
      <assert role="error"
              see="https://elga.art-decor.org/elgabgd-html-20250116T125424/tmp-1.2.40.0.34.6.0.11.3.168-2021-05-19T150409.html"
              test="count(hl7:code[concat(@code, @codeSystem) = doc('include/voc-1.2.40.0.34.6.0.10.62-DYNAMIC.xml')//valueSet[1]/conceptList/concept/concat(@code, @codeSystem)]) &gt;= 1">(atcdabbr_entry_Zusatzklassifikation): Element hl7:code[concat(@code, @codeSystem) = doc('include/voc-1.2.40.0.34.6.0.10.62-DYNAMIC.xml')//valueSet[1]/conceptList/concept/concat(@code, @codeSystem)] ist mandatory [min 1x].</assert>
      <assert role="error"
              see="https://elga.art-decor.org/elgabgd-html-20250116T125424/tmp-1.2.40.0.34.6.0.11.3.168-2021-05-19T150409.html"
              test="count(hl7:code[concat(@code, @codeSystem) = doc('include/voc-1.2.40.0.34.6.0.10.62-DYNAMIC.xml')//valueSet[1]/conceptList/concept/concat(@code, @codeSystem)]) &lt;= 1">(atcdabbr_entry_Zusatzklassifikation): Element hl7:code[concat(@code, @codeSystem) = doc('include/voc-1.2.40.0.34.6.0.10.62-DYNAMIC.xml')//valueSet[1]/conceptList/concept/concat(@code, @codeSystem)] kommt zu häufig vor [max 1x].</assert>
      <assert role="error"
              see="https://elga.art-decor.org/elgabgd-html-20250116T125424/tmp-1.2.40.0.34.6.0.11.3.168-2021-05-19T150409.html"
              test="count(hl7:text) &lt;= 1">(atcdabbr_entry_Zusatzklassifikation): Element hl7:text kommt zu häufig vor [max 1x].</assert>
      <assert role="error"
              see="https://elga.art-decor.org/elgabgd-html-20250116T125424/tmp-1.2.40.0.34.6.0.11.3.168-2021-05-19T150409.html"
              test="count(hl7:value[concat(@code, @codeSystem) = doc('include/voc-1.2.40.0.34.6.0.10.62-DYNAMIC.xml')//valueSet[1]/conceptList/concept/concat(@code, @codeSystem)]) &gt;= 1">(atcdabbr_entry_Zusatzklassifikation): Element hl7:value[concat(@code, @codeSystem) = doc('include/voc-1.2.40.0.34.6.0.10.62-DYNAMIC.xml')//valueSet[1]/conceptList/concept/concat(@code, @codeSystem)] ist mandatory [min 1x].</assert>
      <assert role="error"
              see="https://elga.art-decor.org/elgabgd-html-20250116T125424/tmp-1.2.40.0.34.6.0.11.3.168-2021-05-19T150409.html"
              test="count(hl7:value[concat(@code, @codeSystem) = doc('include/voc-1.2.40.0.34.6.0.10.62-DYNAMIC.xml')//valueSet[1]/conceptList/concept/concat(@code, @codeSystem)]) &lt;= 1">(atcdabbr_entry_Zusatzklassifikation): Element hl7:value[concat(@code, @codeSystem) = doc('include/voc-1.2.40.0.34.6.0.10.62-DYNAMIC.xml')//valueSet[1]/conceptList/concept/concat(@code, @codeSystem)] kommt zu häufig vor [max 1x].</assert>
   </rule>
   <!--
Template derived rules for ID: 1.2.40.0.34.6.0.11.3.168
Context: *[hl7:observation[hl7:templateId[@root = '1.2.40.0.34.6.0.11.3.168']]]/hl7:observation[hl7:templateId[@root = '1.2.40.0.34.6.0.11.3.168']]/hl7:templateId[@root = '1.2.40.0.34.6.0.11.3.168']
Item: (atcdabbr_entry_Zusatzklassifikation)
-->

   <rule fpi="RULC-1"
         context="*[hl7:observation[hl7:templateId[@root = '1.2.40.0.34.6.0.11.3.168']]]/hl7:observation[hl7:templateId[@root = '1.2.40.0.34.6.0.11.3.168']]/hl7:templateId[@root = '1.2.40.0.34.6.0.11.3.168']"
         id="d42e41563-false-d1874133e0">
      <extends rule="II"/>
      <assert role="error"
              see="https://elga.art-decor.org/elgabgd-html-20250116T125424/tmp-1.2.40.0.34.6.0.11.3.168-2021-05-19T150409.html"
              test="empty(@xsi:type) or resolve-QName(@xsi:type, .) = QName('urn:hl7-org:v3', 'II')">(atcdabbr_entry_Zusatzklassifikation): Wenn eine @xsi:type Instruktion anwesend ist MUSS diese den Wert "{urn:hl7-org:v3}:II" haben. Gefunden "{<value-of select="namespace-uri-from-QName(resolve-QName(@xsi:type,.))"/>}:<value-of select="local-name-from-QName(resolve-QName(@xsi:type,.))"/>"</assert>
      <assert role="error"
              see="https://elga.art-decor.org/elgabgd-html-20250116T125424/tmp-1.2.40.0.34.6.0.11.3.168-2021-05-19T150409.html"
              test="string(@root) = ('1.2.40.0.34.6.0.11.3.168')">(atcdabbr_entry_Zusatzklassifikation): Der Wert von root MUSS '1.2.40.0.34.6.0.11.3.168' sein. Gefunden: "<value-of select="@root"/>"</assert>
   </rule>
   <!--
Template derived rules for ID: 1.2.40.0.34.6.0.11.3.168
Context: *[hl7:observation[hl7:templateId[@root = '1.2.40.0.34.6.0.11.3.168']]]/hl7:observation[hl7:templateId[@root = '1.2.40.0.34.6.0.11.3.168']]/hl7:id
Item: (atcdabbr_entry_Zusatzklassifikation)
-->

   <rule fpi="RULC-1"
         context="*[hl7:observation[hl7:templateId[@root = '1.2.40.0.34.6.0.11.3.168']]]/hl7:observation[hl7:templateId[@root = '1.2.40.0.34.6.0.11.3.168']]/hl7:id"
         id="d42e41572-false-d1874147e0">
      <extends rule="II"/>
      <assert role="error"
              see="https://elga.art-decor.org/elgabgd-html-20250116T125424/tmp-1.2.40.0.34.6.0.11.3.168-2021-05-19T150409.html"
              test="empty(@xsi:type) or resolve-QName(@xsi:type, .) = QName('urn:hl7-org:v3', 'II')">(atcdabbr_entry_Zusatzklassifikation): Wenn eine @xsi:type Instruktion anwesend ist MUSS diese den Wert "{urn:hl7-org:v3}:II" haben. Gefunden "{<value-of select="namespace-uri-from-QName(resolve-QName(@xsi:type,.))"/>}:<value-of select="local-name-from-QName(resolve-QName(@xsi:type,.))"/>"</assert>
   </rule>
   <!--
Template derived rules for ID: 1.2.40.0.34.6.0.11.3.168
Context: *[hl7:observation[hl7:templateId[@root = '1.2.40.0.34.6.0.11.3.168']]]/hl7:observation[hl7:templateId[@root = '1.2.40.0.34.6.0.11.3.168']]/hl7:code[concat(@code, @codeSystem) = doc('include/voc-1.2.40.0.34.6.0.10.62-DYNAMIC.xml')//valueSet[1]/conceptList/concept/concat(@code, @codeSystem)]
Item: (atcdabbr_entry_Zusatzklassifikation)
-->

   <rule fpi="RULC-1"
         context="*[hl7:observation[hl7:templateId[@root = '1.2.40.0.34.6.0.11.3.168']]]/hl7:observation[hl7:templateId[@root = '1.2.40.0.34.6.0.11.3.168']]/hl7:code[concat(@code, @codeSystem) = doc('include/voc-1.2.40.0.34.6.0.10.62-DYNAMIC.xml')//valueSet[1]/conceptList/concept/concat(@code, @codeSystem)]"
         id="d42e41579-false-d1874160e0">
      <extends rule="CD"/>
      <assert role="error"
              see="https://elga.art-decor.org/elgabgd-html-20250116T125424/tmp-1.2.40.0.34.6.0.11.3.168-2021-05-19T150409.html"
              test="empty(@xsi:type) or resolve-QName(@xsi:type, .) = QName('urn:hl7-org:v3', 'CD')">(atcdabbr_entry_Zusatzklassifikation): Wenn eine @xsi:type Instruktion anwesend ist MUSS diese den Wert "{urn:hl7-org:v3}:CD" haben. Gefunden "{<value-of select="namespace-uri-from-QName(resolve-QName(@xsi:type,.))"/>}:<value-of select="local-name-from-QName(resolve-QName(@xsi:type,.))"/>"</assert>
      <let name="theCode" value="@code"/>
      <let name="theCodeSystem" value="@codeSystem"/>
      <assert role="error"
              see="https://elga.art-decor.org/elgabgd-html-20250116T125424/tmp-1.2.40.0.34.6.0.11.3.168-2021-05-19T150409.html"
              test="@nullFlavor or exists(doc('include/voc-1.2.40.0.34.6.0.10.62-DYNAMIC.xml')//valueSet[1][conceptList/concept[@code = $theCode][@codeSystem = $theCodeSystem]])">(atcdabbr_entry_Zusatzklassifikation): Der Elementinhalt MUSS einer von '1.2.40.0.34.6.0.10.62 eImpf_Zusatzklassifikation (DYNAMIC)' sein.</assert>
      <assert role="error"
              see="https://elga.art-decor.org/elgabgd-html-20250116T125424/tmp-1.2.40.0.34.6.0.11.3.168-2021-05-19T150409.html"
              test="@codeSystem">(atcdabbr_entry_Zusatzklassifikation): Attribut @codeSystem MUSS vorkommen.</assert>
      <assert role="error"
              see="https://elga.art-decor.org/elgabgd-html-20250116T125424/tmp-1.2.40.0.34.6.0.11.3.168-2021-05-19T150409.html"
              test="not(@codeSystem) or matches(@codeSystem,'^[0-2](\.(0|[1-9]\d*))*$')">(atcdabbr_entry_Zusatzklassifikation): Attribute @codeSystem MUSS vom Datentyp 'oid' sein  - '<value-of select="@codeSystem"/>'</assert>
      <assert role="error"
              see="https://elga.art-decor.org/elgabgd-html-20250116T125424/tmp-1.2.40.0.34.6.0.11.3.168-2021-05-19T150409.html"
              test="@code">(atcdabbr_entry_Zusatzklassifikation): Attribut @code MUSS vorkommen.</assert>
      <assert role="error"
              see="https://elga.art-decor.org/elgabgd-html-20250116T125424/tmp-1.2.40.0.34.6.0.11.3.168-2021-05-19T150409.html"
              test="not(@code) or (string-length(@code) &gt; 0 and not(matches(@code,'\s')))">(atcdabbr_entry_Zusatzklassifikation): Attribute @code MUSS vom Datentyp 'cs' sein  - '<value-of select="@code"/>'</assert>
   </rule>
   <!--
Template derived rules for ID: 1.2.40.0.34.6.0.11.3.168
Context: *[hl7:observation[hl7:templateId[@root = '1.2.40.0.34.6.0.11.3.168']]]/hl7:observation[hl7:templateId[@root = '1.2.40.0.34.6.0.11.3.168']]/hl7:text
Item: (atcdabbr_entry_Zusatzklassifikation)
-->

   <rule fpi="RULC-1"
         context="*[hl7:observation[hl7:templateId[@root = '1.2.40.0.34.6.0.11.3.168']]]/hl7:observation[hl7:templateId[@root = '1.2.40.0.34.6.0.11.3.168']]/hl7:text"
         id="d42e41594-false-d1874190e0">
      <extends rule="ED"/>
      <assert role="error"
              see="https://elga.art-decor.org/elgabgd-html-20250116T125424/tmp-1.2.40.0.34.6.0.11.3.168-2021-05-19T150409.html"
              test="empty(@xsi:type) or resolve-QName(@xsi:type, .) = QName('urn:hl7-org:v3', 'ED')">(atcdabbr_entry_Zusatzklassifikation): Wenn eine @xsi:type Instruktion anwesend ist MUSS diese den Wert "{urn:hl7-org:v3}:ED" haben. Gefunden "{<value-of select="namespace-uri-from-QName(resolve-QName(@xsi:type,.))"/>}:<value-of select="local-name-from-QName(resolve-QName(@xsi:type,.))"/>"</assert>
   </rule>
   <!--
Template derived rules for ID: 1.2.40.0.34.6.0.11.3.168
Context: *[hl7:observation[hl7:templateId[@root = '1.2.40.0.34.6.0.11.3.168']]]/hl7:observation[hl7:templateId[@root = '1.2.40.0.34.6.0.11.3.168']]/hl7:value[concat(@code, @codeSystem) = doc('include/voc-1.2.40.0.34.6.0.10.62-DYNAMIC.xml')//valueSet[1]/conceptList/concept/concat(@code, @codeSystem)]
Item: (atcdabbr_entry_Zusatzklassifikation)
-->

   <rule fpi="RULC-1"
         context="*[hl7:observation[hl7:templateId[@root = '1.2.40.0.34.6.0.11.3.168']]]/hl7:observation[hl7:templateId[@root = '1.2.40.0.34.6.0.11.3.168']]/hl7:value[concat(@code, @codeSystem) = doc('include/voc-1.2.40.0.34.6.0.10.62-DYNAMIC.xml')//valueSet[1]/conceptList/concept/concat(@code, @codeSystem)]"
         id="d42e41600-false-d1874203e0">
      <extends rule="CD"/>
      <assert role="error"
              see="https://elga.art-decor.org/elgabgd-html-20250116T125424/tmp-1.2.40.0.34.6.0.11.3.168-2021-05-19T150409.html"
              test="empty(@xsi:type) or resolve-QName(@xsi:type, .) = QName('urn:hl7-org:v3', 'CD')">(atcdabbr_entry_Zusatzklassifikation): Wenn eine @xsi:type Instruktion anwesend ist MUSS diese den Wert "{urn:hl7-org:v3}:CD" haben. Gefunden "{<value-of select="namespace-uri-from-QName(resolve-QName(@xsi:type,.))"/>}:<value-of select="local-name-from-QName(resolve-QName(@xsi:type,.))"/>"</assert>
      <let name="theCode" value="@code"/>
      <let name="theCodeSystem" value="@codeSystem"/>
      <assert role="error"
              see="https://elga.art-decor.org/elgabgd-html-20250116T125424/tmp-1.2.40.0.34.6.0.11.3.168-2021-05-19T150409.html"
              test="@nullFlavor or exists(doc('include/voc-1.2.40.0.34.6.0.10.62-DYNAMIC.xml')//valueSet[1][conceptList/concept[@code = $theCode][@codeSystem = $theCodeSystem]])">(atcdabbr_entry_Zusatzklassifikation): Der Elementinhalt MUSS einer von '1.2.40.0.34.6.0.10.62 eImpf_Zusatzklassifikation (DYNAMIC)' sein.</assert>
      <assert role="error"
              see="https://elga.art-decor.org/elgabgd-html-20250116T125424/tmp-1.2.40.0.34.6.0.11.3.168-2021-05-19T150409.html"
              test="@codeSystem">(atcdabbr_entry_Zusatzklassifikation): Attribut @codeSystem MUSS vorkommen.</assert>
      <assert role="error"
              see="https://elga.art-decor.org/elgabgd-html-20250116T125424/tmp-1.2.40.0.34.6.0.11.3.168-2021-05-19T150409.html"
              test="not(@codeSystem) or matches(@codeSystem,'^[0-2](\.(0|[1-9]\d*))*$')">(atcdabbr_entry_Zusatzklassifikation): Attribute @codeSystem MUSS vom Datentyp 'oid' sein  - '<value-of select="@codeSystem"/>'</assert>
      <assert role="error"
              see="https://elga.art-decor.org/elgabgd-html-20250116T125424/tmp-1.2.40.0.34.6.0.11.3.168-2021-05-19T150409.html"
              test="@code">(atcdabbr_entry_Zusatzklassifikation): Attribut @code MUSS vorkommen.</assert>
      <assert role="error"
              see="https://elga.art-decor.org/elgabgd-html-20250116T125424/tmp-1.2.40.0.34.6.0.11.3.168-2021-05-19T150409.html"
              test="not(@code) or (string-length(@code) &gt; 0 and not(matches(@code,'\s')))">(atcdabbr_entry_Zusatzklassifikation): Attribute @code MUSS vom Datentyp 'cs' sein  - '<value-of select="@code"/>'</assert>
   </rule>
</pattern>
