<?xml version="1.0" encoding="UTF-8"?>
<!--
Template derived pattern
===========================================
ID: 1.2.40.0.34.11.2.3.4
Name: Arznei Entry
Description: 
-->
<pattern xmlns="http://purl.oclc.org/dsdl/schematron"
         id="template-1.2.40.0.34.11.2.3.4-2013-09-09T000000">
   <title>Arznei Entry</title>
   <!--
Template derived rules for ID: 1.2.40.0.34.11.2.3.4
Context: *[hl7:manufacturedProduct[hl7:templateId[@root = '1.3.6.1.4.1.19376.1.5.3.1.4.7.2'] and hl7:templateId[@root = '2.16.840.1.113883.10.20.1.53']]]
Item: (ArzneiEntry)
-->

   <!--
Template derived rules for ID: 1.2.40.0.34.11.2.3.4
Context: *[hl7:manufacturedProduct[hl7:templateId[@root = '1.3.6.1.4.1.19376.1.5.3.1.4.7.2'] and hl7:templateId[@root = '2.16.840.1.113883.10.20.1.53']]]/hl7:manufacturedProduct[hl7:templateId[@root = '1.3.6.1.4.1.19376.1.5.3.1.4.7.2'] and hl7:templateId[@root = '2.16.840.1.113883.10.20.1.53']]
Item: (ArzneiEntry)
-->

   <rule fpi="RULC-1"
         context="*[hl7:manufacturedProduct[hl7:templateId[@root = '1.3.6.1.4.1.19376.1.5.3.1.4.7.2'] and hl7:templateId[@root = '2.16.840.1.113883.10.20.1.53']]]/hl7:manufacturedProduct[hl7:templateId[@root = '1.3.6.1.4.1.19376.1.5.3.1.4.7.2'] and hl7:templateId[@root = '2.16.840.1.113883.10.20.1.53']]"
         id="d41e2312-false-d4506e0">
      <assert role="error"
              see="http://elga.art-decor.org/elgatgd-html-20240709T111220/tmp-1.2.40.0.34.11.2.3.4-2013-09-09T000000.html"
              test="string(@classCode) = ('MANU')">(ArzneiEntry): Der Wert von classCode MUSS 'MANU' sein. Gefunden: "<value-of select="@classCode"/>"</assert>
      <assert role="error"
              see="http://elga.art-decor.org/elgatgd-html-20240709T111220/tmp-1.2.40.0.34.11.2.3.4-2013-09-09T000000.html"
              test="count(hl7:templateId[@root = '1.3.6.1.4.1.19376.1.5.3.1.4.7.2']) &gt;= 1">(ArzneiEntry): Element hl7:templateId[@root = '1.3.6.1.4.1.19376.1.5.3.1.4.7.2'] ist required [min 1x].</assert>
      <assert role="error"
              see="http://elga.art-decor.org/elgatgd-html-20240709T111220/tmp-1.2.40.0.34.11.2.3.4-2013-09-09T000000.html"
              test="count(hl7:templateId[@root = '1.3.6.1.4.1.19376.1.5.3.1.4.7.2']) &lt;= 1">(ArzneiEntry): Element hl7:templateId[@root = '1.3.6.1.4.1.19376.1.5.3.1.4.7.2'] kommt zu häufig vor [max 1x].</assert>
      <assert role="error"
              see="http://elga.art-decor.org/elgatgd-html-20240709T111220/tmp-1.2.40.0.34.11.2.3.4-2013-09-09T000000.html"
              test="count(hl7:templateId[@root = '2.16.840.1.113883.10.20.1.53']) &gt;= 1">(ArzneiEntry): Element hl7:templateId[@root = '2.16.840.1.113883.10.20.1.53'] ist required [min 1x].</assert>
      <assert role="error"
              see="http://elga.art-decor.org/elgatgd-html-20240709T111220/tmp-1.2.40.0.34.11.2.3.4-2013-09-09T000000.html"
              test="count(hl7:templateId[@root = '2.16.840.1.113883.10.20.1.53']) &lt;= 1">(ArzneiEntry): Element hl7:templateId[@root = '2.16.840.1.113883.10.20.1.53'] kommt zu häufig vor [max 1x].</assert>
      <assert role="error"
              see="http://elga.art-decor.org/elgatgd-html-20240709T111220/tmp-1.2.40.0.34.11.2.3.4-2013-09-09T000000.html"
              test="count(hl7:manufacturedMaterial[hl7:templateId[@root = '1.2.40.0.34.11.2.3.4'] and hl7:templateId[@root = '1.3.6.1.4.1.19376.1.9.1.3.1']]) &gt;= 1">(ArzneiEntry): Element hl7:manufacturedMaterial[hl7:templateId[@root = '1.2.40.0.34.11.2.3.4'] and hl7:templateId[@root = '1.3.6.1.4.1.19376.1.9.1.3.1']] ist mandatory [min 1x].</assert>
      <assert role="error"
              see="http://elga.art-decor.org/elgatgd-html-20240709T111220/tmp-1.2.40.0.34.11.2.3.4-2013-09-09T000000.html"
              test="count(hl7:manufacturedMaterial[hl7:templateId[@root = '1.2.40.0.34.11.2.3.4'] and hl7:templateId[@root = '1.3.6.1.4.1.19376.1.9.1.3.1']]) &lt;= 1">(ArzneiEntry): Element hl7:manufacturedMaterial[hl7:templateId[@root = '1.2.40.0.34.11.2.3.4'] and hl7:templateId[@root = '1.3.6.1.4.1.19376.1.9.1.3.1']] kommt zu häufig vor [max 1x].</assert>
   </rule>
   <!--
Template derived rules for ID: 1.2.40.0.34.11.2.3.4
Context: *[hl7:manufacturedProduct[hl7:templateId[@root = '1.3.6.1.4.1.19376.1.5.3.1.4.7.2'] and hl7:templateId[@root = '2.16.840.1.113883.10.20.1.53']]]/hl7:manufacturedProduct[hl7:templateId[@root = '1.3.6.1.4.1.19376.1.5.3.1.4.7.2'] and hl7:templateId[@root = '2.16.840.1.113883.10.20.1.53']]/hl7:templateId[@root = '1.3.6.1.4.1.19376.1.5.3.1.4.7.2']
Item: (ArzneiEntry)
-->

   <rule fpi="RULC-1"
         context="*[hl7:manufacturedProduct[hl7:templateId[@root = '1.3.6.1.4.1.19376.1.5.3.1.4.7.2'] and hl7:templateId[@root = '2.16.840.1.113883.10.20.1.53']]]/hl7:manufacturedProduct[hl7:templateId[@root = '1.3.6.1.4.1.19376.1.5.3.1.4.7.2'] and hl7:templateId[@root = '2.16.840.1.113883.10.20.1.53']]/hl7:templateId[@root = '1.3.6.1.4.1.19376.1.5.3.1.4.7.2']"
         id="d41e2320-false-d4547e0">
      <extends rule="II"/>
      <assert role="error"
              see="http://elga.art-decor.org/elgatgd-html-20240709T111220/tmp-1.2.40.0.34.11.2.3.4-2013-09-09T000000.html"
              test="empty(@xsi:type) or resolve-QName(@xsi:type, .) = QName('urn:hl7-org:v3', 'II')">(ArzneiEntry): Wenn eine @xsi:type Instruktion anwesend ist MUSS diese den Wert "{urn:hl7-org:v3}:II" haben. Gefunden "{<value-of select="namespace-uri-from-QName(resolve-QName(@xsi:type,.))"/>}:<value-of select="local-name-from-QName(resolve-QName(@xsi:type,.))"/>"</assert>
      <assert role="error"
              see="http://elga.art-decor.org/elgatgd-html-20240709T111220/tmp-1.2.40.0.34.11.2.3.4-2013-09-09T000000.html"
              test="string(@root) = ('1.3.6.1.4.1.19376.1.5.3.1.4.7.2')">(ArzneiEntry): Der Wert von root MUSS '1.3.6.1.4.1.19376.1.5.3.1.4.7.2' sein. Gefunden: "<value-of select="@root"/>"</assert>
   </rule>
   <!--
Template derived rules for ID: 1.2.40.0.34.11.2.3.4
Context: *[hl7:manufacturedProduct[hl7:templateId[@root = '1.3.6.1.4.1.19376.1.5.3.1.4.7.2'] and hl7:templateId[@root = '2.16.840.1.113883.10.20.1.53']]]/hl7:manufacturedProduct[hl7:templateId[@root = '1.3.6.1.4.1.19376.1.5.3.1.4.7.2'] and hl7:templateId[@root = '2.16.840.1.113883.10.20.1.53']]/hl7:templateId[@root = '2.16.840.1.113883.10.20.1.53']
Item: (ArzneiEntry)
-->

   <rule fpi="RULC-1"
         context="*[hl7:manufacturedProduct[hl7:templateId[@root = '1.3.6.1.4.1.19376.1.5.3.1.4.7.2'] and hl7:templateId[@root = '2.16.840.1.113883.10.20.1.53']]]/hl7:manufacturedProduct[hl7:templateId[@root = '1.3.6.1.4.1.19376.1.5.3.1.4.7.2'] and hl7:templateId[@root = '2.16.840.1.113883.10.20.1.53']]/hl7:templateId[@root = '2.16.840.1.113883.10.20.1.53']"
         id="d41e2325-false-d4562e0">
      <extends rule="II"/>
      <assert role="error"
              see="http://elga.art-decor.org/elgatgd-html-20240709T111220/tmp-1.2.40.0.34.11.2.3.4-2013-09-09T000000.html"
              test="empty(@xsi:type) or resolve-QName(@xsi:type, .) = QName('urn:hl7-org:v3', 'II')">(ArzneiEntry): Wenn eine @xsi:type Instruktion anwesend ist MUSS diese den Wert "{urn:hl7-org:v3}:II" haben. Gefunden "{<value-of select="namespace-uri-from-QName(resolve-QName(@xsi:type,.))"/>}:<value-of select="local-name-from-QName(resolve-QName(@xsi:type,.))"/>"</assert>
      <assert role="error"
              see="http://elga.art-decor.org/elgatgd-html-20240709T111220/tmp-1.2.40.0.34.11.2.3.4-2013-09-09T000000.html"
              test="string(@root) = ('2.16.840.1.113883.10.20.1.53')">(ArzneiEntry): Der Wert von root MUSS '2.16.840.1.113883.10.20.1.53' sein. Gefunden: "<value-of select="@root"/>"</assert>
   </rule>
   <!--
Template derived rules for ID: 1.2.40.0.34.11.2.3.4
Context: *[hl7:manufacturedProduct[hl7:templateId[@root = '1.3.6.1.4.1.19376.1.5.3.1.4.7.2'] and hl7:templateId[@root = '2.16.840.1.113883.10.20.1.53']]]/hl7:manufacturedProduct[hl7:templateId[@root = '1.3.6.1.4.1.19376.1.5.3.1.4.7.2'] and hl7:templateId[@root = '2.16.840.1.113883.10.20.1.53']]/hl7:manufacturedMaterial[hl7:templateId[@root = '1.2.40.0.34.11.2.3.4'] and hl7:templateId[@root = '1.3.6.1.4.1.19376.1.9.1.3.1']]
Item: (ArzneiEntry)
-->

   <rule fpi="RULC-1"
         context="*[hl7:manufacturedProduct[hl7:templateId[@root = '1.3.6.1.4.1.19376.1.5.3.1.4.7.2'] and hl7:templateId[@root = '2.16.840.1.113883.10.20.1.53']]]/hl7:manufacturedProduct[hl7:templateId[@root = '1.3.6.1.4.1.19376.1.5.3.1.4.7.2'] and hl7:templateId[@root = '2.16.840.1.113883.10.20.1.53']]/hl7:manufacturedMaterial[hl7:templateId[@root = '1.2.40.0.34.11.2.3.4'] and hl7:templateId[@root = '1.3.6.1.4.1.19376.1.9.1.3.1']]"
         id="d41e2333-false-d4578e0">
      <assert role="error"
              see="http://elga.art-decor.org/elgatgd-html-20240709T111220/tmp-1.2.40.0.34.11.2.3.4-2013-09-09T000000.html"
              test="string(@classCode) = ('MMAT')">(ArzneiEntry): Der Wert von classCode MUSS 'MMAT' sein. Gefunden: "<value-of select="@classCode"/>"</assert>
      <assert role="error"
              see="http://elga.art-decor.org/elgatgd-html-20240709T111220/tmp-1.2.40.0.34.11.2.3.4-2013-09-09T000000.html"
              test="string(@determinerCode) = ('KIND')">(ArzneiEntry): Der Wert von determinerCode MUSS 'KIND' sein. Gefunden: "<value-of select="@determinerCode"/>"</assert>
      <assert role="error"
              see="http://elga.art-decor.org/elgatgd-html-20240709T111220/tmp-1.2.40.0.34.11.2.3.4-2013-09-09T000000.html"
              test="hl7:code/@nullFlavor or (hl7:code/@code and count(pharm:asContent)&gt;0)">(ArzneiEntry): pharm:asContent Komponente zur Aufnahme der Packungsangaben ist mandatory wenn PZN vorhanden </assert>
      <assert role="error"
              see="http://elga.art-decor.org/elgatgd-html-20240709T111220/tmp-1.2.40.0.34.11.2.3.4-2013-09-09T000000.html"
              test="count(hl7:templateId[@root = '1.2.40.0.34.11.2.3.4']) &gt;= 1">(ArzneiEntry): Element hl7:templateId[@root = '1.2.40.0.34.11.2.3.4'] ist required [min 1x].</assert>
      <assert role="error"
              see="http://elga.art-decor.org/elgatgd-html-20240709T111220/tmp-1.2.40.0.34.11.2.3.4-2013-09-09T000000.html"
              test="count(hl7:templateId[@root = '1.2.40.0.34.11.2.3.4']) &lt;= 1">(ArzneiEntry): Element hl7:templateId[@root = '1.2.40.0.34.11.2.3.4'] kommt zu häufig vor [max 1x].</assert>
      <assert role="error"
              see="http://elga.art-decor.org/elgatgd-html-20240709T111220/tmp-1.2.40.0.34.11.2.3.4-2013-09-09T000000.html"
              test="count(hl7:templateId[@root = '1.3.6.1.4.1.19376.1.9.1.3.1']) &gt;= 1">(ArzneiEntry): Element hl7:templateId[@root = '1.3.6.1.4.1.19376.1.9.1.3.1'] ist required [min 1x].</assert>
      <assert role="error"
              see="http://elga.art-decor.org/elgatgd-html-20240709T111220/tmp-1.2.40.0.34.11.2.3.4-2013-09-09T000000.html"
              test="count(hl7:templateId[@root = '1.3.6.1.4.1.19376.1.9.1.3.1']) &lt;= 1">(ArzneiEntry): Element hl7:templateId[@root = '1.3.6.1.4.1.19376.1.9.1.3.1'] kommt zu häufig vor [max 1x].</assert>
      <assert role="error"
              see="http://elga.art-decor.org/elgatgd-html-20240709T111220/tmp-1.2.40.0.34.11.2.3.4-2013-09-09T000000.html"
              test="count(hl7:code[@codeSystem = '1.2.40.0.10.1.4.3.5' or @nullFlavor]) &gt;= 1">(ArzneiEntry): Element hl7:code[@codeSystem = '1.2.40.0.10.1.4.3.5' or @nullFlavor] ist required [min 1x].</assert>
      <assert role="error"
              see="http://elga.art-decor.org/elgatgd-html-20240709T111220/tmp-1.2.40.0.34.11.2.3.4-2013-09-09T000000.html"
              test="count(hl7:code[@codeSystem = '1.2.40.0.10.1.4.3.5' or @nullFlavor]) &lt;= 1">(ArzneiEntry): Element hl7:code[@codeSystem = '1.2.40.0.10.1.4.3.5' or @nullFlavor] kommt zu häufig vor [max 1x].</assert>
      <assert role="error"
              see="http://elga.art-decor.org/elgatgd-html-20240709T111220/tmp-1.2.40.0.34.11.2.3.4-2013-09-09T000000.html"
              test="count(hl7:name[not(@nullFlavor)]) &gt;= 1">(ArzneiEntry): Element hl7:name[not(@nullFlavor)] ist mandatory [min 1x].</assert>
      <assert role="error"
              see="http://elga.art-decor.org/elgatgd-html-20240709T111220/tmp-1.2.40.0.34.11.2.3.4-2013-09-09T000000.html"
              test="count(hl7:name[not(@nullFlavor)]) &lt;= 1">(ArzneiEntry): Element hl7:name[not(@nullFlavor)] kommt zu häufig vor [max 1x].</assert>
      <assert role="error"
              see="http://elga.art-decor.org/elgatgd-html-20240709T111220/tmp-1.2.40.0.34.11.2.3.4-2013-09-09T000000.html"
              test="count(pharm:asContent[pharm:containerPackagedMedicine[pharm:code[@codeSystem = '1.2.40.0.10.1.4.3.5']]]) &lt;= 1">(ArzneiEntry): Element pharm:asContent[pharm:containerPackagedMedicine[pharm:code[@codeSystem = '1.2.40.0.10.1.4.3.5']]] kommt zu häufig vor [max 1x].</assert>
   </rule>
   <!--
Template derived rules for ID: 1.2.40.0.34.11.2.3.4
Context: *[hl7:manufacturedProduct[hl7:templateId[@root = '1.3.6.1.4.1.19376.1.5.3.1.4.7.2'] and hl7:templateId[@root = '2.16.840.1.113883.10.20.1.53']]]/hl7:manufacturedProduct[hl7:templateId[@root = '1.3.6.1.4.1.19376.1.5.3.1.4.7.2'] and hl7:templateId[@root = '2.16.840.1.113883.10.20.1.53']]/hl7:manufacturedMaterial[hl7:templateId[@root = '1.2.40.0.34.11.2.3.4'] and hl7:templateId[@root = '1.3.6.1.4.1.19376.1.9.1.3.1']]/hl7:templateId[@root = '1.2.40.0.34.11.2.3.4']
Item: (ArzneiEntry)
-->

   <rule fpi="RULC-1"
         context="*[hl7:manufacturedProduct[hl7:templateId[@root = '1.3.6.1.4.1.19376.1.5.3.1.4.7.2'] and hl7:templateId[@root = '2.16.840.1.113883.10.20.1.53']]]/hl7:manufacturedProduct[hl7:templateId[@root = '1.3.6.1.4.1.19376.1.5.3.1.4.7.2'] and hl7:templateId[@root = '2.16.840.1.113883.10.20.1.53']]/hl7:manufacturedMaterial[hl7:templateId[@root = '1.2.40.0.34.11.2.3.4'] and hl7:templateId[@root = '1.3.6.1.4.1.19376.1.9.1.3.1']]/hl7:templateId[@root = '1.2.40.0.34.11.2.3.4']"
         id="d41e2341-false-d4641e0">
      <extends rule="II"/>
      <assert role="error"
              see="http://elga.art-decor.org/elgatgd-html-20240709T111220/tmp-1.2.40.0.34.11.2.3.4-2013-09-09T000000.html"
              test="empty(@xsi:type) or resolve-QName(@xsi:type, .) = QName('urn:hl7-org:v3', 'II')">(ArzneiEntry): Wenn eine @xsi:type Instruktion anwesend ist MUSS diese den Wert "{urn:hl7-org:v3}:II" haben. Gefunden "{<value-of select="namespace-uri-from-QName(resolve-QName(@xsi:type,.))"/>}:<value-of select="local-name-from-QName(resolve-QName(@xsi:type,.))"/>"</assert>
      <assert role="error"
              see="http://elga.art-decor.org/elgatgd-html-20240709T111220/tmp-1.2.40.0.34.11.2.3.4-2013-09-09T000000.html"
              test="string(@root) = ('1.2.40.0.34.11.2.3.4')">(ArzneiEntry): Der Wert von root MUSS '1.2.40.0.34.11.2.3.4' sein. Gefunden: "<value-of select="@root"/>"</assert>
   </rule>
   <!--
Template derived rules for ID: 1.2.40.0.34.11.2.3.4
Context: *[hl7:manufacturedProduct[hl7:templateId[@root = '1.3.6.1.4.1.19376.1.5.3.1.4.7.2'] and hl7:templateId[@root = '2.16.840.1.113883.10.20.1.53']]]/hl7:manufacturedProduct[hl7:templateId[@root = '1.3.6.1.4.1.19376.1.5.3.1.4.7.2'] and hl7:templateId[@root = '2.16.840.1.113883.10.20.1.53']]/hl7:manufacturedMaterial[hl7:templateId[@root = '1.2.40.0.34.11.2.3.4'] and hl7:templateId[@root = '1.3.6.1.4.1.19376.1.9.1.3.1']]/hl7:templateId[@root = '1.3.6.1.4.1.19376.1.9.1.3.1']
Item: (ArzneiEntry)
-->

   <rule fpi="RULC-1"
         context="*[hl7:manufacturedProduct[hl7:templateId[@root = '1.3.6.1.4.1.19376.1.5.3.1.4.7.2'] and hl7:templateId[@root = '2.16.840.1.113883.10.20.1.53']]]/hl7:manufacturedProduct[hl7:templateId[@root = '1.3.6.1.4.1.19376.1.5.3.1.4.7.2'] and hl7:templateId[@root = '2.16.840.1.113883.10.20.1.53']]/hl7:manufacturedMaterial[hl7:templateId[@root = '1.2.40.0.34.11.2.3.4'] and hl7:templateId[@root = '1.3.6.1.4.1.19376.1.9.1.3.1']]/hl7:templateId[@root = '1.3.6.1.4.1.19376.1.9.1.3.1']"
         id="d41e2346-false-d4656e0">
      <extends rule="II"/>
      <assert role="error"
              see="http://elga.art-decor.org/elgatgd-html-20240709T111220/tmp-1.2.40.0.34.11.2.3.4-2013-09-09T000000.html"
              test="empty(@xsi:type) or resolve-QName(@xsi:type, .) = QName('urn:hl7-org:v3', 'II')">(ArzneiEntry): Wenn eine @xsi:type Instruktion anwesend ist MUSS diese den Wert "{urn:hl7-org:v3}:II" haben. Gefunden "{<value-of select="namespace-uri-from-QName(resolve-QName(@xsi:type,.))"/>}:<value-of select="local-name-from-QName(resolve-QName(@xsi:type,.))"/>"</assert>
      <assert role="error"
              see="http://elga.art-decor.org/elgatgd-html-20240709T111220/tmp-1.2.40.0.34.11.2.3.4-2013-09-09T000000.html"
              test="string(@root) = ('1.3.6.1.4.1.19376.1.9.1.3.1')">(ArzneiEntry): Der Wert von root MUSS '1.3.6.1.4.1.19376.1.9.1.3.1' sein. Gefunden: "<value-of select="@root"/>"</assert>
   </rule>
   <!--
Template derived rules for ID: 1.2.40.0.34.11.2.3.4
Context: *[hl7:manufacturedProduct[hl7:templateId[@root = '1.3.6.1.4.1.19376.1.5.3.1.4.7.2'] and hl7:templateId[@root = '2.16.840.1.113883.10.20.1.53']]]/hl7:manufacturedProduct[hl7:templateId[@root = '1.3.6.1.4.1.19376.1.5.3.1.4.7.2'] and hl7:templateId[@root = '2.16.840.1.113883.10.20.1.53']]/hl7:manufacturedMaterial[hl7:templateId[@root = '1.2.40.0.34.11.2.3.4'] and hl7:templateId[@root = '1.3.6.1.4.1.19376.1.9.1.3.1']]/hl7:code[@codeSystem = '1.2.40.0.10.1.4.3.5' or @nullFlavor]
Item: (ArzneiEntry)
-->

   <rule fpi="RULC-1"
         context="*[hl7:manufacturedProduct[hl7:templateId[@root = '1.3.6.1.4.1.19376.1.5.3.1.4.7.2'] and hl7:templateId[@root = '2.16.840.1.113883.10.20.1.53']]]/hl7:manufacturedProduct[hl7:templateId[@root = '1.3.6.1.4.1.19376.1.5.3.1.4.7.2'] and hl7:templateId[@root = '2.16.840.1.113883.10.20.1.53']]/hl7:manufacturedMaterial[hl7:templateId[@root = '1.2.40.0.34.11.2.3.4'] and hl7:templateId[@root = '1.3.6.1.4.1.19376.1.9.1.3.1']]/hl7:code[@codeSystem = '1.2.40.0.10.1.4.3.5' or @nullFlavor]"
         id="d41e2354-false-d4671e0">
      <assert role="error"
              see="http://elga.art-decor.org/elgatgd-html-20240709T111220/tmp-1.2.40.0.34.11.2.3.4-2013-09-09T000000.html"
              test="@nullFlavor or (@codeSystem='1.2.40.0.10.1.4.3.5')">(ArzneiEntry): Der Elementinhalt MUSS einer von 'codeSystem '1.2.40.0.10.1.4.3.5'' sein.</assert>
      <assert role="error"
              see="http://elga.art-decor.org/elgatgd-html-20240709T111220/tmp-1.2.40.0.34.11.2.3.4-2013-09-09T000000.html"
              test="count(hl7:originalText) &gt;= 1">(ArzneiEntry): Element hl7:originalText ist required [min 1x].</assert>
      <assert role="error"
              see="http://elga.art-decor.org/elgatgd-html-20240709T111220/tmp-1.2.40.0.34.11.2.3.4-2013-09-09T000000.html"
              test="count(hl7:originalText) &lt;= 1">(ArzneiEntry): Element hl7:originalText kommt zu häufig vor [max 1x].</assert>
   </rule>
   <!--
Template derived rules for ID: 1.2.40.0.34.11.2.3.4
Context: *[hl7:manufacturedProduct[hl7:templateId[@root = '1.3.6.1.4.1.19376.1.5.3.1.4.7.2'] and hl7:templateId[@root = '2.16.840.1.113883.10.20.1.53']]]/hl7:manufacturedProduct[hl7:templateId[@root = '1.3.6.1.4.1.19376.1.5.3.1.4.7.2'] and hl7:templateId[@root = '2.16.840.1.113883.10.20.1.53']]/hl7:manufacturedMaterial[hl7:templateId[@root = '1.2.40.0.34.11.2.3.4'] and hl7:templateId[@root = '1.3.6.1.4.1.19376.1.9.1.3.1']]/hl7:code[@codeSystem = '1.2.40.0.10.1.4.3.5' or @nullFlavor]/hl7:originalText
Item: (ArzneiEntry)
-->

   <rule fpi="RULC-1"
         context="*[hl7:manufacturedProduct[hl7:templateId[@root = '1.3.6.1.4.1.19376.1.5.3.1.4.7.2'] and hl7:templateId[@root = '2.16.840.1.113883.10.20.1.53']]]/hl7:manufacturedProduct[hl7:templateId[@root = '1.3.6.1.4.1.19376.1.5.3.1.4.7.2'] and hl7:templateId[@root = '2.16.840.1.113883.10.20.1.53']]/hl7:manufacturedMaterial[hl7:templateId[@root = '1.2.40.0.34.11.2.3.4'] and hl7:templateId[@root = '1.3.6.1.4.1.19376.1.9.1.3.1']]/hl7:code[@codeSystem = '1.2.40.0.10.1.4.3.5' or @nullFlavor]/hl7:originalText"
         id="d41e2368-false-d4695e0">
      <extends rule="ED"/>
      <assert role="error"
              see="http://elga.art-decor.org/elgatgd-html-20240709T111220/tmp-1.2.40.0.34.11.2.3.4-2013-09-09T000000.html"
              test="empty(@xsi:type) or resolve-QName(@xsi:type, .) = QName('urn:hl7-org:v3', 'ED')">(ArzneiEntry): Wenn eine @xsi:type Instruktion anwesend ist MUSS diese den Wert "{urn:hl7-org:v3}:ED" haben. Gefunden "{<value-of select="namespace-uri-from-QName(resolve-QName(@xsi:type,.))"/>}:<value-of select="local-name-from-QName(resolve-QName(@xsi:type,.))"/>"</assert>
   </rule>
   <!--
Template derived rules for ID: 1.2.40.0.34.11.2.3.4
Context: *[hl7:manufacturedProduct[hl7:templateId[@root = '1.3.6.1.4.1.19376.1.5.3.1.4.7.2'] and hl7:templateId[@root = '2.16.840.1.113883.10.20.1.53']]]/hl7:manufacturedProduct[hl7:templateId[@root = '1.3.6.1.4.1.19376.1.5.3.1.4.7.2'] and hl7:templateId[@root = '2.16.840.1.113883.10.20.1.53']]/hl7:manufacturedMaterial[hl7:templateId[@root = '1.2.40.0.34.11.2.3.4'] and hl7:templateId[@root = '1.3.6.1.4.1.19376.1.9.1.3.1']]/hl7:code[@codeSystem = '1.2.40.0.10.1.4.3.5' or @nullFlavor]/hl7:translation
Item: (ArzneiEntry)
-->

   <rule fpi="RULC-1"
         context="*[hl7:manufacturedProduct[hl7:templateId[@root = '1.3.6.1.4.1.19376.1.5.3.1.4.7.2'] and hl7:templateId[@root = '2.16.840.1.113883.10.20.1.53']]]/hl7:manufacturedProduct[hl7:templateId[@root = '1.3.6.1.4.1.19376.1.5.3.1.4.7.2'] and hl7:templateId[@root = '2.16.840.1.113883.10.20.1.53']]/hl7:manufacturedMaterial[hl7:templateId[@root = '1.2.40.0.34.11.2.3.4'] and hl7:templateId[@root = '1.3.6.1.4.1.19376.1.9.1.3.1']]/hl7:code[@codeSystem = '1.2.40.0.10.1.4.3.5' or @nullFlavor]/hl7:translation"
         id="d41e2370-false-d4705e0">
      <extends rule="CE"/>
      <assert role="error"
              see="http://elga.art-decor.org/elgatgd-html-20240709T111220/tmp-1.2.40.0.34.11.2.3.4-2013-09-09T000000.html"
              test="empty(@xsi:type) or resolve-QName(@xsi:type, .) = QName('urn:hl7-org:v3', 'CE')">(ArzneiEntry): Wenn eine @xsi:type Instruktion anwesend ist MUSS diese den Wert "{urn:hl7-org:v3}:CE" haben. Gefunden "{<value-of select="namespace-uri-from-QName(resolve-QName(@xsi:type,.))"/>}:<value-of select="local-name-from-QName(resolve-QName(@xsi:type,.))"/>"</assert>
   </rule>
   <!--
Template derived rules for ID: 1.2.40.0.34.11.2.3.4
Context: *[hl7:manufacturedProduct[hl7:templateId[@root = '1.3.6.1.4.1.19376.1.5.3.1.4.7.2'] and hl7:templateId[@root = '2.16.840.1.113883.10.20.1.53']]]/hl7:manufacturedProduct[hl7:templateId[@root = '1.3.6.1.4.1.19376.1.5.3.1.4.7.2'] and hl7:templateId[@root = '2.16.840.1.113883.10.20.1.53']]/hl7:manufacturedMaterial[hl7:templateId[@root = '1.2.40.0.34.11.2.3.4'] and hl7:templateId[@root = '1.3.6.1.4.1.19376.1.9.1.3.1']]/hl7:name[not(@nullFlavor)]
Item: (ArzneiEntry)
-->

   <rule fpi="RULC-1"
         context="*[hl7:manufacturedProduct[hl7:templateId[@root = '1.3.6.1.4.1.19376.1.5.3.1.4.7.2'] and hl7:templateId[@root = '2.16.840.1.113883.10.20.1.53']]]/hl7:manufacturedProduct[hl7:templateId[@root = '1.3.6.1.4.1.19376.1.5.3.1.4.7.2'] and hl7:templateId[@root = '2.16.840.1.113883.10.20.1.53']]/hl7:manufacturedMaterial[hl7:templateId[@root = '1.2.40.0.34.11.2.3.4'] and hl7:templateId[@root = '1.3.6.1.4.1.19376.1.9.1.3.1']]/hl7:name[not(@nullFlavor)]"
         id="d41e2375-false-d4715e0">
      <extends rule="EN"/>
      <assert role="error"
              see="http://elga.art-decor.org/elgatgd-html-20240709T111220/tmp-1.2.40.0.34.11.2.3.4-2013-09-09T000000.html"
              test="empty(@xsi:type) or resolve-QName(@xsi:type, .) = QName('urn:hl7-org:v3', 'EN')">(ArzneiEntry): Wenn eine @xsi:type Instruktion anwesend ist MUSS diese den Wert "{urn:hl7-org:v3}:EN" haben. Gefunden "{<value-of select="namespace-uri-from-QName(resolve-QName(@xsi:type,.))"/>}:<value-of select="local-name-from-QName(resolve-QName(@xsi:type,.))"/>"</assert>
   </rule>
   <!--
Template derived rules for ID: 1.2.40.0.34.11.2.3.4
Context: *[hl7:manufacturedProduct[hl7:templateId[@root = '1.3.6.1.4.1.19376.1.5.3.1.4.7.2'] and hl7:templateId[@root = '2.16.840.1.113883.10.20.1.53']]]/hl7:manufacturedProduct[hl7:templateId[@root = '1.3.6.1.4.1.19376.1.5.3.1.4.7.2'] and hl7:templateId[@root = '2.16.840.1.113883.10.20.1.53']]/hl7:manufacturedMaterial[hl7:templateId[@root = '1.2.40.0.34.11.2.3.4'] and hl7:templateId[@root = '1.3.6.1.4.1.19376.1.9.1.3.1']]/pharm:asContent[pharm:containerPackagedMedicine[pharm:code[@codeSystem = '1.2.40.0.10.1.4.3.5']]]
Item: (ArzneiEntry)
-->

   <rule fpi="RULC-1"
         context="*[hl7:manufacturedProduct[hl7:templateId[@root = '1.3.6.1.4.1.19376.1.5.3.1.4.7.2'] and hl7:templateId[@root = '2.16.840.1.113883.10.20.1.53']]]/hl7:manufacturedProduct[hl7:templateId[@root = '1.3.6.1.4.1.19376.1.5.3.1.4.7.2'] and hl7:templateId[@root = '2.16.840.1.113883.10.20.1.53']]/hl7:manufacturedMaterial[hl7:templateId[@root = '1.2.40.0.34.11.2.3.4'] and hl7:templateId[@root = '1.3.6.1.4.1.19376.1.9.1.3.1']]/pharm:asContent[pharm:containerPackagedMedicine[pharm:code[@codeSystem = '1.2.40.0.10.1.4.3.5']]]"
         id="d41e2385-false-d4726e0">
      <assert role="error"
              see="http://elga.art-decor.org/elgatgd-html-20240709T111220/tmp-1.2.40.0.34.11.2.3.4-2013-09-09T000000.html"
              test="string(@classCode) = ('CONT')">(ArzneiEntry): Der Wert von classCode MUSS 'CONT' sein. Gefunden: "<value-of select="@classCode"/>"</assert>
      <assert role="error"
              see="http://elga.art-decor.org/elgatgd-html-20240709T111220/tmp-1.2.40.0.34.11.2.3.4-2013-09-09T000000.html"
              test="count(pharm:containerPackagedMedicine[pharm:code[@codeSystem = '1.2.40.0.10.1.4.3.5']]) &gt;= 1">(ArzneiEntry): Element pharm:containerPackagedMedicine[pharm:code[@codeSystem = '1.2.40.0.10.1.4.3.5']] ist mandatory [min 1x].</assert>
      <assert role="error"
              see="http://elga.art-decor.org/elgatgd-html-20240709T111220/tmp-1.2.40.0.34.11.2.3.4-2013-09-09T000000.html"
              test="count(pharm:containerPackagedMedicine[pharm:code[@codeSystem = '1.2.40.0.10.1.4.3.5']]) &lt;= 1">(ArzneiEntry): Element pharm:containerPackagedMedicine[pharm:code[@codeSystem = '1.2.40.0.10.1.4.3.5']] kommt zu häufig vor [max 1x].</assert>
   </rule>
   <!--
Template derived rules for ID: 1.2.40.0.34.11.2.3.4
Context: *[hl7:manufacturedProduct[hl7:templateId[@root = '1.3.6.1.4.1.19376.1.5.3.1.4.7.2'] and hl7:templateId[@root = '2.16.840.1.113883.10.20.1.53']]]/hl7:manufacturedProduct[hl7:templateId[@root = '1.3.6.1.4.1.19376.1.5.3.1.4.7.2'] and hl7:templateId[@root = '2.16.840.1.113883.10.20.1.53']]/hl7:manufacturedMaterial[hl7:templateId[@root = '1.2.40.0.34.11.2.3.4'] and hl7:templateId[@root = '1.3.6.1.4.1.19376.1.9.1.3.1']]/pharm:asContent[pharm:containerPackagedMedicine[pharm:code[@codeSystem = '1.2.40.0.10.1.4.3.5']]]/pharm:containerPackagedMedicine[pharm:code[@codeSystem = '1.2.40.0.10.1.4.3.5']]
Item: (ArzneiEntry)
-->

   <rule fpi="RULC-1"
         context="*[hl7:manufacturedProduct[hl7:templateId[@root = '1.3.6.1.4.1.19376.1.5.3.1.4.7.2'] and hl7:templateId[@root = '2.16.840.1.113883.10.20.1.53']]]/hl7:manufacturedProduct[hl7:templateId[@root = '1.3.6.1.4.1.19376.1.5.3.1.4.7.2'] and hl7:templateId[@root = '2.16.840.1.113883.10.20.1.53']]/hl7:manufacturedMaterial[hl7:templateId[@root = '1.2.40.0.34.11.2.3.4'] and hl7:templateId[@root = '1.3.6.1.4.1.19376.1.9.1.3.1']]/pharm:asContent[pharm:containerPackagedMedicine[pharm:code[@codeSystem = '1.2.40.0.10.1.4.3.5']]]/pharm:containerPackagedMedicine[pharm:code[@codeSystem = '1.2.40.0.10.1.4.3.5']]"
         id="d41e2389-false-d4748e0">
      <assert role="error"
              see="http://elga.art-decor.org/elgatgd-html-20240709T111220/tmp-1.2.40.0.34.11.2.3.4-2013-09-09T000000.html"
              test="string(@classCode) = ('CONT')">(ArzneiEntry): Der Wert von classCode MUSS 'CONT' sein. Gefunden: "<value-of select="@classCode"/>"</assert>
      <assert role="error"
              see="http://elga.art-decor.org/elgatgd-html-20240709T111220/tmp-1.2.40.0.34.11.2.3.4-2013-09-09T000000.html"
              test="string(@determinerCode) = ('INSTANCE')">(ArzneiEntry): Der Wert von determinerCode MUSS 'INSTANCE' sein. Gefunden: "<value-of select="@determinerCode"/>"</assert>
      <assert role="error"
              see="http://elga.art-decor.org/elgatgd-html-20240709T111220/tmp-1.2.40.0.34.11.2.3.4-2013-09-09T000000.html"
              test="count(pharm:code[@codeSystem = '1.2.40.0.10.1.4.3.5']) &gt;= 1">(ArzneiEntry): Element pharm:code[@codeSystem = '1.2.40.0.10.1.4.3.5'] ist mandatory [min 1x].</assert>
      <assert role="error"
              see="http://elga.art-decor.org/elgatgd-html-20240709T111220/tmp-1.2.40.0.34.11.2.3.4-2013-09-09T000000.html"
              test="count(pharm:code[@codeSystem = '1.2.40.0.10.1.4.3.5']) &lt;= 1">(ArzneiEntry): Element pharm:code[@codeSystem = '1.2.40.0.10.1.4.3.5'] kommt zu häufig vor [max 1x].</assert>
      <assert role="error"
              see="http://elga.art-decor.org/elgatgd-html-20240709T111220/tmp-1.2.40.0.34.11.2.3.4-2013-09-09T000000.html"
              test="count(pharm:name[not(@nullFlavor)]) &gt;= 1">(ArzneiEntry): Element pharm:name[not(@nullFlavor)] ist mandatory [min 1x].</assert>
      <assert role="error"
              see="http://elga.art-decor.org/elgatgd-html-20240709T111220/tmp-1.2.40.0.34.11.2.3.4-2013-09-09T000000.html"
              test="count(pharm:name[not(@nullFlavor)]) &lt;= 1">(ArzneiEntry): Element pharm:name[not(@nullFlavor)] kommt zu häufig vor [max 1x].</assert>
      <assert role="error"
              see="http://elga.art-decor.org/elgatgd-html-20240709T111220/tmp-1.2.40.0.34.11.2.3.4-2013-09-09T000000.html"
              test="count(pharm:capacityQuantity[not(@nullFlavor)]) &gt;= 1">(ArzneiEntry): Element pharm:capacityQuantity[not(@nullFlavor)] ist mandatory [min 1x].</assert>
      <assert role="error"
              see="http://elga.art-decor.org/elgatgd-html-20240709T111220/tmp-1.2.40.0.34.11.2.3.4-2013-09-09T000000.html"
              test="count(pharm:capacityQuantity[not(@nullFlavor)]) &lt;= 1">(ArzneiEntry): Element pharm:capacityQuantity[not(@nullFlavor)] kommt zu häufig vor [max 1x].</assert>
   </rule>
   <!--
Template derived rules for ID: 1.2.40.0.34.11.2.3.4
Context: *[hl7:manufacturedProduct[hl7:templateId[@root = '1.3.6.1.4.1.19376.1.5.3.1.4.7.2'] and hl7:templateId[@root = '2.16.840.1.113883.10.20.1.53']]]/hl7:manufacturedProduct[hl7:templateId[@root = '1.3.6.1.4.1.19376.1.5.3.1.4.7.2'] and hl7:templateId[@root = '2.16.840.1.113883.10.20.1.53']]/hl7:manufacturedMaterial[hl7:templateId[@root = '1.2.40.0.34.11.2.3.4'] and hl7:templateId[@root = '1.3.6.1.4.1.19376.1.9.1.3.1']]/pharm:asContent[pharm:containerPackagedMedicine[pharm:code[@codeSystem = '1.2.40.0.10.1.4.3.5']]]/pharm:containerPackagedMedicine[pharm:code[@codeSystem = '1.2.40.0.10.1.4.3.5']]/pharm:code[@codeSystem = '1.2.40.0.10.1.4.3.5']
Item: (ArzneiEntry)
-->

   <rule fpi="RULC-1"
         context="*[hl7:manufacturedProduct[hl7:templateId[@root = '1.3.6.1.4.1.19376.1.5.3.1.4.7.2'] and hl7:templateId[@root = '2.16.840.1.113883.10.20.1.53']]]/hl7:manufacturedProduct[hl7:templateId[@root = '1.3.6.1.4.1.19376.1.5.3.1.4.7.2'] and hl7:templateId[@root = '2.16.840.1.113883.10.20.1.53']]/hl7:manufacturedMaterial[hl7:templateId[@root = '1.2.40.0.34.11.2.3.4'] and hl7:templateId[@root = '1.3.6.1.4.1.19376.1.9.1.3.1']]/pharm:asContent[pharm:containerPackagedMedicine[pharm:code[@codeSystem = '1.2.40.0.10.1.4.3.5']]]/pharm:containerPackagedMedicine[pharm:code[@codeSystem = '1.2.40.0.10.1.4.3.5']]/pharm:code[@codeSystem = '1.2.40.0.10.1.4.3.5']"
         id="d41e2395-false-d4790e0">
      <assert role="error"
              see="http://elga.art-decor.org/elgatgd-html-20240709T111220/tmp-1.2.40.0.34.11.2.3.4-2013-09-09T000000.html"
              test="@nullFlavor or (@codeSystem='1.2.40.0.10.1.4.3.5')">(ArzneiEntry): Der Elementinhalt MUSS einer von 'codeSystem '1.2.40.0.10.1.4.3.5'' sein.</assert>
      <assert role="error"
              see="http://elga.art-decor.org/elgatgd-html-20240709T111220/tmp-1.2.40.0.34.11.2.3.4-2013-09-09T000000.html"
              test="count(hl7:originalText) &lt;= 1">(ArzneiEntry): Element hl7:originalText kommt zu häufig vor [max 1x].</assert>
   </rule>
   <!--
Template derived rules for ID: 1.2.40.0.34.11.2.3.4
Context: *[hl7:manufacturedProduct[hl7:templateId[@root = '1.3.6.1.4.1.19376.1.5.3.1.4.7.2'] and hl7:templateId[@root = '2.16.840.1.113883.10.20.1.53']]]/hl7:manufacturedProduct[hl7:templateId[@root = '1.3.6.1.4.1.19376.1.5.3.1.4.7.2'] and hl7:templateId[@root = '2.16.840.1.113883.10.20.1.53']]/hl7:manufacturedMaterial[hl7:templateId[@root = '1.2.40.0.34.11.2.3.4'] and hl7:templateId[@root = '1.3.6.1.4.1.19376.1.9.1.3.1']]/pharm:asContent[pharm:containerPackagedMedicine[pharm:code[@codeSystem = '1.2.40.0.10.1.4.3.5']]]/pharm:containerPackagedMedicine[pharm:code[@codeSystem = '1.2.40.0.10.1.4.3.5']]/pharm:code[@codeSystem = '1.2.40.0.10.1.4.3.5']/hl7:originalText
Item: (ArzneiEntry)
-->

   <rule fpi="RULC-1"
         context="*[hl7:manufacturedProduct[hl7:templateId[@root = '1.3.6.1.4.1.19376.1.5.3.1.4.7.2'] and hl7:templateId[@root = '2.16.840.1.113883.10.20.1.53']]]/hl7:manufacturedProduct[hl7:templateId[@root = '1.3.6.1.4.1.19376.1.5.3.1.4.7.2'] and hl7:templateId[@root = '2.16.840.1.113883.10.20.1.53']]/hl7:manufacturedMaterial[hl7:templateId[@root = '1.2.40.0.34.11.2.3.4'] and hl7:templateId[@root = '1.3.6.1.4.1.19376.1.9.1.3.1']]/pharm:asContent[pharm:containerPackagedMedicine[pharm:code[@codeSystem = '1.2.40.0.10.1.4.3.5']]]/pharm:containerPackagedMedicine[pharm:code[@codeSystem = '1.2.40.0.10.1.4.3.5']]/pharm:code[@codeSystem = '1.2.40.0.10.1.4.3.5']/hl7:originalText"
         id="d41e2402-false-d4809e0">
      <extends rule="ED"/>
      <assert role="error"
              see="http://elga.art-decor.org/elgatgd-html-20240709T111220/tmp-1.2.40.0.34.11.2.3.4-2013-09-09T000000.html"
              test="empty(@xsi:type) or resolve-QName(@xsi:type, .) = QName('urn:hl7-org:v3', 'ED')">(ArzneiEntry): Wenn eine @xsi:type Instruktion anwesend ist MUSS diese den Wert "{urn:hl7-org:v3}:ED" haben. Gefunden "{<value-of select="namespace-uri-from-QName(resolve-QName(@xsi:type,.))"/>}:<value-of select="local-name-from-QName(resolve-QName(@xsi:type,.))"/>"</assert>
   </rule>
   <!--
Template derived rules for ID: 1.2.40.0.34.11.2.3.4
Context: *[hl7:manufacturedProduct[hl7:templateId[@root = '1.3.6.1.4.1.19376.1.5.3.1.4.7.2'] and hl7:templateId[@root = '2.16.840.1.113883.10.20.1.53']]]/hl7:manufacturedProduct[hl7:templateId[@root = '1.3.6.1.4.1.19376.1.5.3.1.4.7.2'] and hl7:templateId[@root = '2.16.840.1.113883.10.20.1.53']]/hl7:manufacturedMaterial[hl7:templateId[@root = '1.2.40.0.34.11.2.3.4'] and hl7:templateId[@root = '1.3.6.1.4.1.19376.1.9.1.3.1']]/pharm:asContent[pharm:containerPackagedMedicine[pharm:code[@codeSystem = '1.2.40.0.10.1.4.3.5']]]/pharm:containerPackagedMedicine[pharm:code[@codeSystem = '1.2.40.0.10.1.4.3.5']]/pharm:name[not(@nullFlavor)]
Item: (ArzneiEntry)
-->

   <rule fpi="RULC-1"
         context="*[hl7:manufacturedProduct[hl7:templateId[@root = '1.3.6.1.4.1.19376.1.5.3.1.4.7.2'] and hl7:templateId[@root = '2.16.840.1.113883.10.20.1.53']]]/hl7:manufacturedProduct[hl7:templateId[@root = '1.3.6.1.4.1.19376.1.5.3.1.4.7.2'] and hl7:templateId[@root = '2.16.840.1.113883.10.20.1.53']]/hl7:manufacturedMaterial[hl7:templateId[@root = '1.2.40.0.34.11.2.3.4'] and hl7:templateId[@root = '1.3.6.1.4.1.19376.1.9.1.3.1']]/pharm:asContent[pharm:containerPackagedMedicine[pharm:code[@codeSystem = '1.2.40.0.10.1.4.3.5']]]/pharm:containerPackagedMedicine[pharm:code[@codeSystem = '1.2.40.0.10.1.4.3.5']]/pharm:name[not(@nullFlavor)]"
         id="d41e2407-false-d4819e0">
      <extends rule="EN"/>
      <assert role="error"
              see="http://elga.art-decor.org/elgatgd-html-20240709T111220/tmp-1.2.40.0.34.11.2.3.4-2013-09-09T000000.html"
              test="empty(@xsi:type) or resolve-QName(@xsi:type, .) = QName('urn:hl7-org:v3', 'EN')">(ArzneiEntry): Wenn eine @xsi:type Instruktion anwesend ist MUSS diese den Wert "{urn:hl7-org:v3}:EN" haben. Gefunden "{<value-of select="namespace-uri-from-QName(resolve-QName(@xsi:type,.))"/>}:<value-of select="local-name-from-QName(resolve-QName(@xsi:type,.))"/>"</assert>
   </rule>
   <!--
Template derived rules for ID: 1.2.40.0.34.11.2.3.4
Context: *[hl7:manufacturedProduct[hl7:templateId[@root = '1.3.6.1.4.1.19376.1.5.3.1.4.7.2'] and hl7:templateId[@root = '2.16.840.1.113883.10.20.1.53']]]/hl7:manufacturedProduct[hl7:templateId[@root = '1.3.6.1.4.1.19376.1.5.3.1.4.7.2'] and hl7:templateId[@root = '2.16.840.1.113883.10.20.1.53']]/hl7:manufacturedMaterial[hl7:templateId[@root = '1.2.40.0.34.11.2.3.4'] and hl7:templateId[@root = '1.3.6.1.4.1.19376.1.9.1.3.1']]/pharm:asContent[pharm:containerPackagedMedicine[pharm:code[@codeSystem = '1.2.40.0.10.1.4.3.5']]]/pharm:containerPackagedMedicine[pharm:code[@codeSystem = '1.2.40.0.10.1.4.3.5']]/pharm:capacityQuantity[not(@nullFlavor)]
Item: (ArzneiEntry)
-->

   <rule fpi="RULC-1"
         context="*[hl7:manufacturedProduct[hl7:templateId[@root = '1.3.6.1.4.1.19376.1.5.3.1.4.7.2'] and hl7:templateId[@root = '2.16.840.1.113883.10.20.1.53']]]/hl7:manufacturedProduct[hl7:templateId[@root = '1.3.6.1.4.1.19376.1.5.3.1.4.7.2'] and hl7:templateId[@root = '2.16.840.1.113883.10.20.1.53']]/hl7:manufacturedMaterial[hl7:templateId[@root = '1.2.40.0.34.11.2.3.4'] and hl7:templateId[@root = '1.3.6.1.4.1.19376.1.9.1.3.1']]/pharm:asContent[pharm:containerPackagedMedicine[pharm:code[@codeSystem = '1.2.40.0.10.1.4.3.5']]]/pharm:containerPackagedMedicine[pharm:code[@codeSystem = '1.2.40.0.10.1.4.3.5']]/pharm:capacityQuantity[not(@nullFlavor)]"
         id="d41e2412-false-d4829e0">
      <extends rule="PQ"/>
      <assert role="error"
              see="http://elga.art-decor.org/elgatgd-html-20240709T111220/tmp-1.2.40.0.34.11.2.3.4-2013-09-09T000000.html"
              test="empty(@xsi:type) or resolve-QName(@xsi:type, .) = QName('urn:hl7-org:v3', 'PQ')">(ArzneiEntry): Wenn eine @xsi:type Instruktion anwesend ist MUSS diese den Wert "{urn:hl7-org:v3}:PQ" haben. Gefunden "{<value-of select="namespace-uri-from-QName(resolve-QName(@xsi:type,.))"/>}:<value-of select="local-name-from-QName(resolve-QName(@xsi:type,.))"/>"</assert>
      <assert role="error"
              see="http://elga.art-decor.org/elgatgd-html-20240709T111220/tmp-1.2.40.0.34.11.2.3.4-2013-09-09T000000.html"
              test="not(@value) or matches(@value, '^[-+]?\d*\.?[0-9]+([eE][-+]?\d+)?$')">(ArzneiEntry): @value ist keine gültige PQ Zahl <value-of select="@value"/>
      </assert>
      <let name="theUnit" value="@unit"/>
      <let name="UCUMtest"
           value="doc('include/voc-UCUM.xml')/*/ucum[@unit=$theUnit]/@message"/>
      <assert role="warning"
              see="http://elga.art-decor.org/elgatgd-html-20240709T111220/tmp-1.2.40.0.34.11.2.3.4-2013-09-09T000000.html"
              test="$UCUMtest='OK' or string-length($UCUMtest)=0">(ArzneiEntry): value/@unit (PQ) MUSS eine gültige UCUM-Einheit sein (<value-of select="$UCUMtest"/>).</assert>
   </rule>
   <!--
Template derived rules for ID: 1.2.40.0.34.11.2.3.4
Context: *[hl7:manufacturedProduct[hl7:templateId[@root = '1.3.6.1.4.1.19376.1.5.3.1.4.7.2'] and hl7:templateId[@root = '2.16.840.1.113883.10.20.1.53']]]/hl7:manufacturedProduct[hl7:templateId[@root = '1.3.6.1.4.1.19376.1.5.3.1.4.7.2'] and hl7:templateId[@root = '2.16.840.1.113883.10.20.1.53']]/hl7:manufacturedMaterial[hl7:templateId[@root = '1.2.40.0.34.11.2.3.4'] and hl7:templateId[@root = '1.3.6.1.4.1.19376.1.9.1.3.1']]/pharm:ingredient[pharm:ingredient[pharm:code[@codeSystem = '2.16.840.1.113883.6.73' or @nullFlavor]]]
Item: (ArzneiEntry)
-->

   <rule fpi="RULC-1"
         context="*[hl7:manufacturedProduct[hl7:templateId[@root = '1.3.6.1.4.1.19376.1.5.3.1.4.7.2'] and hl7:templateId[@root = '2.16.840.1.113883.10.20.1.53']]]/hl7:manufacturedProduct[hl7:templateId[@root = '1.3.6.1.4.1.19376.1.5.3.1.4.7.2'] and hl7:templateId[@root = '2.16.840.1.113883.10.20.1.53']]/hl7:manufacturedMaterial[hl7:templateId[@root = '1.2.40.0.34.11.2.3.4'] and hl7:templateId[@root = '1.3.6.1.4.1.19376.1.9.1.3.1']]/pharm:ingredient[pharm:ingredient[pharm:code[@codeSystem = '2.16.840.1.113883.6.73' or @nullFlavor]]]"
         id="d41e2418-false-d4845e0">
      <assert role="error"
              see="http://elga.art-decor.org/elgatgd-html-20240709T111220/tmp-1.2.40.0.34.11.2.3.4-2013-09-09T000000.html"
              test="string(@classCode) = ('ACTI')">(ArzneiEntry): Der Wert von classCode MUSS 'ACTI' sein. Gefunden: "<value-of select="@classCode"/>"</assert>
      <assert role="error"
              see="http://elga.art-decor.org/elgatgd-html-20240709T111220/tmp-1.2.40.0.34.11.2.3.4-2013-09-09T000000.html"
              test="count(pharm:quantity) &gt;= 1">(ArzneiEntry): Element pharm:quantity ist required [min 1x].</assert>
      <assert role="error"
              see="http://elga.art-decor.org/elgatgd-html-20240709T111220/tmp-1.2.40.0.34.11.2.3.4-2013-09-09T000000.html"
              test="count(pharm:quantity) &lt;= 1">(ArzneiEntry): Element pharm:quantity kommt zu häufig vor [max 1x].</assert>
      <assert role="error"
              see="http://elga.art-decor.org/elgatgd-html-20240709T111220/tmp-1.2.40.0.34.11.2.3.4-2013-09-09T000000.html"
              test="count(pharm:ingredient[pharm:code[@codeSystem = '2.16.840.1.113883.6.73' or @nullFlavor]]) &gt;= 1">(ArzneiEntry): Element pharm:ingredient[pharm:code[@codeSystem = '2.16.840.1.113883.6.73' or @nullFlavor]] ist mandatory [min 1x].</assert>
      <assert role="error"
              see="http://elga.art-decor.org/elgatgd-html-20240709T111220/tmp-1.2.40.0.34.11.2.3.4-2013-09-09T000000.html"
              test="count(pharm:ingredient[pharm:code[@codeSystem = '2.16.840.1.113883.6.73' or @nullFlavor]]) &lt;= 1">(ArzneiEntry): Element pharm:ingredient[pharm:code[@codeSystem = '2.16.840.1.113883.6.73' or @nullFlavor]] kommt zu häufig vor [max 1x].</assert>
   </rule>
   <!--
Template derived rules for ID: 1.2.40.0.34.11.2.3.4
Context: *[hl7:manufacturedProduct[hl7:templateId[@root = '1.3.6.1.4.1.19376.1.5.3.1.4.7.2'] and hl7:templateId[@root = '2.16.840.1.113883.10.20.1.53']]]/hl7:manufacturedProduct[hl7:templateId[@root = '1.3.6.1.4.1.19376.1.5.3.1.4.7.2'] and hl7:templateId[@root = '2.16.840.1.113883.10.20.1.53']]/hl7:manufacturedMaterial[hl7:templateId[@root = '1.2.40.0.34.11.2.3.4'] and hl7:templateId[@root = '1.3.6.1.4.1.19376.1.9.1.3.1']]/pharm:ingredient[pharm:ingredient[pharm:code[@codeSystem = '2.16.840.1.113883.6.73' or @nullFlavor]]]/pharm:quantity
Item: (ArzneiEntry)
-->

   <rule fpi="RULC-1"
         context="*[hl7:manufacturedProduct[hl7:templateId[@root = '1.3.6.1.4.1.19376.1.5.3.1.4.7.2'] and hl7:templateId[@root = '2.16.840.1.113883.10.20.1.53']]]/hl7:manufacturedProduct[hl7:templateId[@root = '1.3.6.1.4.1.19376.1.5.3.1.4.7.2'] and hl7:templateId[@root = '2.16.840.1.113883.10.20.1.53']]/hl7:manufacturedMaterial[hl7:templateId[@root = '1.2.40.0.34.11.2.3.4'] and hl7:templateId[@root = '1.3.6.1.4.1.19376.1.9.1.3.1']]/pharm:ingredient[pharm:ingredient[pharm:code[@codeSystem = '2.16.840.1.113883.6.73' or @nullFlavor]]]/pharm:quantity"
         id="d41e2427-false-d4874e0">
      <assert role="error"
              see="http://elga.art-decor.org/elgatgd-html-20240709T111220/tmp-1.2.40.0.34.11.2.3.4-2013-09-09T000000.html"
              test="count(hl7:numerator) &gt;= 1">(ArzneiEntry): Element hl7:numerator ist required [min 1x].</assert>
      <assert role="error"
              see="http://elga.art-decor.org/elgatgd-html-20240709T111220/tmp-1.2.40.0.34.11.2.3.4-2013-09-09T000000.html"
              test="count(hl7:numerator) &lt;= 1">(ArzneiEntry): Element hl7:numerator kommt zu häufig vor [max 1x].</assert>
      <assert role="error"
              see="http://elga.art-decor.org/elgatgd-html-20240709T111220/tmp-1.2.40.0.34.11.2.3.4-2013-09-09T000000.html"
              test="count(hl7:denominator) &gt;= 1">(ArzneiEntry): Element hl7:denominator ist required [min 1x].</assert>
      <assert role="error"
              see="http://elga.art-decor.org/elgatgd-html-20240709T111220/tmp-1.2.40.0.34.11.2.3.4-2013-09-09T000000.html"
              test="count(hl7:denominator) &lt;= 1">(ArzneiEntry): Element hl7:denominator kommt zu häufig vor [max 1x].</assert>
   </rule>
   <!--
Template derived rules for ID: 1.2.40.0.34.11.2.3.4
Context: *[hl7:manufacturedProduct[hl7:templateId[@root = '1.3.6.1.4.1.19376.1.5.3.1.4.7.2'] and hl7:templateId[@root = '2.16.840.1.113883.10.20.1.53']]]/hl7:manufacturedProduct[hl7:templateId[@root = '1.3.6.1.4.1.19376.1.5.3.1.4.7.2'] and hl7:templateId[@root = '2.16.840.1.113883.10.20.1.53']]/hl7:manufacturedMaterial[hl7:templateId[@root = '1.2.40.0.34.11.2.3.4'] and hl7:templateId[@root = '1.3.6.1.4.1.19376.1.9.1.3.1']]/pharm:ingredient[pharm:ingredient[pharm:code[@codeSystem = '2.16.840.1.113883.6.73' or @nullFlavor]]]/pharm:quantity/hl7:numerator
Item: (ArzneiEntry)
-->

   <rule fpi="RULC-1"
         context="*[hl7:manufacturedProduct[hl7:templateId[@root = '1.3.6.1.4.1.19376.1.5.3.1.4.7.2'] and hl7:templateId[@root = '2.16.840.1.113883.10.20.1.53']]]/hl7:manufacturedProduct[hl7:templateId[@root = '1.3.6.1.4.1.19376.1.5.3.1.4.7.2'] and hl7:templateId[@root = '2.16.840.1.113883.10.20.1.53']]/hl7:manufacturedMaterial[hl7:templateId[@root = '1.2.40.0.34.11.2.3.4'] and hl7:templateId[@root = '1.3.6.1.4.1.19376.1.9.1.3.1']]/pharm:ingredient[pharm:ingredient[pharm:code[@codeSystem = '2.16.840.1.113883.6.73' or @nullFlavor]]]/pharm:quantity/hl7:numerator"
         id="d41e2429-false-d4898e0">
      <extends rule="PQ"/>
      <assert role="error"
              see="http://elga.art-decor.org/elgatgd-html-20240709T111220/tmp-1.2.40.0.34.11.2.3.4-2013-09-09T000000.html"
              test="empty(@xsi:type) or resolve-QName(@xsi:type, .) = QName('urn:hl7-org:v3', 'PQ')">(ArzneiEntry): Wenn eine @xsi:type Instruktion anwesend ist MUSS diese den Wert "{urn:hl7-org:v3}:PQ" haben. Gefunden "{<value-of select="namespace-uri-from-QName(resolve-QName(@xsi:type,.))"/>}:<value-of select="local-name-from-QName(resolve-QName(@xsi:type,.))"/>"</assert>
      <assert role="error"
              see="http://elga.art-decor.org/elgatgd-html-20240709T111220/tmp-1.2.40.0.34.11.2.3.4-2013-09-09T000000.html"
              test="not(@value) or matches(@value, '^[-+]?\d*\.?[0-9]+([eE][-+]?\d+)?$')">(ArzneiEntry): @value ist keine gültige PQ Zahl <value-of select="@value"/>
      </assert>
      <let name="theUnit" value="@unit"/>
      <let name="UCUMtest"
           value="doc('include/voc-UCUM.xml')/*/ucum[@unit=$theUnit]/@message"/>
      <assert role="warning"
              see="http://elga.art-decor.org/elgatgd-html-20240709T111220/tmp-1.2.40.0.34.11.2.3.4-2013-09-09T000000.html"
              test="$UCUMtest='OK' or string-length($UCUMtest)=0">(ArzneiEntry): value/@unit (PQ) MUSS eine gültige UCUM-Einheit sein (<value-of select="$UCUMtest"/>).</assert>
   </rule>
   <!--
Template derived rules for ID: 1.2.40.0.34.11.2.3.4
Context: *[hl7:manufacturedProduct[hl7:templateId[@root = '1.3.6.1.4.1.19376.1.5.3.1.4.7.2'] and hl7:templateId[@root = '2.16.840.1.113883.10.20.1.53']]]/hl7:manufacturedProduct[hl7:templateId[@root = '1.3.6.1.4.1.19376.1.5.3.1.4.7.2'] and hl7:templateId[@root = '2.16.840.1.113883.10.20.1.53']]/hl7:manufacturedMaterial[hl7:templateId[@root = '1.2.40.0.34.11.2.3.4'] and hl7:templateId[@root = '1.3.6.1.4.1.19376.1.9.1.3.1']]/pharm:ingredient[pharm:ingredient[pharm:code[@codeSystem = '2.16.840.1.113883.6.73' or @nullFlavor]]]/pharm:quantity/hl7:denominator
Item: (ArzneiEntry)
-->

   <rule fpi="RULC-1"
         context="*[hl7:manufacturedProduct[hl7:templateId[@root = '1.3.6.1.4.1.19376.1.5.3.1.4.7.2'] and hl7:templateId[@root = '2.16.840.1.113883.10.20.1.53']]]/hl7:manufacturedProduct[hl7:templateId[@root = '1.3.6.1.4.1.19376.1.5.3.1.4.7.2'] and hl7:templateId[@root = '2.16.840.1.113883.10.20.1.53']]/hl7:manufacturedMaterial[hl7:templateId[@root = '1.2.40.0.34.11.2.3.4'] and hl7:templateId[@root = '1.3.6.1.4.1.19376.1.9.1.3.1']]/pharm:ingredient[pharm:ingredient[pharm:code[@codeSystem = '2.16.840.1.113883.6.73' or @nullFlavor]]]/pharm:quantity/hl7:denominator"
         id="d41e2431-false-d4913e0">
      <extends rule="PQ"/>
      <assert role="error"
              see="http://elga.art-decor.org/elgatgd-html-20240709T111220/tmp-1.2.40.0.34.11.2.3.4-2013-09-09T000000.html"
              test="empty(@xsi:type) or resolve-QName(@xsi:type, .) = QName('urn:hl7-org:v3', 'PQ')">(ArzneiEntry): Wenn eine @xsi:type Instruktion anwesend ist MUSS diese den Wert "{urn:hl7-org:v3}:PQ" haben. Gefunden "{<value-of select="namespace-uri-from-QName(resolve-QName(@xsi:type,.))"/>}:<value-of select="local-name-from-QName(resolve-QName(@xsi:type,.))"/>"</assert>
      <assert role="error"
              see="http://elga.art-decor.org/elgatgd-html-20240709T111220/tmp-1.2.40.0.34.11.2.3.4-2013-09-09T000000.html"
              test="not(@value) or matches(@value, '^[-+]?\d*\.?[0-9]+([eE][-+]?\d+)?$')">(ArzneiEntry): @value ist keine gültige PQ Zahl <value-of select="@value"/>
      </assert>
      <let name="theUnit" value="@unit"/>
      <let name="UCUMtest"
           value="doc('include/voc-UCUM.xml')/*/ucum[@unit=$theUnit]/@message"/>
      <assert role="warning"
              see="http://elga.art-decor.org/elgatgd-html-20240709T111220/tmp-1.2.40.0.34.11.2.3.4-2013-09-09T000000.html"
              test="$UCUMtest='OK' or string-length($UCUMtest)=0">(ArzneiEntry): value/@unit (PQ) MUSS eine gültige UCUM-Einheit sein (<value-of select="$UCUMtest"/>).</assert>
   </rule>
   <!--
Template derived rules for ID: 1.2.40.0.34.11.2.3.4
Context: *[hl7:manufacturedProduct[hl7:templateId[@root = '1.3.6.1.4.1.19376.1.5.3.1.4.7.2'] and hl7:templateId[@root = '2.16.840.1.113883.10.20.1.53']]]/hl7:manufacturedProduct[hl7:templateId[@root = '1.3.6.1.4.1.19376.1.5.3.1.4.7.2'] and hl7:templateId[@root = '2.16.840.1.113883.10.20.1.53']]/hl7:manufacturedMaterial[hl7:templateId[@root = '1.2.40.0.34.11.2.3.4'] and hl7:templateId[@root = '1.3.6.1.4.1.19376.1.9.1.3.1']]/pharm:ingredient[pharm:ingredient[pharm:code[@codeSystem = '2.16.840.1.113883.6.73' or @nullFlavor]]]/pharm:ingredient[pharm:code[@codeSystem = '2.16.840.1.113883.6.73' or @nullFlavor]]
Item: (ArzneiEntry)
-->

   <rule fpi="RULC-1"
         context="*[hl7:manufacturedProduct[hl7:templateId[@root = '1.3.6.1.4.1.19376.1.5.3.1.4.7.2'] and hl7:templateId[@root = '2.16.840.1.113883.10.20.1.53']]]/hl7:manufacturedProduct[hl7:templateId[@root = '1.3.6.1.4.1.19376.1.5.3.1.4.7.2'] and hl7:templateId[@root = '2.16.840.1.113883.10.20.1.53']]/hl7:manufacturedMaterial[hl7:templateId[@root = '1.2.40.0.34.11.2.3.4'] and hl7:templateId[@root = '1.3.6.1.4.1.19376.1.9.1.3.1']]/pharm:ingredient[pharm:ingredient[pharm:code[@codeSystem = '2.16.840.1.113883.6.73' or @nullFlavor]]]/pharm:ingredient[pharm:code[@codeSystem = '2.16.840.1.113883.6.73' or @nullFlavor]]"
         id="d41e2434-false-d4929e0">
      <assert role="error"
              see="http://elga.art-decor.org/elgatgd-html-20240709T111220/tmp-1.2.40.0.34.11.2.3.4-2013-09-09T000000.html"
              test="count(pharm:code[@codeSystem = '2.16.840.1.113883.6.73' or @nullFlavor]) &gt;= 1">(ArzneiEntry): Element pharm:code[@codeSystem = '2.16.840.1.113883.6.73' or @nullFlavor] ist required [min 1x].</assert>
      <assert role="error"
              see="http://elga.art-decor.org/elgatgd-html-20240709T111220/tmp-1.2.40.0.34.11.2.3.4-2013-09-09T000000.html"
              test="count(pharm:code[@codeSystem = '2.16.840.1.113883.6.73' or @nullFlavor]) &lt;= 1">(ArzneiEntry): Element pharm:code[@codeSystem = '2.16.840.1.113883.6.73' or @nullFlavor] kommt zu häufig vor [max 1x].</assert>
      <assert role="error"
              see="http://elga.art-decor.org/elgatgd-html-20240709T111220/tmp-1.2.40.0.34.11.2.3.4-2013-09-09T000000.html"
              test="count(pharm:name[not(@nullFlavor)]) &gt;= 1">(ArzneiEntry): Element pharm:name[not(@nullFlavor)] ist mandatory [min 1x].</assert>
      <assert role="error"
              see="http://elga.art-decor.org/elgatgd-html-20240709T111220/tmp-1.2.40.0.34.11.2.3.4-2013-09-09T000000.html"
              test="count(pharm:name[not(@nullFlavor)]) &lt;= 1">(ArzneiEntry): Element pharm:name[not(@nullFlavor)] kommt zu häufig vor [max 1x].</assert>
   </rule>
   <!--
Template derived rules for ID: 1.2.40.0.34.11.2.3.4
Context: *[hl7:manufacturedProduct[hl7:templateId[@root = '1.3.6.1.4.1.19376.1.5.3.1.4.7.2'] and hl7:templateId[@root = '2.16.840.1.113883.10.20.1.53']]]/hl7:manufacturedProduct[hl7:templateId[@root = '1.3.6.1.4.1.19376.1.5.3.1.4.7.2'] and hl7:templateId[@root = '2.16.840.1.113883.10.20.1.53']]/hl7:manufacturedMaterial[hl7:templateId[@root = '1.2.40.0.34.11.2.3.4'] and hl7:templateId[@root = '1.3.6.1.4.1.19376.1.9.1.3.1']]/pharm:ingredient[pharm:ingredient[pharm:code[@codeSystem = '2.16.840.1.113883.6.73' or @nullFlavor]]]/pharm:ingredient[pharm:code[@codeSystem = '2.16.840.1.113883.6.73' or @nullFlavor]]/pharm:code[@codeSystem = '2.16.840.1.113883.6.73' or @nullFlavor]
Item: (ArzneiEntry)
-->

   <rule fpi="RULC-1"
         context="*[hl7:manufacturedProduct[hl7:templateId[@root = '1.3.6.1.4.1.19376.1.5.3.1.4.7.2'] and hl7:templateId[@root = '2.16.840.1.113883.10.20.1.53']]]/hl7:manufacturedProduct[hl7:templateId[@root = '1.3.6.1.4.1.19376.1.5.3.1.4.7.2'] and hl7:templateId[@root = '2.16.840.1.113883.10.20.1.53']]/hl7:manufacturedMaterial[hl7:templateId[@root = '1.2.40.0.34.11.2.3.4'] and hl7:templateId[@root = '1.3.6.1.4.1.19376.1.9.1.3.1']]/pharm:ingredient[pharm:ingredient[pharm:code[@codeSystem = '2.16.840.1.113883.6.73' or @nullFlavor]]]/pharm:ingredient[pharm:code[@codeSystem = '2.16.840.1.113883.6.73' or @nullFlavor]]/pharm:code[@codeSystem = '2.16.840.1.113883.6.73' or @nullFlavor]"
         id="d41e2439-false-d4955e0">
      <extends rule="CE"/>
      <assert role="error"
              see="http://elga.art-decor.org/elgatgd-html-20240709T111220/tmp-1.2.40.0.34.11.2.3.4-2013-09-09T000000.html"
              test="empty(@xsi:type) or resolve-QName(@xsi:type, .) = QName('urn:hl7-org:v3', 'CE')">(ArzneiEntry): Wenn eine @xsi:type Instruktion anwesend ist MUSS diese den Wert "{urn:hl7-org:v3}:CE" haben. Gefunden "{<value-of select="namespace-uri-from-QName(resolve-QName(@xsi:type,.))"/>}:<value-of select="local-name-from-QName(resolve-QName(@xsi:type,.))"/>"</assert>
      <assert role="error"
              see="http://elga.art-decor.org/elgatgd-html-20240709T111220/tmp-1.2.40.0.34.11.2.3.4-2013-09-09T000000.html"
              test="@nullFlavor or (@codeSystem='2.16.840.1.113883.6.73')">(ArzneiEntry): Der Elementinhalt MUSS einer von 'codeSystem '2.16.840.1.113883.6.73'' sein.</assert>
      <assert role="error"
              see="http://elga.art-decor.org/elgatgd-html-20240709T111220/tmp-1.2.40.0.34.11.2.3.4-2013-09-09T000000.html"
              test="count(hl7:originalText) &lt;= 1">(ArzneiEntry): Element hl7:originalText kommt zu häufig vor [max 1x].</assert>
   </rule>
   <!--
Template derived rules for ID: 1.2.40.0.34.11.2.3.4
Context: *[hl7:manufacturedProduct[hl7:templateId[@root = '1.3.6.1.4.1.19376.1.5.3.1.4.7.2'] and hl7:templateId[@root = '2.16.840.1.113883.10.20.1.53']]]/hl7:manufacturedProduct[hl7:templateId[@root = '1.3.6.1.4.1.19376.1.5.3.1.4.7.2'] and hl7:templateId[@root = '2.16.840.1.113883.10.20.1.53']]/hl7:manufacturedMaterial[hl7:templateId[@root = '1.2.40.0.34.11.2.3.4'] and hl7:templateId[@root = '1.3.6.1.4.1.19376.1.9.1.3.1']]/pharm:ingredient[pharm:ingredient[pharm:code[@codeSystem = '2.16.840.1.113883.6.73' or @nullFlavor]]]/pharm:ingredient[pharm:code[@codeSystem = '2.16.840.1.113883.6.73' or @nullFlavor]]/pharm:code[@codeSystem = '2.16.840.1.113883.6.73' or @nullFlavor]/hl7:originalText
Item: (ArzneiEntry)
-->

   <rule fpi="RULC-1"
         context="*[hl7:manufacturedProduct[hl7:templateId[@root = '1.3.6.1.4.1.19376.1.5.3.1.4.7.2'] and hl7:templateId[@root = '2.16.840.1.113883.10.20.1.53']]]/hl7:manufacturedProduct[hl7:templateId[@root = '1.3.6.1.4.1.19376.1.5.3.1.4.7.2'] and hl7:templateId[@root = '2.16.840.1.113883.10.20.1.53']]/hl7:manufacturedMaterial[hl7:templateId[@root = '1.2.40.0.34.11.2.3.4'] and hl7:templateId[@root = '1.3.6.1.4.1.19376.1.9.1.3.1']]/pharm:ingredient[pharm:ingredient[pharm:code[@codeSystem = '2.16.840.1.113883.6.73' or @nullFlavor]]]/pharm:ingredient[pharm:code[@codeSystem = '2.16.840.1.113883.6.73' or @nullFlavor]]/pharm:code[@codeSystem = '2.16.840.1.113883.6.73' or @nullFlavor]/hl7:originalText"
         id="d41e2443-false-d4980e0">
      <extends rule="ED"/>
      <assert role="error"
              see="http://elga.art-decor.org/elgatgd-html-20240709T111220/tmp-1.2.40.0.34.11.2.3.4-2013-09-09T000000.html"
              test="empty(@xsi:type) or resolve-QName(@xsi:type, .) = QName('urn:hl7-org:v3', 'ED')">(ArzneiEntry): Wenn eine @xsi:type Instruktion anwesend ist MUSS diese den Wert "{urn:hl7-org:v3}:ED" haben. Gefunden "{<value-of select="namespace-uri-from-QName(resolve-QName(@xsi:type,.))"/>}:<value-of select="local-name-from-QName(resolve-QName(@xsi:type,.))"/>"</assert>
   </rule>
   <!--
Template derived rules for ID: 1.2.40.0.34.11.2.3.4
Context: *[hl7:manufacturedProduct[hl7:templateId[@root = '1.3.6.1.4.1.19376.1.5.3.1.4.7.2'] and hl7:templateId[@root = '2.16.840.1.113883.10.20.1.53']]]/hl7:manufacturedProduct[hl7:templateId[@root = '1.3.6.1.4.1.19376.1.5.3.1.4.7.2'] and hl7:templateId[@root = '2.16.840.1.113883.10.20.1.53']]/hl7:manufacturedMaterial[hl7:templateId[@root = '1.2.40.0.34.11.2.3.4'] and hl7:templateId[@root = '1.3.6.1.4.1.19376.1.9.1.3.1']]/pharm:ingredient[pharm:ingredient[pharm:code[@codeSystem = '2.16.840.1.113883.6.73' or @nullFlavor]]]/pharm:ingredient[pharm:code[@codeSystem = '2.16.840.1.113883.6.73' or @nullFlavor]]/pharm:code[@codeSystem = '2.16.840.1.113883.6.73' or @nullFlavor]/hl7:translation
Item: (ArzneiEntry)
-->

   <rule fpi="RULC-1"
         context="*[hl7:manufacturedProduct[hl7:templateId[@root = '1.3.6.1.4.1.19376.1.5.3.1.4.7.2'] and hl7:templateId[@root = '2.16.840.1.113883.10.20.1.53']]]/hl7:manufacturedProduct[hl7:templateId[@root = '1.3.6.1.4.1.19376.1.5.3.1.4.7.2'] and hl7:templateId[@root = '2.16.840.1.113883.10.20.1.53']]/hl7:manufacturedMaterial[hl7:templateId[@root = '1.2.40.0.34.11.2.3.4'] and hl7:templateId[@root = '1.3.6.1.4.1.19376.1.9.1.3.1']]/pharm:ingredient[pharm:ingredient[pharm:code[@codeSystem = '2.16.840.1.113883.6.73' or @nullFlavor]]]/pharm:ingredient[pharm:code[@codeSystem = '2.16.840.1.113883.6.73' or @nullFlavor]]/pharm:code[@codeSystem = '2.16.840.1.113883.6.73' or @nullFlavor]/hl7:translation"
         id="d41e2445-false-d4990e0">
      <extends rule="CE"/>
      <assert role="error"
              see="http://elga.art-decor.org/elgatgd-html-20240709T111220/tmp-1.2.40.0.34.11.2.3.4-2013-09-09T000000.html"
              test="empty(@xsi:type) or resolve-QName(@xsi:type, .) = QName('urn:hl7-org:v3', 'CE')">(ArzneiEntry): Wenn eine @xsi:type Instruktion anwesend ist MUSS diese den Wert "{urn:hl7-org:v3}:CE" haben. Gefunden "{<value-of select="namespace-uri-from-QName(resolve-QName(@xsi:type,.))"/>}:<value-of select="local-name-from-QName(resolve-QName(@xsi:type,.))"/>"</assert>
   </rule>
   <!--
Template derived rules for ID: 1.2.40.0.34.11.2.3.4
Context: *[hl7:manufacturedProduct[hl7:templateId[@root = '1.3.6.1.4.1.19376.1.5.3.1.4.7.2'] and hl7:templateId[@root = '2.16.840.1.113883.10.20.1.53']]]/hl7:manufacturedProduct[hl7:templateId[@root = '1.3.6.1.4.1.19376.1.5.3.1.4.7.2'] and hl7:templateId[@root = '2.16.840.1.113883.10.20.1.53']]/hl7:manufacturedMaterial[hl7:templateId[@root = '1.2.40.0.34.11.2.3.4'] and hl7:templateId[@root = '1.3.6.1.4.1.19376.1.9.1.3.1']]/pharm:ingredient[pharm:ingredient[pharm:code[@codeSystem = '2.16.840.1.113883.6.73' or @nullFlavor]]]/pharm:ingredient[pharm:code[@codeSystem = '2.16.840.1.113883.6.73' or @nullFlavor]]/pharm:name[not(@nullFlavor)]
Item: (ArzneiEntry)
-->

   <rule fpi="RULC-1"
         context="*[hl7:manufacturedProduct[hl7:templateId[@root = '1.3.6.1.4.1.19376.1.5.3.1.4.7.2'] and hl7:templateId[@root = '2.16.840.1.113883.10.20.1.53']]]/hl7:manufacturedProduct[hl7:templateId[@root = '1.3.6.1.4.1.19376.1.5.3.1.4.7.2'] and hl7:templateId[@root = '2.16.840.1.113883.10.20.1.53']]/hl7:manufacturedMaterial[hl7:templateId[@root = '1.2.40.0.34.11.2.3.4'] and hl7:templateId[@root = '1.3.6.1.4.1.19376.1.9.1.3.1']]/pharm:ingredient[pharm:ingredient[pharm:code[@codeSystem = '2.16.840.1.113883.6.73' or @nullFlavor]]]/pharm:ingredient[pharm:code[@codeSystem = '2.16.840.1.113883.6.73' or @nullFlavor]]/pharm:name[not(@nullFlavor)]"
         id="d41e2450-false-d5000e0">
      <extends rule="EN"/>
      <assert role="error"
              see="http://elga.art-decor.org/elgatgd-html-20240709T111220/tmp-1.2.40.0.34.11.2.3.4-2013-09-09T000000.html"
              test="empty(@xsi:type) or resolve-QName(@xsi:type, .) = QName('urn:hl7-org:v3', 'EN')">(ArzneiEntry): Wenn eine @xsi:type Instruktion anwesend ist MUSS diese den Wert "{urn:hl7-org:v3}:EN" haben. Gefunden "{<value-of select="namespace-uri-from-QName(resolve-QName(@xsi:type,.))"/>}:<value-of select="local-name-from-QName(resolve-QName(@xsi:type,.))"/>"</assert>
   </rule>
</pattern>
