<?xml version="1.0" encoding="UTF-8"?>
<!--
Template derived pattern
===========================================
ID: 1.2.40.0.34.6.0.11.3.72
Name: Medikationseinnahme Entry
Description: 
-->
<pattern xmlns="http://purl.oclc.org/dsdl/schematron"
         id="template-1.2.40.0.34.6.0.11.3.72-2021-02-19T125222-closed">
   <title>Medikationseinnahme Entry</title>

   <!-- Checking undefined contents for template/element @isClosed="true". Match context that we did not already match -->
   <rule fpi="RUL-QQQ"
         context="*[hl7:substanceAdministration[hl7:templateId[@root = '1.2.40.0.34.6.0.11.3.72'] and hl7:templateId[@root = '2.16.840.1.113883.10.20.1.24'] and hl7:templateId[@root = '1.3.6.1.4.1.19376.1.5.3.1.4.7'] and hl7:templateId[@root = '1.3.6.1.4.1.19376.1.9.1.3.16'] and hl7:templateId[@root = '1.3.6.1.4.1.19376.1.5.3.1.4.7.1']]]/*[not(@xsi:nil = 'true')][not(self::hl7:substanceAdministration[hl7:templateId[@root = '1.2.40.0.34.6.0.11.3.72'] and hl7:templateId[@root = '2.16.840.1.113883.10.20.1.24'] and hl7:templateId[@root = '1.3.6.1.4.1.19376.1.5.3.1.4.7'] and hl7:templateId[@root = '1.3.6.1.4.1.19376.1.9.1.3.16'] and hl7:templateId[@root = '1.3.6.1.4.1.19376.1.5.3.1.4.7.1']])]"
         id="d41e46710-true-d3567921e0">
      <assert role="error"
              see="http://elga.art-decor.org/elgatgd-html-20240709T111220/tmp-1.2.40.0.34.6.0.11.3.72-2021-02-19T125222.html"
              test="not(.)">(atcdabbr_entry_MedikationsEinnahmeEntry)/d41e46710-true-d3567921e0: '<value-of select="name(..)"/>' ist als geschlossen definiert und dieses Element '<name/>' ist nicht erlaubt oder nicht mit diesem Inhalt erlaubt. Dies kann templateId, code oder id betreffen. Erwartet:  hl7:substanceAdministration[hl7:templateId[@root = '1.2.40.0.34.6.0.11.3.72'] and hl7:templateId[@root = '2.16.840.1.113883.10.20.1.24'] and hl7:templateId[@root = '1.3.6.1.4.1.19376.1.5.3.1.4.7'] and hl7:templateId[@root = '1.3.6.1.4.1.19376.1.9.1.3.16'] and hl7:templateId[@root = '1.3.6.1.4.1.19376.1.5.3.1.4.7.1']] (rule-reference: d41e46710-true-d3567921e0)</assert>
   </rule>

   <!-- Checking undefined contents for template/element @isClosed="true". Match context that we did not already match -->
   <rule fpi="RUL-QQQ"
         context="*[hl7:substanceAdministration[hl7:templateId[@root = '1.2.40.0.34.6.0.11.3.72'] and hl7:templateId[@root = '2.16.840.1.113883.10.20.1.24'] and hl7:templateId[@root = '1.3.6.1.4.1.19376.1.5.3.1.4.7'] and hl7:templateId[@root = '1.3.6.1.4.1.19376.1.9.1.3.16'] and hl7:templateId[@root = '1.3.6.1.4.1.19376.1.5.3.1.4.7.1']]]/hl7:substanceAdministration[hl7:templateId[@root = '1.2.40.0.34.6.0.11.3.72'] and hl7:templateId[@root = '2.16.840.1.113883.10.20.1.24'] and hl7:templateId[@root = '1.3.6.1.4.1.19376.1.5.3.1.4.7'] and hl7:templateId[@root = '1.3.6.1.4.1.19376.1.9.1.3.16'] and hl7:templateId[@root = '1.3.6.1.4.1.19376.1.5.3.1.4.7.1']]/*[not(@xsi:nil = 'true')][not(self::hl7:templateId[@root = '1.2.40.0.34.6.0.11.3.72'] | self::hl7:templateId[@root = '2.16.840.1.113883.10.20.1.24'] | self::hl7:templateId[@root = '1.3.6.1.4.1.19376.1.5.3.1.4.7'] | self::hl7:templateId[@root = '1.3.6.1.4.1.19376.1.9.1.3.16'] | self::hl7:templateId[@root = '1.3.6.1.4.1.19376.1.5.3.1.4.7.1'] | self::hl7:id[not(@nullFlavor)] | self::hl7:code[@codeSystem = '2.16.840.1.113883.4.642.1.101'] | self::hl7:text[not(@nullFlavor)] | self::hl7:statusCode[@code = 'completed'] | self::hl7:effectiveTime | self::hl7:effectiveTime | self::hl7:routeCode[@nullFlavor = 'NA'] | self::hl7:approachSiteCode[@nullFlavor = 'NA'] | self::hl7:doseQuantity | self::hl7:rateQuantity[@nullFlavor = 'NA'] | self::hl7:consumable[hl7:manufacturedProduct[hl7:templateId[@root = '1.3.6.1.4.1.19376.1.5.3.1.4.7.2'] and hl7:templateId[@root = '2.16.840.1.113883.10.20.1.53']]] | self::hl7:author[hl7:assignedAuthor] | self::hl7:author | self::hl7:entryRelationship[@typeCode='RSON'][hl7:act/hl7:templateId[@root='1.3.6.1.4.1.19376.1.5.3.1.4.4.1']] | self::hl7:entryRelationship[@typeCode='SUBJ'][hl7:act/hl7:templateId[@root='2.16.840.1.113883.10.20.1.43']] | self::hl7:entryRelationship[@typeCode='COMP'][hl7:supply] | self::hl7:entryRelationship[@typeCode='REFR'][hl7:substanceAdministration/hl7:templateId[@root='1.3.6.1.4.1.19376.1.9.1.3.10']] | self::hl7:entryRelationship[@typeCode='REFR'][hl7:substanceAdministration/hl7:templateId[@root='1.3.6.1.4.1.19376.1.9.1.3.11']] | self::hl7:entryRelationship[@typeCode='REFR'][hl7:supply/hl7:templateId[@root='1.3.6.1.4.1.19376.1.9.1.3.12']] | self::hl7:entryRelationship[@typeCode='REFR'][hl7:substanceAdministration/hl7:templateId[@root='1.3.6.1.4.1.19376.1.9.1.3.13']] | self::hl7:entryRelationship[@typeCode='REFR'][hl7:substanceAdministration/hl7:templateId[@root='1.3.6.1.4.1.19376.1.9.1.3.14']] | self::hl7:reference[@typeCode = 'XCRPT'][hl7:externalDocument] | self::hl7:precondition[hl7:criterion])]"
         id="d41e47015-true-d3568181e0">
      <assert role="error"
              see="http://elga.art-decor.org/elgatgd-html-20240709T111220/tmp-1.2.40.0.34.6.0.11.3.72-2021-02-19T125222.html"
              test="not(.)">(atcdabbr_entry_MedikationsEinnahmeEntry)/d41e47015-true-d3568181e0: '<value-of select="name(..)"/>' ist als geschlossen definiert und dieses Element '<name/>' ist nicht erlaubt oder nicht mit diesem Inhalt erlaubt. Dies kann templateId, code oder id betreffen. Erwartet:  hl7:templateId[@root = '1.2.40.0.34.6.0.11.3.72'] | hl7:templateId[@root = '2.16.840.1.113883.10.20.1.24'] | hl7:templateId[@root = '1.3.6.1.4.1.19376.1.5.3.1.4.7'] | hl7:templateId[@root = '1.3.6.1.4.1.19376.1.9.1.3.16'] | hl7:templateId[@root = '1.3.6.1.4.1.19376.1.5.3.1.4.7.1'] | hl7:id[not(@nullFlavor)] | hl7:code[@codeSystem = '2.16.840.1.113883.4.642.1.101'] | hl7:text[not(@nullFlavor)] | hl7:statusCode[@code = 'completed'] | hl7:effectiveTime | hl7:effectiveTime | hl7:routeCode[@nullFlavor = 'NA'] | hl7:approachSiteCode[@nullFlavor = 'NA'] | hl7:doseQuantity | hl7:rateQuantity[@nullFlavor = 'NA'] | hl7:consumable[hl7:manufacturedProduct[hl7:templateId[@root = '1.3.6.1.4.1.19376.1.5.3.1.4.7.2'] and hl7:templateId[@root = '2.16.840.1.113883.10.20.1.53']]] | hl7:author[hl7:assignedAuthor] | hl7:author | hl7:entryRelationship[@typeCode='RSON'][hl7:act/hl7:templateId[@root='1.3.6.1.4.1.19376.1.5.3.1.4.4.1']] | hl7:entryRelationship[@typeCode='SUBJ'][hl7:act/hl7:templateId[@root='2.16.840.1.113883.10.20.1.43']] | hl7:entryRelationship[@typeCode='COMP'][hl7:supply] | hl7:entryRelationship[@typeCode='REFR'][hl7:substanceAdministration/hl7:templateId[@root='1.3.6.1.4.1.19376.1.9.1.3.10']] | hl7:entryRelationship[@typeCode='REFR'][hl7:substanceAdministration/hl7:templateId[@root='1.3.6.1.4.1.19376.1.9.1.3.11']] | hl7:entryRelationship[@typeCode='REFR'][hl7:supply/hl7:templateId[@root='1.3.6.1.4.1.19376.1.9.1.3.12']] | hl7:entryRelationship[@typeCode='REFR'][hl7:substanceAdministration/hl7:templateId[@root='1.3.6.1.4.1.19376.1.9.1.3.13']] | hl7:entryRelationship[@typeCode='REFR'][hl7:substanceAdministration/hl7:templateId[@root='1.3.6.1.4.1.19376.1.9.1.3.14']] | hl7:reference[@typeCode = 'XCRPT'][hl7:externalDocument] | hl7:precondition[hl7:criterion] (rule-reference: d41e47015-true-d3568181e0)</assert>
   </rule>

   <!-- Checking undefined contents for template/element @isClosed="true". Match context that we did not already match -->
   <rule fpi="RUL-QQQ"
         context="*[hl7:substanceAdministration[hl7:templateId[@root = '1.2.40.0.34.6.0.11.3.72'] and hl7:templateId[@root = '2.16.840.1.113883.10.20.1.24'] and hl7:templateId[@root = '1.3.6.1.4.1.19376.1.5.3.1.4.7'] and hl7:templateId[@root = '1.3.6.1.4.1.19376.1.9.1.3.16'] and hl7:templateId[@root = '1.3.6.1.4.1.19376.1.5.3.1.4.7.1']]]/hl7:substanceAdministration[hl7:templateId[@root = '1.2.40.0.34.6.0.11.3.72'] and hl7:templateId[@root = '2.16.840.1.113883.10.20.1.24'] and hl7:templateId[@root = '1.3.6.1.4.1.19376.1.5.3.1.4.7'] and hl7:templateId[@root = '1.3.6.1.4.1.19376.1.9.1.3.16'] and hl7:templateId[@root = '1.3.6.1.4.1.19376.1.5.3.1.4.7.1']]/hl7:code[@codeSystem = '2.16.840.1.113883.4.642.1.101']/*[not(@xsi:nil = 'true')][not(self::hl7:translation | self::ips:designation)]"
         id="d41e47096-true-d3568236e0">
      <assert role="error"
              see="http://elga.art-decor.org/elgatgd-html-20240709T111220/tmp-1.2.40.0.34.6.0.11.3.72-2021-02-19T125222.html"
              test="not(.)">(atcdabbr_entry_MedikationsEinnahmeEntry)/d41e47096-true-d3568236e0: '<value-of select="name(..)"/>' ist als geschlossen definiert und dieses Element '<name/>' ist nicht erlaubt oder nicht mit diesem Inhalt erlaubt. Dies kann templateId, code oder id betreffen. Erwartet:  hl7:translation | ips:designation (rule-reference: d41e47096-true-d3568236e0)</assert>
   </rule>

   <!-- Checking undefined contents for template/element @isClosed="true". Match context that we did not already match -->
   <rule fpi="RUL-QQQ"
         context="*[hl7:substanceAdministration[hl7:templateId[@root = '1.2.40.0.34.6.0.11.3.72'] and hl7:templateId[@root = '2.16.840.1.113883.10.20.1.24'] and hl7:templateId[@root = '1.3.6.1.4.1.19376.1.5.3.1.4.7'] and hl7:templateId[@root = '1.3.6.1.4.1.19376.1.9.1.3.16'] and hl7:templateId[@root = '1.3.6.1.4.1.19376.1.5.3.1.4.7.1']]]/hl7:substanceAdministration[hl7:templateId[@root = '1.2.40.0.34.6.0.11.3.72'] and hl7:templateId[@root = '2.16.840.1.113883.10.20.1.24'] and hl7:templateId[@root = '1.3.6.1.4.1.19376.1.5.3.1.4.7'] and hl7:templateId[@root = '1.3.6.1.4.1.19376.1.9.1.3.16'] and hl7:templateId[@root = '1.3.6.1.4.1.19376.1.5.3.1.4.7.1']]/hl7:text[not(@nullFlavor)]/*[not(@xsi:nil = 'true')][not(self::hl7:reference[not(@nullFlavor)])]"
         id="d41e47146-true-d3568260e0">
      <assert role="error"
              see="http://elga.art-decor.org/elgatgd-html-20240709T111220/tmp-1.2.40.0.34.6.0.11.3.72-2021-02-19T125222.html"
              test="not(.)">(atcdabbr_entry_MedikationsEinnahmeEntry)/d41e47146-true-d3568260e0: '<value-of select="name(..)"/>' ist als geschlossen definiert und dieses Element '<name/>' ist nicht erlaubt oder nicht mit diesem Inhalt erlaubt. Dies kann templateId, code oder id betreffen. Erwartet:  hl7:reference[not(@nullFlavor)] (rule-reference: d41e47146-true-d3568260e0)</assert>
   </rule>

   <!-- Checking undefined contents for template/element @isClosed="true". Match context that we did not already match -->
   <rule fpi="RUL-QQQ"
         context="*[hl7:substanceAdministration[hl7:templateId[@root = '1.2.40.0.34.6.0.11.3.72'] and hl7:templateId[@root = '2.16.840.1.113883.10.20.1.24'] and hl7:templateId[@root = '1.3.6.1.4.1.19376.1.5.3.1.4.7'] and hl7:templateId[@root = '1.3.6.1.4.1.19376.1.9.1.3.16'] and hl7:templateId[@root = '1.3.6.1.4.1.19376.1.5.3.1.4.7.1']]]/hl7:substanceAdministration[hl7:templateId[@root = '1.2.40.0.34.6.0.11.3.72'] and hl7:templateId[@root = '2.16.840.1.113883.10.20.1.24'] and hl7:templateId[@root = '1.3.6.1.4.1.19376.1.5.3.1.4.7'] and hl7:templateId[@root = '1.3.6.1.4.1.19376.1.9.1.3.16'] and hl7:templateId[@root = '1.3.6.1.4.1.19376.1.5.3.1.4.7.1']]/hl7:effectiveTime/*[not(@xsi:nil = 'true')][not(self::hl7:low[not(@nullFlavor)] | self::hl7:high[not(@nullFlavor)])]"
         id="d41e47209-true-d3568295e0">
      <assert role="error"
              see="http://elga.art-decor.org/elgatgd-html-20240709T111220/tmp-1.2.40.0.34.6.0.11.3.72-2021-02-19T125222.html"
              test="not(.)">(atcdabbr_entry_MedikationsEinnahmeEntry)/d41e47209-true-d3568295e0: '<value-of select="name(..)"/>' ist als geschlossen definiert und dieses Element '<name/>' ist nicht erlaubt oder nicht mit diesem Inhalt erlaubt. Dies kann templateId, code oder id betreffen. Erwartet:  hl7:low[not(@nullFlavor)] | hl7:high[not(@nullFlavor)] (rule-reference: d41e47209-true-d3568295e0)</assert>
   </rule>

   <!-- Checking undefined contents for template/element @isClosed="true". Match context that we did not already match -->
   <rule fpi="RUL-QQQ"
         context="*[hl7:substanceAdministration[hl7:templateId[@root = '1.2.40.0.34.6.0.11.3.72'] and hl7:templateId[@root = '2.16.840.1.113883.10.20.1.24'] and hl7:templateId[@root = '1.3.6.1.4.1.19376.1.5.3.1.4.7'] and hl7:templateId[@root = '1.3.6.1.4.1.19376.1.9.1.3.16'] and hl7:templateId[@root = '1.3.6.1.4.1.19376.1.5.3.1.4.7.1']]]/hl7:substanceAdministration[hl7:templateId[@root = '1.2.40.0.34.6.0.11.3.72'] and hl7:templateId[@root = '2.16.840.1.113883.10.20.1.24'] and hl7:templateId[@root = '1.3.6.1.4.1.19376.1.5.3.1.4.7'] and hl7:templateId[@root = '1.3.6.1.4.1.19376.1.9.1.3.16'] and hl7:templateId[@root = '1.3.6.1.4.1.19376.1.5.3.1.4.7.1']]/hl7:consumable[hl7:manufacturedProduct[hl7:templateId[@root = '1.3.6.1.4.1.19376.1.5.3.1.4.7.2'] and hl7:templateId[@root = '2.16.840.1.113883.10.20.1.53']]]/*[not(@xsi:nil = 'true')][not(self::hl7:manufacturedProduct[hl7:templateId[@root = '1.3.6.1.4.1.19376.1.5.3.1.4.7.2'] and hl7:templateId[@root = '2.16.840.1.113883.10.20.1.53']])]"
         id="d41e47316-true-d3568348e0">
      <assert role="error"
              see="http://elga.art-decor.org/elgatgd-html-20240709T111220/tmp-1.2.40.0.34.6.0.11.3.72-2021-02-19T125222.html"
              test="not(.)">(atcdabbr_entry_MedikationsEinnahmeEntry)/d41e47316-true-d3568348e0: '<value-of select="name(..)"/>' ist als geschlossen definiert und dieses Element '<name/>' ist nicht erlaubt oder nicht mit diesem Inhalt erlaubt. Dies kann templateId, code oder id betreffen. Erwartet:  hl7:manufacturedProduct[hl7:templateId[@root = '1.3.6.1.4.1.19376.1.5.3.1.4.7.2'] and hl7:templateId[@root = '2.16.840.1.113883.10.20.1.53']] (rule-reference: d41e47316-true-d3568348e0)</assert>
   </rule>

   <!-- Checking undefined contents for template/element @isClosed="true". Match context that we did not already match -->
   <rule fpi="RUL-QQQ"
         context="*[hl7:substanceAdministration[hl7:templateId[@root = '1.2.40.0.34.6.0.11.3.72'] and hl7:templateId[@root = '2.16.840.1.113883.10.20.1.24'] and hl7:templateId[@root = '1.3.6.1.4.1.19376.1.5.3.1.4.7'] and hl7:templateId[@root = '1.3.6.1.4.1.19376.1.9.1.3.16'] and hl7:templateId[@root = '1.3.6.1.4.1.19376.1.5.3.1.4.7.1']]]/hl7:substanceAdministration[hl7:templateId[@root = '1.2.40.0.34.6.0.11.3.72'] and hl7:templateId[@root = '2.16.840.1.113883.10.20.1.24'] and hl7:templateId[@root = '1.3.6.1.4.1.19376.1.5.3.1.4.7'] and hl7:templateId[@root = '1.3.6.1.4.1.19376.1.9.1.3.16'] and hl7:templateId[@root = '1.3.6.1.4.1.19376.1.5.3.1.4.7.1']]/hl7:consumable[hl7:manufacturedProduct[hl7:templateId[@root = '1.3.6.1.4.1.19376.1.5.3.1.4.7.2'] and hl7:templateId[@root = '2.16.840.1.113883.10.20.1.53']]]/hl7:manufacturedProduct[hl7:templateId[@root = '1.3.6.1.4.1.19376.1.5.3.1.4.7.2'] and hl7:templateId[@root = '2.16.840.1.113883.10.20.1.53']]/*[not(@xsi:nil = 'true')][not(self::hl7:templateId[@root = '1.3.6.1.4.1.19376.1.5.3.1.4.7.2'] | self::hl7:templateId[@root = '2.16.840.1.113883.10.20.1.53'] | self::hl7:manufacturedMaterial[hl7:templateId[@root = '1.2.40.0.34.11.2.3.4'] and hl7:templateId[@root = '1.3.6.1.4.1.19376.1.9.1.3.1']])]"
         id="d3568330e50-true-d3568382e0">
      <assert role="error"
              see="http://elga.art-decor.org/elgatgd-html-20240709T111220/tmp-1.2.40.0.34.6.0.11.3.72-2021-02-19T125222.html"
              test="not(.)">(atcdabbr_entry_MedikationsEinnahmeEntry)/d3568330e50-true-d3568382e0: '<value-of select="name(..)"/>' ist als geschlossen definiert und dieses Element '<name/>' ist nicht erlaubt oder nicht mit diesem Inhalt erlaubt. Dies kann templateId, code oder id betreffen. Erwartet:  hl7:templateId[@root = '1.3.6.1.4.1.19376.1.5.3.1.4.7.2'] | hl7:templateId[@root = '2.16.840.1.113883.10.20.1.53'] | hl7:manufacturedMaterial[hl7:templateId[@root = '1.2.40.0.34.11.2.3.4'] and hl7:templateId[@root = '1.3.6.1.4.1.19376.1.9.1.3.1']] (rule-reference: d3568330e50-true-d3568382e0)</assert>
   </rule>

   <!-- Checking undefined contents for template/element @isClosed="true". Match context that we did not already match -->
   <rule fpi="RUL-QQQ"
         context="*[hl7:substanceAdministration[hl7:templateId[@root = '1.2.40.0.34.6.0.11.3.72'] and hl7:templateId[@root = '2.16.840.1.113883.10.20.1.24'] and hl7:templateId[@root = '1.3.6.1.4.1.19376.1.5.3.1.4.7'] and hl7:templateId[@root = '1.3.6.1.4.1.19376.1.9.1.3.16'] and hl7:templateId[@root = '1.3.6.1.4.1.19376.1.5.3.1.4.7.1']]]/hl7:substanceAdministration[hl7:templateId[@root = '1.2.40.0.34.6.0.11.3.72'] and hl7:templateId[@root = '2.16.840.1.113883.10.20.1.24'] and hl7:templateId[@root = '1.3.6.1.4.1.19376.1.5.3.1.4.7'] and hl7:templateId[@root = '1.3.6.1.4.1.19376.1.9.1.3.16'] and hl7:templateId[@root = '1.3.6.1.4.1.19376.1.5.3.1.4.7.1']]/hl7:consumable[hl7:manufacturedProduct[hl7:templateId[@root = '1.3.6.1.4.1.19376.1.5.3.1.4.7.2'] and hl7:templateId[@root = '2.16.840.1.113883.10.20.1.53']]]/hl7:manufacturedProduct[hl7:templateId[@root = '1.3.6.1.4.1.19376.1.5.3.1.4.7.2'] and hl7:templateId[@root = '2.16.840.1.113883.10.20.1.53']]/hl7:manufacturedMaterial[hl7:templateId[@root = '1.2.40.0.34.11.2.3.4'] and hl7:templateId[@root = '1.3.6.1.4.1.19376.1.9.1.3.1']]/*[not(@xsi:nil = 'true')][not(self::hl7:templateId[@root = '1.2.40.0.34.11.2.3.4'] | self::hl7:templateId[@root = '1.3.6.1.4.1.19376.1.9.1.3.1'] | self::hl7:code[@codeSystem = '1.2.40.0.34.4.16' or @codeSystem = '1.2.40.0.34.4.17' or @nullFlavor] | self::hl7:name | self::pharm:formCode[@codeSystem = '1.2.40.0.10.1.4.3.4.3.5' or @nullFlavor] | self::pharm:asContent[@classCode = 'CONT'][pharm:containerPackagedMedicine[@classCode = 'CONT'][@determinerCode = 'INSTANCE']] | self::pharm:ingredient[@classCode = 'ACTI'][pharm:ingredient[@classCode = 'MMAT'][@determinerCode = 'KIND']])]"
         id="d3568330e64-true-d3568448e0">
      <assert role="error"
              see="http://elga.art-decor.org/elgatgd-html-20240709T111220/tmp-1.2.40.0.34.6.0.11.3.72-2021-02-19T125222.html"
              test="not(.)">(atcdabbr_entry_MedikationsEinnahmeEntry)/d3568330e64-true-d3568448e0: '<value-of select="name(..)"/>' ist als geschlossen definiert und dieses Element '<name/>' ist nicht erlaubt oder nicht mit diesem Inhalt erlaubt. Dies kann templateId, code oder id betreffen. Erwartet:  hl7:templateId[@root = '1.2.40.0.34.11.2.3.4'] | hl7:templateId[@root = '1.3.6.1.4.1.19376.1.9.1.3.1'] | hl7:code[@codeSystem = '1.2.40.0.34.4.16' or @codeSystem = '1.2.40.0.34.4.17' or @nullFlavor] | hl7:name | pharm:formCode[@codeSystem = '1.2.40.0.10.1.4.3.4.3.5' or @nullFlavor] | pharm:asContent[@classCode = 'CONT'][pharm:containerPackagedMedicine[@classCode = 'CONT'][@determinerCode = 'INSTANCE']] | pharm:ingredient[@classCode = 'ACTI'][pharm:ingredient[@classCode = 'MMAT'][@determinerCode = 'KIND']] (rule-reference: d3568330e64-true-d3568448e0)</assert>
   </rule>

   <!-- Checking undefined contents for template/element @isClosed="true". Match context that we did not already match -->
   <rule fpi="RUL-QQQ"
         context="*[hl7:substanceAdministration[hl7:templateId[@root = '1.2.40.0.34.6.0.11.3.72'] and hl7:templateId[@root = '2.16.840.1.113883.10.20.1.24'] and hl7:templateId[@root = '1.3.6.1.4.1.19376.1.5.3.1.4.7'] and hl7:templateId[@root = '1.3.6.1.4.1.19376.1.9.1.3.16'] and hl7:templateId[@root = '1.3.6.1.4.1.19376.1.5.3.1.4.7.1']]]/hl7:substanceAdministration[hl7:templateId[@root = '1.2.40.0.34.6.0.11.3.72'] and hl7:templateId[@root = '2.16.840.1.113883.10.20.1.24'] and hl7:templateId[@root = '1.3.6.1.4.1.19376.1.5.3.1.4.7'] and hl7:templateId[@root = '1.3.6.1.4.1.19376.1.9.1.3.16'] and hl7:templateId[@root = '1.3.6.1.4.1.19376.1.5.3.1.4.7.1']]/hl7:consumable[hl7:manufacturedProduct[hl7:templateId[@root = '1.3.6.1.4.1.19376.1.5.3.1.4.7.2'] and hl7:templateId[@root = '2.16.840.1.113883.10.20.1.53']]]/hl7:manufacturedProduct[hl7:templateId[@root = '1.3.6.1.4.1.19376.1.5.3.1.4.7.2'] and hl7:templateId[@root = '2.16.840.1.113883.10.20.1.53']]/hl7:manufacturedMaterial[hl7:templateId[@root = '1.2.40.0.34.11.2.3.4'] and hl7:templateId[@root = '1.3.6.1.4.1.19376.1.9.1.3.1']]/hl7:code[@codeSystem = '1.2.40.0.34.4.16' or @codeSystem = '1.2.40.0.34.4.17' or @nullFlavor]/*[not(@xsi:nil = 'true')][not(self::hl7:originalText | self::hl7:translation[@codeSystem = '1.2.40.0.34.4.17' or @nullFlavor])]"
         id="d3568330e80-true-d3568482e0">
      <assert role="error"
              see="http://elga.art-decor.org/elgatgd-html-20240709T111220/tmp-1.2.40.0.34.6.0.11.3.72-2021-02-19T125222.html"
              test="not(.)">(atcdabbr_entry_MedikationsEinnahmeEntry)/d3568330e80-true-d3568482e0: '<value-of select="name(..)"/>' ist als geschlossen definiert und dieses Element '<name/>' ist nicht erlaubt oder nicht mit diesem Inhalt erlaubt. Dies kann templateId, code oder id betreffen. Erwartet:  hl7:originalText | hl7:translation[@codeSystem = '1.2.40.0.34.4.17' or @nullFlavor] (rule-reference: d3568330e80-true-d3568482e0)</assert>
   </rule>

   <!-- Checking undefined contents for template/element @isClosed="true". Match context that we did not already match -->
   <rule fpi="RUL-QQQ"
         context="*[hl7:substanceAdministration[hl7:templateId[@root = '1.2.40.0.34.6.0.11.3.72'] and hl7:templateId[@root = '2.16.840.1.113883.10.20.1.24'] and hl7:templateId[@root = '1.3.6.1.4.1.19376.1.5.3.1.4.7'] and hl7:templateId[@root = '1.3.6.1.4.1.19376.1.9.1.3.16'] and hl7:templateId[@root = '1.3.6.1.4.1.19376.1.5.3.1.4.7.1']]]/hl7:substanceAdministration[hl7:templateId[@root = '1.2.40.0.34.6.0.11.3.72'] and hl7:templateId[@root = '2.16.840.1.113883.10.20.1.24'] and hl7:templateId[@root = '1.3.6.1.4.1.19376.1.5.3.1.4.7'] and hl7:templateId[@root = '1.3.6.1.4.1.19376.1.9.1.3.16'] and hl7:templateId[@root = '1.3.6.1.4.1.19376.1.5.3.1.4.7.1']]/hl7:consumable[hl7:manufacturedProduct[hl7:templateId[@root = '1.3.6.1.4.1.19376.1.5.3.1.4.7.2'] and hl7:templateId[@root = '2.16.840.1.113883.10.20.1.53']]]/hl7:manufacturedProduct[hl7:templateId[@root = '1.3.6.1.4.1.19376.1.5.3.1.4.7.2'] and hl7:templateId[@root = '2.16.840.1.113883.10.20.1.53']]/hl7:manufacturedMaterial[hl7:templateId[@root = '1.2.40.0.34.11.2.3.4'] and hl7:templateId[@root = '1.3.6.1.4.1.19376.1.9.1.3.1']]/pharm:asContent[@classCode = 'CONT'][pharm:containerPackagedMedicine[@classCode = 'CONT'][@determinerCode = 'INSTANCE']]/*[not(@xsi:nil = 'true')][not(self::pharm:containerPackagedMedicine[not(@nullFlavor)][@classCode = 'CONT'][@determinerCode = 'INSTANCE'])]"
         id="d3568330e258-true-d3568518e0">
      <assert role="error"
              see="http://elga.art-decor.org/elgatgd-html-20240709T111220/tmp-1.2.40.0.34.6.0.11.3.72-2021-02-19T125222.html"
              test="not(.)">(atcdabbr_entry_MedikationsEinnahmeEntry)/d3568330e258-true-d3568518e0: '<value-of select="name(..)"/>' ist als geschlossen definiert und dieses Element '<name/>' ist nicht erlaubt oder nicht mit diesem Inhalt erlaubt. Dies kann templateId, code oder id betreffen. Erwartet:  pharm:containerPackagedMedicine[not(@nullFlavor)][@classCode = 'CONT'][@determinerCode = 'INSTANCE'] (rule-reference: d3568330e258-true-d3568518e0)</assert>
   </rule>

   <!-- Checking undefined contents for template/element @isClosed="true". Match context that we did not already match -->
   <rule fpi="RUL-QQQ"
         context="*[hl7:substanceAdministration[hl7:templateId[@root = '1.2.40.0.34.6.0.11.3.72'] and hl7:templateId[@root = '2.16.840.1.113883.10.20.1.24'] and hl7:templateId[@root = '1.3.6.1.4.1.19376.1.5.3.1.4.7'] and hl7:templateId[@root = '1.3.6.1.4.1.19376.1.9.1.3.16'] and hl7:templateId[@root = '1.3.6.1.4.1.19376.1.5.3.1.4.7.1']]]/hl7:substanceAdministration[hl7:templateId[@root = '1.2.40.0.34.6.0.11.3.72'] and hl7:templateId[@root = '2.16.840.1.113883.10.20.1.24'] and hl7:templateId[@root = '1.3.6.1.4.1.19376.1.5.3.1.4.7'] and hl7:templateId[@root = '1.3.6.1.4.1.19376.1.9.1.3.16'] and hl7:templateId[@root = '1.3.6.1.4.1.19376.1.5.3.1.4.7.1']]/hl7:consumable[hl7:manufacturedProduct[hl7:templateId[@root = '1.3.6.1.4.1.19376.1.5.3.1.4.7.2'] and hl7:templateId[@root = '2.16.840.1.113883.10.20.1.53']]]/hl7:manufacturedProduct[hl7:templateId[@root = '1.3.6.1.4.1.19376.1.5.3.1.4.7.2'] and hl7:templateId[@root = '2.16.840.1.113883.10.20.1.53']]/hl7:manufacturedMaterial[hl7:templateId[@root = '1.2.40.0.34.11.2.3.4'] and hl7:templateId[@root = '1.3.6.1.4.1.19376.1.9.1.3.1']]/pharm:asContent[@classCode = 'CONT'][pharm:containerPackagedMedicine[@classCode = 'CONT'][@determinerCode = 'INSTANCE']]/pharm:containerPackagedMedicine[not(@nullFlavor)][@classCode = 'CONT'][@determinerCode = 'INSTANCE']/*[not(@xsi:nil = 'true')][not(self::pharm:capacityQuantity[not(@nullFlavor)])]"
         id="d3568330e271-true-d3568532e0">
      <assert role="error"
              see="http://elga.art-decor.org/elgatgd-html-20240709T111220/tmp-1.2.40.0.34.6.0.11.3.72-2021-02-19T125222.html"
              test="not(.)">(atcdabbr_entry_MedikationsEinnahmeEntry)/d3568330e271-true-d3568532e0: '<value-of select="name(..)"/>' ist als geschlossen definiert und dieses Element '<name/>' ist nicht erlaubt oder nicht mit diesem Inhalt erlaubt. Dies kann templateId, code oder id betreffen. Erwartet:  pharm:capacityQuantity[not(@nullFlavor)] (rule-reference: d3568330e271-true-d3568532e0)</assert>
   </rule>

   <!-- Checking undefined contents for template/element @isClosed="true". Match context that we did not already match -->
   <rule fpi="RUL-QQQ"
         context="*[hl7:substanceAdministration[hl7:templateId[@root = '1.2.40.0.34.6.0.11.3.72'] and hl7:templateId[@root = '2.16.840.1.113883.10.20.1.24'] and hl7:templateId[@root = '1.3.6.1.4.1.19376.1.5.3.1.4.7'] and hl7:templateId[@root = '1.3.6.1.4.1.19376.1.9.1.3.16'] and hl7:templateId[@root = '1.3.6.1.4.1.19376.1.5.3.1.4.7.1']]]/hl7:substanceAdministration[hl7:templateId[@root = '1.2.40.0.34.6.0.11.3.72'] and hl7:templateId[@root = '2.16.840.1.113883.10.20.1.24'] and hl7:templateId[@root = '1.3.6.1.4.1.19376.1.5.3.1.4.7'] and hl7:templateId[@root = '1.3.6.1.4.1.19376.1.9.1.3.16'] and hl7:templateId[@root = '1.3.6.1.4.1.19376.1.5.3.1.4.7.1']]/hl7:consumable[hl7:manufacturedProduct[hl7:templateId[@root = '1.3.6.1.4.1.19376.1.5.3.1.4.7.2'] and hl7:templateId[@root = '2.16.840.1.113883.10.20.1.53']]]/hl7:manufacturedProduct[hl7:templateId[@root = '1.3.6.1.4.1.19376.1.5.3.1.4.7.2'] and hl7:templateId[@root = '2.16.840.1.113883.10.20.1.53']]/hl7:manufacturedMaterial[hl7:templateId[@root = '1.2.40.0.34.11.2.3.4'] and hl7:templateId[@root = '1.3.6.1.4.1.19376.1.9.1.3.1']]/pharm:ingredient[@classCode = 'ACTI'][pharm:ingredient[@classCode = 'MMAT'][@determinerCode = 'KIND']]/*[not(@xsi:nil = 'true')][not(self::pharm:ingredient[not(@nullFlavor)][@classCode = 'MMAT'][@determinerCode = 'KIND'])]"
         id="d3568330e304-true-d3568551e0">
      <assert role="error"
              see="http://elga.art-decor.org/elgatgd-html-20240709T111220/tmp-1.2.40.0.34.6.0.11.3.72-2021-02-19T125222.html"
              test="not(.)">(atcdabbr_entry_MedikationsEinnahmeEntry)/d3568330e304-true-d3568551e0: '<value-of select="name(..)"/>' ist als geschlossen definiert und dieses Element '<name/>' ist nicht erlaubt oder nicht mit diesem Inhalt erlaubt. Dies kann templateId, code oder id betreffen. Erwartet:  pharm:ingredient[not(@nullFlavor)][@classCode = 'MMAT'][@determinerCode = 'KIND'] (rule-reference: d3568330e304-true-d3568551e0)</assert>
   </rule>

   <!-- Checking undefined contents for template/element @isClosed="true". Match context that we did not already match -->
   <rule fpi="RUL-QQQ"
         context="*[hl7:substanceAdministration[hl7:templateId[@root = '1.2.40.0.34.6.0.11.3.72'] and hl7:templateId[@root = '2.16.840.1.113883.10.20.1.24'] and hl7:templateId[@root = '1.3.6.1.4.1.19376.1.5.3.1.4.7'] and hl7:templateId[@root = '1.3.6.1.4.1.19376.1.9.1.3.16'] and hl7:templateId[@root = '1.3.6.1.4.1.19376.1.5.3.1.4.7.1']]]/hl7:substanceAdministration[hl7:templateId[@root = '1.2.40.0.34.6.0.11.3.72'] and hl7:templateId[@root = '2.16.840.1.113883.10.20.1.24'] and hl7:templateId[@root = '1.3.6.1.4.1.19376.1.5.3.1.4.7'] and hl7:templateId[@root = '1.3.6.1.4.1.19376.1.9.1.3.16'] and hl7:templateId[@root = '1.3.6.1.4.1.19376.1.5.3.1.4.7.1']]/hl7:consumable[hl7:manufacturedProduct[hl7:templateId[@root = '1.3.6.1.4.1.19376.1.5.3.1.4.7.2'] and hl7:templateId[@root = '2.16.840.1.113883.10.20.1.53']]]/hl7:manufacturedProduct[hl7:templateId[@root = '1.3.6.1.4.1.19376.1.5.3.1.4.7.2'] and hl7:templateId[@root = '2.16.840.1.113883.10.20.1.53']]/hl7:manufacturedMaterial[hl7:templateId[@root = '1.2.40.0.34.11.2.3.4'] and hl7:templateId[@root = '1.3.6.1.4.1.19376.1.9.1.3.1']]/pharm:ingredient[@classCode = 'ACTI'][pharm:ingredient[@classCode = 'MMAT'][@determinerCode = 'KIND']]/pharm:ingredient[not(@nullFlavor)][@classCode = 'MMAT'][@determinerCode = 'KIND']/*[not(@xsi:nil = 'true')][not(self::pharm:code[@codeSystem = '2.16.840.1.113883.6.73' or @codeSystem = '1.2.40.0.34.5.156' or @nullFlavor] | self::pharm:name[not(@nullFlavor)])]"
         id="d3568330e340-true-d3568572e0">
      <assert role="error"
              see="http://elga.art-decor.org/elgatgd-html-20240709T111220/tmp-1.2.40.0.34.6.0.11.3.72-2021-02-19T125222.html"
              test="not(.)">(atcdabbr_entry_MedikationsEinnahmeEntry)/d3568330e340-true-d3568572e0: '<value-of select="name(..)"/>' ist als geschlossen definiert und dieses Element '<name/>' ist nicht erlaubt oder nicht mit diesem Inhalt erlaubt. Dies kann templateId, code oder id betreffen. Erwartet:  pharm:code[@codeSystem = '2.16.840.1.113883.6.73' or @codeSystem = '1.2.40.0.34.5.156' or @nullFlavor] | pharm:name[not(@nullFlavor)] (rule-reference: d3568330e340-true-d3568572e0)</assert>
   </rule>

   <!-- Checking undefined contents for template/element @isClosed="true". Match context that we did not already match -->
   <rule fpi="RUL-QQQ"
         context="*[hl7:substanceAdministration[hl7:templateId[@root = '1.2.40.0.34.6.0.11.3.72'] and hl7:templateId[@root = '2.16.840.1.113883.10.20.1.24'] and hl7:templateId[@root = '1.3.6.1.4.1.19376.1.5.3.1.4.7'] and hl7:templateId[@root = '1.3.6.1.4.1.19376.1.9.1.3.16'] and hl7:templateId[@root = '1.3.6.1.4.1.19376.1.5.3.1.4.7.1']]]/hl7:substanceAdministration[hl7:templateId[@root = '1.2.40.0.34.6.0.11.3.72'] and hl7:templateId[@root = '2.16.840.1.113883.10.20.1.24'] and hl7:templateId[@root = '1.3.6.1.4.1.19376.1.5.3.1.4.7'] and hl7:templateId[@root = '1.3.6.1.4.1.19376.1.9.1.3.16'] and hl7:templateId[@root = '1.3.6.1.4.1.19376.1.5.3.1.4.7.1']]/hl7:consumable[hl7:manufacturedProduct[hl7:templateId[@root = '1.3.6.1.4.1.19376.1.5.3.1.4.7.2'] and hl7:templateId[@root = '2.16.840.1.113883.10.20.1.53']]]/hl7:manufacturedProduct[hl7:templateId[@root = '1.3.6.1.4.1.19376.1.5.3.1.4.7.2'] and hl7:templateId[@root = '2.16.840.1.113883.10.20.1.53']]/hl7:manufacturedMaterial[hl7:templateId[@root = '1.2.40.0.34.11.2.3.4'] and hl7:templateId[@root = '1.3.6.1.4.1.19376.1.9.1.3.1']]/pharm:ingredient[@classCode = 'ACTI'][pharm:ingredient[@classCode = 'MMAT'][@determinerCode = 'KIND']]/pharm:ingredient[not(@nullFlavor)][@classCode = 'MMAT'][@determinerCode = 'KIND']/pharm:code[@codeSystem = '2.16.840.1.113883.6.73' or @codeSystem = '1.2.40.0.34.5.156' or @nullFlavor]/*[not(@xsi:nil = 'true')][not(self::hl7:originalText | self::hl7:translation)]"
         id="d3568330e349-true-d3568592e0">
      <assert role="error"
              see="http://elga.art-decor.org/elgatgd-html-20240709T111220/tmp-1.2.40.0.34.6.0.11.3.72-2021-02-19T125222.html"
              test="not(.)">(atcdabbr_entry_MedikationsEinnahmeEntry)/d3568330e349-true-d3568592e0: '<value-of select="name(..)"/>' ist als geschlossen definiert und dieses Element '<name/>' ist nicht erlaubt oder nicht mit diesem Inhalt erlaubt. Dies kann templateId, code oder id betreffen. Erwartet:  hl7:originalText | hl7:translation (rule-reference: d3568330e349-true-d3568592e0)</assert>
   </rule>

   <!-- Checking undefined contents for template/element @isClosed="true". Match context that we did not already match -->
   <rule fpi="RUL-QQQ"
         context="*[hl7:substanceAdministration[hl7:templateId[@root = '1.2.40.0.34.6.0.11.3.72'] and hl7:templateId[@root = '2.16.840.1.113883.10.20.1.24'] and hl7:templateId[@root = '1.3.6.1.4.1.19376.1.5.3.1.4.7'] and hl7:templateId[@root = '1.3.6.1.4.1.19376.1.9.1.3.16'] and hl7:templateId[@root = '1.3.6.1.4.1.19376.1.5.3.1.4.7.1']]]/hl7:substanceAdministration[hl7:templateId[@root = '1.2.40.0.34.6.0.11.3.72'] and hl7:templateId[@root = '2.16.840.1.113883.10.20.1.24'] and hl7:templateId[@root = '1.3.6.1.4.1.19376.1.5.3.1.4.7'] and hl7:templateId[@root = '1.3.6.1.4.1.19376.1.9.1.3.16'] and hl7:templateId[@root = '1.3.6.1.4.1.19376.1.5.3.1.4.7.1']]/hl7:author[hl7:assignedAuthor]/*[not(@xsi:nil = 'true')][not(self::hl7:functionCode | self::hl7:time[not(@nullFlavor)] | self::hl7:time[@nullFlavor='UNK'] | self::hl7:assignedAuthor)]"
         id="d41e47367-true-d3568734e0">
      <assert role="error"
              see="http://elga.art-decor.org/elgatgd-html-20240709T111220/tmp-1.2.40.0.34.6.0.11.3.72-2021-02-19T125222.html"
              test="not(.)">(atcdabbr_entry_MedikationsEinnahmeEntry)/d41e47367-true-d3568734e0: '<value-of select="name(..)"/>' ist als geschlossen definiert und dieses Element '<name/>' ist nicht erlaubt oder nicht mit diesem Inhalt erlaubt. Dies kann templateId, code oder id betreffen. Erwartet:  hl7:functionCode | hl7:time[not(@nullFlavor)] | hl7:time[@nullFlavor='UNK'] | hl7:assignedAuthor (rule-reference: d41e47367-true-d3568734e0)</assert>
   </rule>

   <!-- Checking undefined contents for template/element @isClosed="true". Match context that we did not already match -->
   <rule fpi="RUL-QQQ"
         context="*[hl7:substanceAdministration[hl7:templateId[@root = '1.2.40.0.34.6.0.11.3.72'] and hl7:templateId[@root = '2.16.840.1.113883.10.20.1.24'] and hl7:templateId[@root = '1.3.6.1.4.1.19376.1.5.3.1.4.7'] and hl7:templateId[@root = '1.3.6.1.4.1.19376.1.9.1.3.16'] and hl7:templateId[@root = '1.3.6.1.4.1.19376.1.5.3.1.4.7.1']]]/hl7:substanceAdministration[hl7:templateId[@root = '1.2.40.0.34.6.0.11.3.72'] and hl7:templateId[@root = '2.16.840.1.113883.10.20.1.24'] and hl7:templateId[@root = '1.3.6.1.4.1.19376.1.5.3.1.4.7'] and hl7:templateId[@root = '1.3.6.1.4.1.19376.1.9.1.3.16'] and hl7:templateId[@root = '1.3.6.1.4.1.19376.1.5.3.1.4.7.1']]/hl7:author[hl7:assignedAuthor]/hl7:assignedAuthor/*[not(@xsi:nil = 'true')][not(self::hl7:id[not(@nullFlavor)] | self::hl7:id[@nullFlavor='UNK'] | self::hl7:code[not(@nullFlavor)] | self::hl7:addr[not(@nullFlavor)] | self::hl7:telecom[not(@nullFlavor)] | self::hl7:assignedPerson | self::hl7:assignedAuthoringDevice | self::hl7:representedOrganization)]"
         id="d3568612e45-true-d3568842e0">
      <assert role="error"
              see="http://elga.art-decor.org/elgatgd-html-20240709T111220/tmp-1.2.40.0.34.6.0.11.3.72-2021-02-19T125222.html"
              test="not(.)">(atcdabbr_entry_MedikationsEinnahmeEntry)/d3568612e45-true-d3568842e0: '<value-of select="name(..)"/>' ist als geschlossen definiert und dieses Element '<name/>' ist nicht erlaubt oder nicht mit diesem Inhalt erlaubt. Dies kann templateId, code oder id betreffen. Erwartet:  hl7:id[not(@nullFlavor)] | hl7:id[@nullFlavor='UNK'] | hl7:code[not(@nullFlavor)] | hl7:addr[not(@nullFlavor)] | hl7:telecom[not(@nullFlavor)] | hl7:assignedPerson | hl7:assignedAuthoringDevice | hl7:representedOrganization (rule-reference: d3568612e45-true-d3568842e0)</assert>
   </rule>

   <!-- Checking undefined contents for template/element @isClosed="true". Match context that we did not already match -->
   <rule fpi="RUL-QQQ"
         context="*[hl7:substanceAdministration[hl7:templateId[@root = '1.2.40.0.34.6.0.11.3.72'] and hl7:templateId[@root = '2.16.840.1.113883.10.20.1.24'] and hl7:templateId[@root = '1.3.6.1.4.1.19376.1.5.3.1.4.7'] and hl7:templateId[@root = '1.3.6.1.4.1.19376.1.9.1.3.16'] and hl7:templateId[@root = '1.3.6.1.4.1.19376.1.5.3.1.4.7.1']]]/hl7:substanceAdministration[hl7:templateId[@root = '1.2.40.0.34.6.0.11.3.72'] and hl7:templateId[@root = '2.16.840.1.113883.10.20.1.24'] and hl7:templateId[@root = '1.3.6.1.4.1.19376.1.5.3.1.4.7'] and hl7:templateId[@root = '1.3.6.1.4.1.19376.1.9.1.3.16'] and hl7:templateId[@root = '1.3.6.1.4.1.19376.1.5.3.1.4.7.1']]/hl7:author[hl7:assignedAuthor]/hl7:assignedAuthor/hl7:addr[not(@nullFlavor)]/*[not(@xsi:nil = 'true')][not(self::hl7:streetAddressLine | self::hl7:streetName | self::hl7:houseNumber | self::hl7:postalCode[not(@nullFlavor)] | self::hl7:city[not(@nullFlavor)] | self::hl7:state | self::hl7:country[not(@nullFlavor)] | self::hl7:additionalLocator)]"
         id="d3568612e64-true-d3568901e0">
      <assert role="error"
              see="http://elga.art-decor.org/elgatgd-html-20240709T111220/tmp-1.2.40.0.34.6.0.11.3.72-2021-02-19T125222.html"
              test="not(.)">(atcdabbr_entry_MedikationsEinnahmeEntry)/d3568612e64-true-d3568901e0: '<value-of select="name(..)"/>' ist als geschlossen definiert und dieses Element '<name/>' ist nicht erlaubt oder nicht mit diesem Inhalt erlaubt. Dies kann templateId, code oder id betreffen. Erwartet:  hl7:streetAddressLine | hl7:streetName | hl7:houseNumber | hl7:postalCode[not(@nullFlavor)] | hl7:city[not(@nullFlavor)] | hl7:state | hl7:country[not(@nullFlavor)] | hl7:additionalLocator (rule-reference: d3568612e64-true-d3568901e0)</assert>
   </rule>

   <!-- Checking undefined contents for template/element @isClosed="true". Match context that we did not already match -->
   <rule fpi="RUL-QQQ"
         context="*[hl7:substanceAdministration[hl7:templateId[@root = '1.2.40.0.34.6.0.11.3.72'] and hl7:templateId[@root = '2.16.840.1.113883.10.20.1.24'] and hl7:templateId[@root = '1.3.6.1.4.1.19376.1.5.3.1.4.7'] and hl7:templateId[@root = '1.3.6.1.4.1.19376.1.9.1.3.16'] and hl7:templateId[@root = '1.3.6.1.4.1.19376.1.5.3.1.4.7.1']]]/hl7:substanceAdministration[hl7:templateId[@root = '1.2.40.0.34.6.0.11.3.72'] and hl7:templateId[@root = '2.16.840.1.113883.10.20.1.24'] and hl7:templateId[@root = '1.3.6.1.4.1.19376.1.5.3.1.4.7'] and hl7:templateId[@root = '1.3.6.1.4.1.19376.1.9.1.3.16'] and hl7:templateId[@root = '1.3.6.1.4.1.19376.1.5.3.1.4.7.1']]/hl7:author[hl7:assignedAuthor]/hl7:assignedAuthor/hl7:assignedPerson/*[not(@xsi:nil = 'true')][not(self::hl7:name[not(@nullFlavor)] | self::hl7:name[@nullFlavor='UNK'] | self::hl7:name[@nullFlavor='MSK'])]"
         id="d3568612e110-true-d3568958e0">
      <assert role="error"
              see="http://elga.art-decor.org/elgatgd-html-20240709T111220/tmp-1.2.40.0.34.6.0.11.3.72-2021-02-19T125222.html"
              test="not(.)">(atcdabbr_entry_MedikationsEinnahmeEntry)/d3568612e110-true-d3568958e0: '<value-of select="name(..)"/>' ist als geschlossen definiert und dieses Element '<name/>' ist nicht erlaubt oder nicht mit diesem Inhalt erlaubt. Dies kann templateId, code oder id betreffen. Erwartet:  hl7:name[not(@nullFlavor)] | hl7:name[@nullFlavor='UNK'] | hl7:name[@nullFlavor='MSK'] (rule-reference: d3568612e110-true-d3568958e0)</assert>
   </rule>

   <!-- Checking undefined contents for template/element @isClosed="true". Match context that we did not already match -->
   <rule fpi="RUL-QQQ"
         context="*[hl7:substanceAdministration[hl7:templateId[@root = '1.2.40.0.34.6.0.11.3.72'] and hl7:templateId[@root = '2.16.840.1.113883.10.20.1.24'] and hl7:templateId[@root = '1.3.6.1.4.1.19376.1.5.3.1.4.7'] and hl7:templateId[@root = '1.3.6.1.4.1.19376.1.9.1.3.16'] and hl7:templateId[@root = '1.3.6.1.4.1.19376.1.5.3.1.4.7.1']]]/hl7:substanceAdministration[hl7:templateId[@root = '1.2.40.0.34.6.0.11.3.72'] and hl7:templateId[@root = '2.16.840.1.113883.10.20.1.24'] and hl7:templateId[@root = '1.3.6.1.4.1.19376.1.5.3.1.4.7'] and hl7:templateId[@root = '1.3.6.1.4.1.19376.1.9.1.3.16'] and hl7:templateId[@root = '1.3.6.1.4.1.19376.1.5.3.1.4.7.1']]/hl7:author[hl7:assignedAuthor]/hl7:assignedAuthor/hl7:assignedPerson/hl7:name[not(@nullFlavor)]/*[not(@xsi:nil = 'true')][not(self::hl7:prefix | self::hl7:family[not(@nullFlavor)] | self::hl7:given[not(@nullFlavor)] | self::hl7:suffix)]"
         id="d3568962e92-true-d3568992e0">
      <assert role="error"
              see="http://elga.art-decor.org/elgatgd-html-20240709T111220/tmp-1.2.40.0.34.6.0.11.9.6-2023-03-31T111555.html"
              test="not(.)">(atcdabbr_other_PersonNameCompilationG2)/d3568962e92-true-d3568992e0: '<value-of select="name(..)"/>' ist als geschlossen definiert und dieses Element '<name/>' ist nicht erlaubt oder nicht mit diesem Inhalt erlaubt. Dies kann templateId, code oder id betreffen. Erwartet:  hl7:prefix | hl7:family[not(@nullFlavor)] | hl7:given[not(@nullFlavor)] | hl7:suffix (rule-reference: d3568962e92-true-d3568992e0)</assert>
   </rule>

   <!-- Checking undefined contents for template/element @isClosed="true". Match context that we did not already match -->
   <rule fpi="RUL-QQQ"
         context="*[hl7:substanceAdministration[hl7:templateId[@root = '1.2.40.0.34.6.0.11.3.72'] and hl7:templateId[@root = '2.16.840.1.113883.10.20.1.24'] and hl7:templateId[@root = '1.3.6.1.4.1.19376.1.5.3.1.4.7'] and hl7:templateId[@root = '1.3.6.1.4.1.19376.1.9.1.3.16'] and hl7:templateId[@root = '1.3.6.1.4.1.19376.1.5.3.1.4.7.1']]]/hl7:substanceAdministration[hl7:templateId[@root = '1.2.40.0.34.6.0.11.3.72'] and hl7:templateId[@root = '2.16.840.1.113883.10.20.1.24'] and hl7:templateId[@root = '1.3.6.1.4.1.19376.1.5.3.1.4.7'] and hl7:templateId[@root = '1.3.6.1.4.1.19376.1.9.1.3.16'] and hl7:templateId[@root = '1.3.6.1.4.1.19376.1.5.3.1.4.7.1']]/hl7:author[hl7:assignedAuthor]/hl7:assignedAuthor/hl7:assignedAuthoringDevice/*[not(@xsi:nil = 'true')][not(self::hl7:manufacturerModelName[not(@nullFlavor)] | self::hl7:softwareName[not(@nullFlavor)])]"
         id="d3568612e133-true-d3569040e0">
      <assert role="error"
              see="http://elga.art-decor.org/elgatgd-html-20240709T111220/tmp-1.2.40.0.34.6.0.11.3.72-2021-02-19T125222.html"
              test="not(.)">(atcdabbr_entry_MedikationsEinnahmeEntry)/d3568612e133-true-d3569040e0: '<value-of select="name(..)"/>' ist als geschlossen definiert und dieses Element '<name/>' ist nicht erlaubt oder nicht mit diesem Inhalt erlaubt. Dies kann templateId, code oder id betreffen. Erwartet:  hl7:manufacturerModelName[not(@nullFlavor)] | hl7:softwareName[not(@nullFlavor)] (rule-reference: d3568612e133-true-d3569040e0)</assert>
   </rule>

   <!-- Checking undefined contents for template/element @isClosed="true". Match context that we did not already match -->
   <rule fpi="RUL-QQQ"
         context="*[hl7:substanceAdministration[hl7:templateId[@root = '1.2.40.0.34.6.0.11.3.72'] and hl7:templateId[@root = '2.16.840.1.113883.10.20.1.24'] and hl7:templateId[@root = '1.3.6.1.4.1.19376.1.5.3.1.4.7'] and hl7:templateId[@root = '1.3.6.1.4.1.19376.1.9.1.3.16'] and hl7:templateId[@root = '1.3.6.1.4.1.19376.1.5.3.1.4.7.1']]]/hl7:substanceAdministration[hl7:templateId[@root = '1.2.40.0.34.6.0.11.3.72'] and hl7:templateId[@root = '2.16.840.1.113883.10.20.1.24'] and hl7:templateId[@root = '1.3.6.1.4.1.19376.1.5.3.1.4.7'] and hl7:templateId[@root = '1.3.6.1.4.1.19376.1.9.1.3.16'] and hl7:templateId[@root = '1.3.6.1.4.1.19376.1.5.3.1.4.7.1']]/hl7:author[hl7:assignedAuthor]/hl7:assignedAuthor/hl7:representedOrganization/*[not(@xsi:nil = 'true')][not(self::hl7:id[not(@nullFlavor)] | self::hl7:name[not(@nullFlavor)] | self::hl7:telecom[not(@nullFlavor)] | self::hl7:addr[not(@nullFlavor)])]"
         id="d3568612e149-true-d3569085e0">
      <assert role="error"
              see="http://elga.art-decor.org/elgatgd-html-20240709T111220/tmp-1.2.40.0.34.6.0.11.3.72-2021-02-19T125222.html"
              test="not(.)">(atcdabbr_entry_MedikationsEinnahmeEntry)/d3568612e149-true-d3569085e0: '<value-of select="name(..)"/>' ist als geschlossen definiert und dieses Element '<name/>' ist nicht erlaubt oder nicht mit diesem Inhalt erlaubt. Dies kann templateId, code oder id betreffen. Erwartet:  hl7:id[not(@nullFlavor)] | hl7:name[not(@nullFlavor)] | hl7:telecom[not(@nullFlavor)] | hl7:addr[not(@nullFlavor)] (rule-reference: d3568612e149-true-d3569085e0)</assert>
   </rule>

   <!-- Checking undefined contents for template/element @isClosed="true". Match context that we did not already match -->
   <rule fpi="RUL-QQQ"
         context="*[hl7:substanceAdministration[hl7:templateId[@root = '1.2.40.0.34.6.0.11.3.72'] and hl7:templateId[@root = '2.16.840.1.113883.10.20.1.24'] and hl7:templateId[@root = '1.3.6.1.4.1.19376.1.5.3.1.4.7'] and hl7:templateId[@root = '1.3.6.1.4.1.19376.1.9.1.3.16'] and hl7:templateId[@root = '1.3.6.1.4.1.19376.1.5.3.1.4.7.1']]]/hl7:substanceAdministration[hl7:templateId[@root = '1.2.40.0.34.6.0.11.3.72'] and hl7:templateId[@root = '2.16.840.1.113883.10.20.1.24'] and hl7:templateId[@root = '1.3.6.1.4.1.19376.1.5.3.1.4.7'] and hl7:templateId[@root = '1.3.6.1.4.1.19376.1.9.1.3.16'] and hl7:templateId[@root = '1.3.6.1.4.1.19376.1.5.3.1.4.7.1']]/hl7:author[hl7:assignedAuthor]/hl7:assignedAuthor/hl7:representedOrganization/hl7:addr[not(@nullFlavor)]/*[not(@xsi:nil = 'true')][not(self::hl7:streetAddressLine | self::hl7:streetName | self::hl7:houseNumber | self::hl7:postalCode[not(@nullFlavor)] | self::hl7:city[not(@nullFlavor)] | self::hl7:state | self::hl7:country[not(@nullFlavor)] | self::hl7:additionalLocator)]"
         id="d3569055e67-true-d3569148e0">
      <assert role="error"
              see="http://elga.art-decor.org/elgatgd-html-20240709T111220/tmp-1.2.40.0.34.6.0.11.3.72-2021-02-19T125222.html"
              test="not(.)">(atcdabbr_entry_MedikationsEinnahmeEntry)/d3569055e67-true-d3569148e0: '<value-of select="name(..)"/>' ist als geschlossen definiert und dieses Element '<name/>' ist nicht erlaubt oder nicht mit diesem Inhalt erlaubt. Dies kann templateId, code oder id betreffen. Erwartet:  hl7:streetAddressLine | hl7:streetName | hl7:houseNumber | hl7:postalCode[not(@nullFlavor)] | hl7:city[not(@nullFlavor)] | hl7:state | hl7:country[not(@nullFlavor)] | hl7:additionalLocator (rule-reference: d3569055e67-true-d3569148e0)</assert>
   </rule>

   <!-- Checking undefined contents for template/element @isClosed="true". Match context that we did not already match -->
   <rule fpi="RUL-QQQ"
         context="*[hl7:substanceAdministration[hl7:templateId[@root = '1.2.40.0.34.6.0.11.3.72'] and hl7:templateId[@root = '2.16.840.1.113883.10.20.1.24'] and hl7:templateId[@root = '1.3.6.1.4.1.19376.1.5.3.1.4.7'] and hl7:templateId[@root = '1.3.6.1.4.1.19376.1.9.1.3.16'] and hl7:templateId[@root = '1.3.6.1.4.1.19376.1.5.3.1.4.7.1']]]/hl7:substanceAdministration[hl7:templateId[@root = '1.2.40.0.34.6.0.11.3.72'] and hl7:templateId[@root = '2.16.840.1.113883.10.20.1.24'] and hl7:templateId[@root = '1.3.6.1.4.1.19376.1.5.3.1.4.7'] and hl7:templateId[@root = '1.3.6.1.4.1.19376.1.9.1.3.16'] and hl7:templateId[@root = '1.3.6.1.4.1.19376.1.5.3.1.4.7.1']]/hl7:entryRelationship[@typeCode='RSON'][hl7:act/hl7:templateId[@root='1.3.6.1.4.1.19376.1.5.3.1.4.4.1']]/*[not(@xsi:nil = 'true')][not(self::hl7:act[hl7:templateId[@root = '1.3.6.1.4.1.19376.1.5.3.1.4.4.1']])]"
         id="d41e47382-true-d3569207e0">
      <assert role="error"
              see="http://elga.art-decor.org/elgatgd-html-20240709T111220/tmp-1.2.40.0.34.6.0.11.3.72-2021-02-19T125222.html"
              test="not(.)">(atcdabbr_entry_MedikationsEinnahmeEntry)/d41e47382-true-d3569207e0: '<value-of select="name(..)"/>' ist als geschlossen definiert und dieses Element '<name/>' ist nicht erlaubt oder nicht mit diesem Inhalt erlaubt. Dies kann templateId, code oder id betreffen. Erwartet:  hl7:act[hl7:templateId[@root = '1.3.6.1.4.1.19376.1.5.3.1.4.4.1']] (rule-reference: d41e47382-true-d3569207e0)</assert>
   </rule>

   <!-- Checking undefined contents for template/element @isClosed="true". Match context that we did not already match -->
   <rule fpi="RUL-QQQ"
         context="*[hl7:substanceAdministration[hl7:templateId[@root = '1.2.40.0.34.6.0.11.3.72'] and hl7:templateId[@root = '2.16.840.1.113883.10.20.1.24'] and hl7:templateId[@root = '1.3.6.1.4.1.19376.1.5.3.1.4.7'] and hl7:templateId[@root = '1.3.6.1.4.1.19376.1.9.1.3.16'] and hl7:templateId[@root = '1.3.6.1.4.1.19376.1.5.3.1.4.7.1']]]/hl7:substanceAdministration[hl7:templateId[@root = '1.2.40.0.34.6.0.11.3.72'] and hl7:templateId[@root = '2.16.840.1.113883.10.20.1.24'] and hl7:templateId[@root = '1.3.6.1.4.1.19376.1.5.3.1.4.7'] and hl7:templateId[@root = '1.3.6.1.4.1.19376.1.9.1.3.16'] and hl7:templateId[@root = '1.3.6.1.4.1.19376.1.5.3.1.4.7.1']]/hl7:entryRelationship[@typeCode='RSON'][hl7:act/hl7:templateId[@root='1.3.6.1.4.1.19376.1.5.3.1.4.4.1']]/hl7:act[hl7:templateId[@root = '1.3.6.1.4.1.19376.1.5.3.1.4.4.1']]/*[not(@xsi:nil = 'true')][not(self::hl7:templateId[@root = '1.3.6.1.4.1.19376.1.5.3.1.4.4.1'] | self::hl7:id[not(@nullFlavor)])]"
         id="d41e47396-true-d3569229e0">
      <assert role="error"
              see="http://elga.art-decor.org/elgatgd-html-20240709T111220/tmp-1.2.40.0.34.6.0.11.3.72-2021-02-19T125222.html"
              test="not(.)">(atcdabbr_entry_MedikationsEinnahmeEntry)/d41e47396-true-d3569229e0: '<value-of select="name(..)"/>' ist als geschlossen definiert und dieses Element '<name/>' ist nicht erlaubt oder nicht mit diesem Inhalt erlaubt. Dies kann templateId, code oder id betreffen. Erwartet:  hl7:templateId[@root = '1.3.6.1.4.1.19376.1.5.3.1.4.4.1'] | hl7:id[not(@nullFlavor)] (rule-reference: d41e47396-true-d3569229e0)</assert>
   </rule>

   <!-- Checking undefined contents for template/element @isClosed="true". Match context that we did not already match -->
   <rule fpi="RUL-QQQ"
         context="*[hl7:substanceAdministration[hl7:templateId[@root = '1.2.40.0.34.6.0.11.3.72'] and hl7:templateId[@root = '2.16.840.1.113883.10.20.1.24'] and hl7:templateId[@root = '1.3.6.1.4.1.19376.1.5.3.1.4.7'] and hl7:templateId[@root = '1.3.6.1.4.1.19376.1.9.1.3.16'] and hl7:templateId[@root = '1.3.6.1.4.1.19376.1.5.3.1.4.7.1']]]/hl7:substanceAdministration[hl7:templateId[@root = '1.2.40.0.34.6.0.11.3.72'] and hl7:templateId[@root = '2.16.840.1.113883.10.20.1.24'] and hl7:templateId[@root = '1.3.6.1.4.1.19376.1.5.3.1.4.7'] and hl7:templateId[@root = '1.3.6.1.4.1.19376.1.9.1.3.16'] and hl7:templateId[@root = '1.3.6.1.4.1.19376.1.5.3.1.4.7.1']]/hl7:entryRelationship[@typeCode='SUBJ'][hl7:act/hl7:templateId[@root='2.16.840.1.113883.10.20.1.43']]/*[not(@xsi:nil = 'true')][not(self::hl7:act[hl7:templateId[@root = '2.16.840.1.113883.10.20.1.43'] and hl7:templateId[@root = '1.3.6.1.4.1.19376.1.5.3.1.4.3.1']])]"
         id="d41e47416-true-d3569256e0">
      <assert role="error"
              see="http://elga.art-decor.org/elgatgd-html-20240709T111220/tmp-1.2.40.0.34.6.0.11.3.72-2021-02-19T125222.html"
              test="not(.)">(atcdabbr_entry_MedikationsEinnahmeEntry)/d41e47416-true-d3569256e0: '<value-of select="name(..)"/>' ist als geschlossen definiert und dieses Element '<name/>' ist nicht erlaubt oder nicht mit diesem Inhalt erlaubt. Dies kann templateId, code oder id betreffen. Erwartet:  hl7:act[hl7:templateId[@root = '2.16.840.1.113883.10.20.1.43'] and hl7:templateId[@root = '1.3.6.1.4.1.19376.1.5.3.1.4.3.1']] (rule-reference: d41e47416-true-d3569256e0)</assert>
   </rule>

   <!-- Checking undefined contents for template/element @isClosed="true". Match context that we did not already match -->
   <rule fpi="RUL-QQQ"
         context="*[hl7:substanceAdministration[hl7:templateId[@root = '1.2.40.0.34.6.0.11.3.72'] and hl7:templateId[@root = '2.16.840.1.113883.10.20.1.24'] and hl7:templateId[@root = '1.3.6.1.4.1.19376.1.5.3.1.4.7'] and hl7:templateId[@root = '1.3.6.1.4.1.19376.1.9.1.3.16'] and hl7:templateId[@root = '1.3.6.1.4.1.19376.1.5.3.1.4.7.1']]]/hl7:substanceAdministration[hl7:templateId[@root = '1.2.40.0.34.6.0.11.3.72'] and hl7:templateId[@root = '2.16.840.1.113883.10.20.1.24'] and hl7:templateId[@root = '1.3.6.1.4.1.19376.1.5.3.1.4.7'] and hl7:templateId[@root = '1.3.6.1.4.1.19376.1.9.1.3.16'] and hl7:templateId[@root = '1.3.6.1.4.1.19376.1.5.3.1.4.7.1']]/hl7:entryRelationship[@typeCode='SUBJ'][hl7:act/hl7:templateId[@root='2.16.840.1.113883.10.20.1.43']]/hl7:act[hl7:templateId[@root = '2.16.840.1.113883.10.20.1.43'] and hl7:templateId[@root = '1.3.6.1.4.1.19376.1.5.3.1.4.3.1']]/*[not(@xsi:nil = 'true')][not(self::hl7:templateId[@root = '2.16.840.1.113883.10.20.1.43'] | self::hl7:templateId[@root = '1.3.6.1.4.1.19376.1.5.3.1.4.3.1'] | self::hl7:code[(@code = 'FINSTRUCT' and @codeSystem = '1.3.6.1.4.1.19376.1.5.3.2')] | self::hl7:text[not(@nullFlavor)] | self::hl7:statusCode[@code = 'completed'])]"
         id="d41e47427-true-d3569300e0">
      <assert role="error"
              see="http://elga.art-decor.org/elgatgd-html-20240709T111220/tmp-1.2.40.0.34.6.0.11.3.72-2021-02-19T125222.html"
              test="not(.)">(atcdabbr_entry_MedikationsEinnahmeEntry)/d41e47427-true-d3569300e0: '<value-of select="name(..)"/>' ist als geschlossen definiert und dieses Element '<name/>' ist nicht erlaubt oder nicht mit diesem Inhalt erlaubt. Dies kann templateId, code oder id betreffen. Erwartet:  hl7:templateId[@root = '2.16.840.1.113883.10.20.1.43'] | hl7:templateId[@root = '1.3.6.1.4.1.19376.1.5.3.1.4.3.1'] | hl7:code[(@code = 'FINSTRUCT' and @codeSystem = '1.3.6.1.4.1.19376.1.5.3.2')] | hl7:text[not(@nullFlavor)] | hl7:statusCode[@code = 'completed'] (rule-reference: d41e47427-true-d3569300e0)</assert>
   </rule>

   <!-- Checking undefined contents for template/element @isClosed="true". Match context that we did not already match -->
   <rule fpi="RUL-QQQ"
         context="*[hl7:substanceAdministration[hl7:templateId[@root = '1.2.40.0.34.6.0.11.3.72'] and hl7:templateId[@root = '2.16.840.1.113883.10.20.1.24'] and hl7:templateId[@root = '1.3.6.1.4.1.19376.1.5.3.1.4.7'] and hl7:templateId[@root = '1.3.6.1.4.1.19376.1.9.1.3.16'] and hl7:templateId[@root = '1.3.6.1.4.1.19376.1.5.3.1.4.7.1']]]/hl7:substanceAdministration[hl7:templateId[@root = '1.2.40.0.34.6.0.11.3.72'] and hl7:templateId[@root = '2.16.840.1.113883.10.20.1.24'] and hl7:templateId[@root = '1.3.6.1.4.1.19376.1.5.3.1.4.7'] and hl7:templateId[@root = '1.3.6.1.4.1.19376.1.9.1.3.16'] and hl7:templateId[@root = '1.3.6.1.4.1.19376.1.5.3.1.4.7.1']]/hl7:entryRelationship[@typeCode='SUBJ'][hl7:act/hl7:templateId[@root='2.16.840.1.113883.10.20.1.43']]/hl7:act[hl7:templateId[@root = '2.16.840.1.113883.10.20.1.43'] and hl7:templateId[@root = '1.3.6.1.4.1.19376.1.5.3.1.4.3.1']]/hl7:text[not(@nullFlavor)]/*[not(@xsi:nil = 'true')][not(self::hl7:reference[not(@nullFlavor)])]"
         id="d41e47449-true-d3569332e0">
      <assert role="error"
              see="http://elga.art-decor.org/elgatgd-html-20240709T111220/tmp-1.2.40.0.34.6.0.11.3.72-2021-02-19T125222.html"
              test="not(.)">(atcdabbr_entry_MedikationsEinnahmeEntry)/d41e47449-true-d3569332e0: '<value-of select="name(..)"/>' ist als geschlossen definiert und dieses Element '<name/>' ist nicht erlaubt oder nicht mit diesem Inhalt erlaubt. Dies kann templateId, code oder id betreffen. Erwartet:  hl7:reference[not(@nullFlavor)] (rule-reference: d41e47449-true-d3569332e0)</assert>
   </rule>

   <!-- Checking undefined contents for template/element @isClosed="true". Match context that we did not already match -->
   <rule fpi="RUL-QQQ"
         context="*[hl7:substanceAdministration[hl7:templateId[@root = '1.2.40.0.34.6.0.11.3.72'] and hl7:templateId[@root = '2.16.840.1.113883.10.20.1.24'] and hl7:templateId[@root = '1.3.6.1.4.1.19376.1.5.3.1.4.7'] and hl7:templateId[@root = '1.3.6.1.4.1.19376.1.9.1.3.16'] and hl7:templateId[@root = '1.3.6.1.4.1.19376.1.5.3.1.4.7.1']]]/hl7:substanceAdministration[hl7:templateId[@root = '1.2.40.0.34.6.0.11.3.72'] and hl7:templateId[@root = '2.16.840.1.113883.10.20.1.24'] and hl7:templateId[@root = '1.3.6.1.4.1.19376.1.5.3.1.4.7'] and hl7:templateId[@root = '1.3.6.1.4.1.19376.1.9.1.3.16'] and hl7:templateId[@root = '1.3.6.1.4.1.19376.1.5.3.1.4.7.1']]/hl7:entryRelationship[@typeCode='COMP'][hl7:supply]/*[not(@xsi:nil = 'true')][not(self::hl7:supply[not(@nullFlavor)][@classCode = 'SPLY'][@moodCode = 'RQO'])]"
         id="d41e47471-true-d3569355e0">
      <assert role="error"
              see="http://elga.art-decor.org/elgatgd-html-20240709T111220/tmp-1.2.40.0.34.6.0.11.3.72-2021-02-19T125222.html"
              test="not(.)">(atcdabbr_entry_MedikationsEinnahmeEntry)/d41e47471-true-d3569355e0: '<value-of select="name(..)"/>' ist als geschlossen definiert und dieses Element '<name/>' ist nicht erlaubt oder nicht mit diesem Inhalt erlaubt. Dies kann templateId, code oder id betreffen. Erwartet:  hl7:supply[not(@nullFlavor)][@classCode = 'SPLY'][@moodCode = 'RQO'] (rule-reference: d41e47471-true-d3569355e0)</assert>
   </rule>

   <!-- Checking undefined contents for template/element @isClosed="true". Match context that we did not already match -->
   <rule fpi="RUL-QQQ"
         context="*[hl7:substanceAdministration[hl7:templateId[@root = '1.2.40.0.34.6.0.11.3.72'] and hl7:templateId[@root = '2.16.840.1.113883.10.20.1.24'] and hl7:templateId[@root = '1.3.6.1.4.1.19376.1.5.3.1.4.7'] and hl7:templateId[@root = '1.3.6.1.4.1.19376.1.9.1.3.16'] and hl7:templateId[@root = '1.3.6.1.4.1.19376.1.5.3.1.4.7.1']]]/hl7:substanceAdministration[hl7:templateId[@root = '1.2.40.0.34.6.0.11.3.72'] and hl7:templateId[@root = '2.16.840.1.113883.10.20.1.24'] and hl7:templateId[@root = '1.3.6.1.4.1.19376.1.5.3.1.4.7'] and hl7:templateId[@root = '1.3.6.1.4.1.19376.1.9.1.3.16'] and hl7:templateId[@root = '1.3.6.1.4.1.19376.1.5.3.1.4.7.1']]/hl7:entryRelationship[@typeCode='COMP'][hl7:supply]/hl7:supply[not(@nullFlavor)][@classCode = 'SPLY'][@moodCode = 'RQO']/*[not(@xsi:nil = 'true')][not(self::hl7:independentInd[not(@nullFlavor)] | self::hl7:quantity)]"
         id="d41e47496-true-d3569374e0">
      <assert role="error"
              see="http://elga.art-decor.org/elgatgd-html-20240709T111220/tmp-1.2.40.0.34.6.0.11.3.72-2021-02-19T125222.html"
              test="not(.)">(atcdabbr_entry_MedikationsEinnahmeEntry)/d41e47496-true-d3569374e0: '<value-of select="name(..)"/>' ist als geschlossen definiert und dieses Element '<name/>' ist nicht erlaubt oder nicht mit diesem Inhalt erlaubt. Dies kann templateId, code oder id betreffen. Erwartet:  hl7:independentInd[not(@nullFlavor)] | hl7:quantity (rule-reference: d41e47496-true-d3569374e0)</assert>
   </rule>

   <!-- Checking undefined contents for template/element @isClosed="true". Match context that we did not already match -->
   <rule fpi="RUL-QQQ"
         context="*[hl7:substanceAdministration[hl7:templateId[@root = '1.2.40.0.34.6.0.11.3.72'] and hl7:templateId[@root = '2.16.840.1.113883.10.20.1.24'] and hl7:templateId[@root = '1.3.6.1.4.1.19376.1.5.3.1.4.7'] and hl7:templateId[@root = '1.3.6.1.4.1.19376.1.9.1.3.16'] and hl7:templateId[@root = '1.3.6.1.4.1.19376.1.5.3.1.4.7.1']]]/hl7:substanceAdministration[hl7:templateId[@root = '1.2.40.0.34.6.0.11.3.72'] and hl7:templateId[@root = '2.16.840.1.113883.10.20.1.24'] and hl7:templateId[@root = '1.3.6.1.4.1.19376.1.5.3.1.4.7'] and hl7:templateId[@root = '1.3.6.1.4.1.19376.1.9.1.3.16'] and hl7:templateId[@root = '1.3.6.1.4.1.19376.1.5.3.1.4.7.1']]/hl7:entryRelationship[@typeCode='REFR'][hl7:substanceAdministration/hl7:templateId[@root='1.3.6.1.4.1.19376.1.9.1.3.10']]/*[not(@xsi:nil = 'true')][not(self::hl7:substanceAdministration[hl7:templateId[@root = '1.3.6.1.4.1.19376.1.9.1.3.10']])]"
         id="d41e47545-true-d3569398e0">
      <assert role="error"
              see="http://elga.art-decor.org/elgatgd-html-20240709T111220/tmp-1.2.40.0.34.6.0.11.3.72-2021-02-19T125222.html"
              test="not(.)">(atcdabbr_entry_MedikationsEinnahmeEntry)/d41e47545-true-d3569398e0: '<value-of select="name(..)"/>' ist als geschlossen definiert und dieses Element '<name/>' ist nicht erlaubt oder nicht mit diesem Inhalt erlaubt. Dies kann templateId, code oder id betreffen. Erwartet:  hl7:substanceAdministration[hl7:templateId[@root = '1.3.6.1.4.1.19376.1.9.1.3.10']] (rule-reference: d41e47545-true-d3569398e0)</assert>
   </rule>

   <!-- Checking undefined contents for template/element @isClosed="true". Match context that we did not already match -->
   <rule fpi="RUL-QQQ"
         context="*[hl7:substanceAdministration[hl7:templateId[@root = '1.2.40.0.34.6.0.11.3.72'] and hl7:templateId[@root = '2.16.840.1.113883.10.20.1.24'] and hl7:templateId[@root = '1.3.6.1.4.1.19376.1.5.3.1.4.7'] and hl7:templateId[@root = '1.3.6.1.4.1.19376.1.9.1.3.16'] and hl7:templateId[@root = '1.3.6.1.4.1.19376.1.5.3.1.4.7.1']]]/hl7:substanceAdministration[hl7:templateId[@root = '1.2.40.0.34.6.0.11.3.72'] and hl7:templateId[@root = '2.16.840.1.113883.10.20.1.24'] and hl7:templateId[@root = '1.3.6.1.4.1.19376.1.5.3.1.4.7'] and hl7:templateId[@root = '1.3.6.1.4.1.19376.1.9.1.3.16'] and hl7:templateId[@root = '1.3.6.1.4.1.19376.1.5.3.1.4.7.1']]/hl7:entryRelationship[@typeCode='REFR'][hl7:substanceAdministration/hl7:templateId[@root='1.3.6.1.4.1.19376.1.9.1.3.10']]/hl7:substanceAdministration[hl7:templateId[@root = '1.3.6.1.4.1.19376.1.9.1.3.10']]/*[not(@xsi:nil = 'true')][not(self::hl7:templateId[@root = '1.3.6.1.4.1.19376.1.9.1.3.10'] | self::hl7:id[not(@nullFlavor)] | self::hl7:code[(@code = 'MTPItem' and @codeSystem = '1.3.6.1.4.1.19376.1.9.2.2')] | self::hl7:consumable[not(@nullFlavor)][hl7:manufacturedProduct])]"
         id="d41e47559-true-d3569432e0">
      <assert role="error"
              see="http://elga.art-decor.org/elgatgd-html-20240709T111220/tmp-1.2.40.0.34.6.0.11.3.72-2021-02-19T125222.html"
              test="not(.)">(atcdabbr_entry_MedikationsEinnahmeEntry)/d41e47559-true-d3569432e0: '<value-of select="name(..)"/>' ist als geschlossen definiert und dieses Element '<name/>' ist nicht erlaubt oder nicht mit diesem Inhalt erlaubt. Dies kann templateId, code oder id betreffen. Erwartet:  hl7:templateId[@root = '1.3.6.1.4.1.19376.1.9.1.3.10'] | hl7:id[not(@nullFlavor)] | hl7:code[(@code = 'MTPItem' and @codeSystem = '1.3.6.1.4.1.19376.1.9.2.2')] | hl7:consumable[not(@nullFlavor)][hl7:manufacturedProduct] (rule-reference: d41e47559-true-d3569432e0)</assert>
   </rule>

   <!-- Checking undefined contents for template/element @isClosed="true". Match context that we did not already match -->
   <rule fpi="RUL-QQQ"
         context="*[hl7:substanceAdministration[hl7:templateId[@root = '1.2.40.0.34.6.0.11.3.72'] and hl7:templateId[@root = '2.16.840.1.113883.10.20.1.24'] and hl7:templateId[@root = '1.3.6.1.4.1.19376.1.5.3.1.4.7'] and hl7:templateId[@root = '1.3.6.1.4.1.19376.1.9.1.3.16'] and hl7:templateId[@root = '1.3.6.1.4.1.19376.1.5.3.1.4.7.1']]]/hl7:substanceAdministration[hl7:templateId[@root = '1.2.40.0.34.6.0.11.3.72'] and hl7:templateId[@root = '2.16.840.1.113883.10.20.1.24'] and hl7:templateId[@root = '1.3.6.1.4.1.19376.1.5.3.1.4.7'] and hl7:templateId[@root = '1.3.6.1.4.1.19376.1.9.1.3.16'] and hl7:templateId[@root = '1.3.6.1.4.1.19376.1.5.3.1.4.7.1']]/hl7:entryRelationship[@typeCode='REFR'][hl7:substanceAdministration/hl7:templateId[@root='1.3.6.1.4.1.19376.1.9.1.3.10']]/hl7:substanceAdministration[hl7:templateId[@root = '1.3.6.1.4.1.19376.1.9.1.3.10']]/hl7:consumable[not(@nullFlavor)][hl7:manufacturedProduct]/*[not(@xsi:nil = 'true')][not(self::hl7:manufacturedProduct[not(@nullFlavor)][hl7:manufacturedMaterial[@nullFlavor = 'NA']])]"
         id="d41e47593-true-d3569463e0">
      <assert role="error"
              see="http://elga.art-decor.org/elgatgd-html-20240709T111220/tmp-1.2.40.0.34.6.0.11.3.72-2021-02-19T125222.html"
              test="not(.)">(atcdabbr_entry_MedikationsEinnahmeEntry)/d41e47593-true-d3569463e0: '<value-of select="name(..)"/>' ist als geschlossen definiert und dieses Element '<name/>' ist nicht erlaubt oder nicht mit diesem Inhalt erlaubt. Dies kann templateId, code oder id betreffen. Erwartet:  hl7:manufacturedProduct[not(@nullFlavor)][hl7:manufacturedMaterial[@nullFlavor = 'NA']] (rule-reference: d41e47593-true-d3569463e0)</assert>
   </rule>

   <!-- Checking undefined contents for template/element @isClosed="true". Match context that we did not already match -->
   <rule fpi="RUL-QQQ"
         context="*[hl7:substanceAdministration[hl7:templateId[@root = '1.2.40.0.34.6.0.11.3.72'] and hl7:templateId[@root = '2.16.840.1.113883.10.20.1.24'] and hl7:templateId[@root = '1.3.6.1.4.1.19376.1.5.3.1.4.7'] and hl7:templateId[@root = '1.3.6.1.4.1.19376.1.9.1.3.16'] and hl7:templateId[@root = '1.3.6.1.4.1.19376.1.5.3.1.4.7.1']]]/hl7:substanceAdministration[hl7:templateId[@root = '1.2.40.0.34.6.0.11.3.72'] and hl7:templateId[@root = '2.16.840.1.113883.10.20.1.24'] and hl7:templateId[@root = '1.3.6.1.4.1.19376.1.5.3.1.4.7'] and hl7:templateId[@root = '1.3.6.1.4.1.19376.1.9.1.3.16'] and hl7:templateId[@root = '1.3.6.1.4.1.19376.1.5.3.1.4.7.1']]/hl7:entryRelationship[@typeCode='REFR'][hl7:substanceAdministration/hl7:templateId[@root='1.3.6.1.4.1.19376.1.9.1.3.10']]/hl7:substanceAdministration[hl7:templateId[@root = '1.3.6.1.4.1.19376.1.9.1.3.10']]/hl7:consumable[not(@nullFlavor)][hl7:manufacturedProduct]/hl7:manufacturedProduct[not(@nullFlavor)][hl7:manufacturedMaterial[@nullFlavor = 'NA']]/*[not(@xsi:nil = 'true')][not(self::hl7:manufacturedMaterial[@nullFlavor = 'NA'])]"
         id="d41e47595-true-d3569477e0">
      <assert role="error"
              see="http://elga.art-decor.org/elgatgd-html-20240709T111220/tmp-1.2.40.0.34.6.0.11.3.72-2021-02-19T125222.html"
              test="not(.)">(atcdabbr_entry_MedikationsEinnahmeEntry)/d41e47595-true-d3569477e0: '<value-of select="name(..)"/>' ist als geschlossen definiert und dieses Element '<name/>' ist nicht erlaubt oder nicht mit diesem Inhalt erlaubt. Dies kann templateId, code oder id betreffen. Erwartet:  hl7:manufacturedMaterial[@nullFlavor = 'NA'] (rule-reference: d41e47595-true-d3569477e0)</assert>
   </rule>

   <!-- Checking undefined contents for template/element @isClosed="true". Match context that we did not already match -->
   <rule fpi="RUL-QQQ"
         context="*[hl7:substanceAdministration[hl7:templateId[@root = '1.2.40.0.34.6.0.11.3.72'] and hl7:templateId[@root = '2.16.840.1.113883.10.20.1.24'] and hl7:templateId[@root = '1.3.6.1.4.1.19376.1.5.3.1.4.7'] and hl7:templateId[@root = '1.3.6.1.4.1.19376.1.9.1.3.16'] and hl7:templateId[@root = '1.3.6.1.4.1.19376.1.5.3.1.4.7.1']]]/hl7:substanceAdministration[hl7:templateId[@root = '1.2.40.0.34.6.0.11.3.72'] and hl7:templateId[@root = '2.16.840.1.113883.10.20.1.24'] and hl7:templateId[@root = '1.3.6.1.4.1.19376.1.5.3.1.4.7'] and hl7:templateId[@root = '1.3.6.1.4.1.19376.1.9.1.3.16'] and hl7:templateId[@root = '1.3.6.1.4.1.19376.1.5.3.1.4.7.1']]/hl7:entryRelationship[@typeCode='REFR'][hl7:substanceAdministration/hl7:templateId[@root='1.3.6.1.4.1.19376.1.9.1.3.11']]/*[not(@xsi:nil = 'true')][not(self::hl7:substanceAdministration[hl7:templateId[@root = '1.3.6.1.4.1.19376.1.9.1.3.11']])]"
         id="d41e47606-true-d3569496e0">
      <assert role="error"
              see="http://elga.art-decor.org/elgatgd-html-20240709T111220/tmp-1.2.40.0.34.6.0.11.3.72-2021-02-19T125222.html"
              test="not(.)">(atcdabbr_entry_MedikationsEinnahmeEntry)/d41e47606-true-d3569496e0: '<value-of select="name(..)"/>' ist als geschlossen definiert und dieses Element '<name/>' ist nicht erlaubt oder nicht mit diesem Inhalt erlaubt. Dies kann templateId, code oder id betreffen. Erwartet:  hl7:substanceAdministration[hl7:templateId[@root = '1.3.6.1.4.1.19376.1.9.1.3.11']] (rule-reference: d41e47606-true-d3569496e0)</assert>
   </rule>

   <!-- Checking undefined contents for template/element @isClosed="true". Match context that we did not already match -->
   <rule fpi="RUL-QQQ"
         context="*[hl7:substanceAdministration[hl7:templateId[@root = '1.2.40.0.34.6.0.11.3.72'] and hl7:templateId[@root = '2.16.840.1.113883.10.20.1.24'] and hl7:templateId[@root = '1.3.6.1.4.1.19376.1.5.3.1.4.7'] and hl7:templateId[@root = '1.3.6.1.4.1.19376.1.9.1.3.16'] and hl7:templateId[@root = '1.3.6.1.4.1.19376.1.5.3.1.4.7.1']]]/hl7:substanceAdministration[hl7:templateId[@root = '1.2.40.0.34.6.0.11.3.72'] and hl7:templateId[@root = '2.16.840.1.113883.10.20.1.24'] and hl7:templateId[@root = '1.3.6.1.4.1.19376.1.5.3.1.4.7'] and hl7:templateId[@root = '1.3.6.1.4.1.19376.1.9.1.3.16'] and hl7:templateId[@root = '1.3.6.1.4.1.19376.1.5.3.1.4.7.1']]/hl7:entryRelationship[@typeCode='REFR'][hl7:substanceAdministration/hl7:templateId[@root='1.3.6.1.4.1.19376.1.9.1.3.11']]/hl7:substanceAdministration[hl7:templateId[@root = '1.3.6.1.4.1.19376.1.9.1.3.11']]/*[not(@xsi:nil = 'true')][not(self::hl7:templateId[@root = '1.3.6.1.4.1.19376.1.9.1.3.11'] | self::hl7:id[not(@nullFlavor)] | self::hl7:code[(@code = 'PREItem' and @codeSystem = '1.3.6.1.4.1.19376.1.9.2.2')] | self::hl7:consumable[not(@nullFlavor)][hl7:manufacturedProduct])]"
         id="d41e47615-true-d3569530e0">
      <assert role="error"
              see="http://elga.art-decor.org/elgatgd-html-20240709T111220/tmp-1.2.40.0.34.6.0.11.3.72-2021-02-19T125222.html"
              test="not(.)">(atcdabbr_entry_MedikationsEinnahmeEntry)/d41e47615-true-d3569530e0: '<value-of select="name(..)"/>' ist als geschlossen definiert und dieses Element '<name/>' ist nicht erlaubt oder nicht mit diesem Inhalt erlaubt. Dies kann templateId, code oder id betreffen. Erwartet:  hl7:templateId[@root = '1.3.6.1.4.1.19376.1.9.1.3.11'] | hl7:id[not(@nullFlavor)] | hl7:code[(@code = 'PREItem' and @codeSystem = '1.3.6.1.4.1.19376.1.9.2.2')] | hl7:consumable[not(@nullFlavor)][hl7:manufacturedProduct] (rule-reference: d41e47615-true-d3569530e0)</assert>
   </rule>

   <!-- Checking undefined contents for template/element @isClosed="true". Match context that we did not already match -->
   <rule fpi="RUL-QQQ"
         context="*[hl7:substanceAdministration[hl7:templateId[@root = '1.2.40.0.34.6.0.11.3.72'] and hl7:templateId[@root = '2.16.840.1.113883.10.20.1.24'] and hl7:templateId[@root = '1.3.6.1.4.1.19376.1.5.3.1.4.7'] and hl7:templateId[@root = '1.3.6.1.4.1.19376.1.9.1.3.16'] and hl7:templateId[@root = '1.3.6.1.4.1.19376.1.5.3.1.4.7.1']]]/hl7:substanceAdministration[hl7:templateId[@root = '1.2.40.0.34.6.0.11.3.72'] and hl7:templateId[@root = '2.16.840.1.113883.10.20.1.24'] and hl7:templateId[@root = '1.3.6.1.4.1.19376.1.5.3.1.4.7'] and hl7:templateId[@root = '1.3.6.1.4.1.19376.1.9.1.3.16'] and hl7:templateId[@root = '1.3.6.1.4.1.19376.1.5.3.1.4.7.1']]/hl7:entryRelationship[@typeCode='REFR'][hl7:substanceAdministration/hl7:templateId[@root='1.3.6.1.4.1.19376.1.9.1.3.11']]/hl7:substanceAdministration[hl7:templateId[@root = '1.3.6.1.4.1.19376.1.9.1.3.11']]/hl7:consumable[not(@nullFlavor)][hl7:manufacturedProduct]/*[not(@xsi:nil = 'true')][not(self::hl7:manufacturedProduct[not(@nullFlavor)][hl7:manufacturedMaterial[@nullFlavor = 'NA']])]"
         id="d41e47649-true-d3569561e0">
      <assert role="error"
              see="http://elga.art-decor.org/elgatgd-html-20240709T111220/tmp-1.2.40.0.34.6.0.11.3.72-2021-02-19T125222.html"
              test="not(.)">(atcdabbr_entry_MedikationsEinnahmeEntry)/d41e47649-true-d3569561e0: '<value-of select="name(..)"/>' ist als geschlossen definiert und dieses Element '<name/>' ist nicht erlaubt oder nicht mit diesem Inhalt erlaubt. Dies kann templateId, code oder id betreffen. Erwartet:  hl7:manufacturedProduct[not(@nullFlavor)][hl7:manufacturedMaterial[@nullFlavor = 'NA']] (rule-reference: d41e47649-true-d3569561e0)</assert>
   </rule>

   <!-- Checking undefined contents for template/element @isClosed="true". Match context that we did not already match -->
   <rule fpi="RUL-QQQ"
         context="*[hl7:substanceAdministration[hl7:templateId[@root = '1.2.40.0.34.6.0.11.3.72'] and hl7:templateId[@root = '2.16.840.1.113883.10.20.1.24'] and hl7:templateId[@root = '1.3.6.1.4.1.19376.1.5.3.1.4.7'] and hl7:templateId[@root = '1.3.6.1.4.1.19376.1.9.1.3.16'] and hl7:templateId[@root = '1.3.6.1.4.1.19376.1.5.3.1.4.7.1']]]/hl7:substanceAdministration[hl7:templateId[@root = '1.2.40.0.34.6.0.11.3.72'] and hl7:templateId[@root = '2.16.840.1.113883.10.20.1.24'] and hl7:templateId[@root = '1.3.6.1.4.1.19376.1.5.3.1.4.7'] and hl7:templateId[@root = '1.3.6.1.4.1.19376.1.9.1.3.16'] and hl7:templateId[@root = '1.3.6.1.4.1.19376.1.5.3.1.4.7.1']]/hl7:entryRelationship[@typeCode='REFR'][hl7:substanceAdministration/hl7:templateId[@root='1.3.6.1.4.1.19376.1.9.1.3.11']]/hl7:substanceAdministration[hl7:templateId[@root = '1.3.6.1.4.1.19376.1.9.1.3.11']]/hl7:consumable[not(@nullFlavor)][hl7:manufacturedProduct]/hl7:manufacturedProduct[not(@nullFlavor)][hl7:manufacturedMaterial[@nullFlavor = 'NA']]/*[not(@xsi:nil = 'true')][not(self::hl7:manufacturedMaterial[@nullFlavor = 'NA'])]"
         id="d41e47651-true-d3569575e0">
      <assert role="error"
              see="http://elga.art-decor.org/elgatgd-html-20240709T111220/tmp-1.2.40.0.34.6.0.11.3.72-2021-02-19T125222.html"
              test="not(.)">(atcdabbr_entry_MedikationsEinnahmeEntry)/d41e47651-true-d3569575e0: '<value-of select="name(..)"/>' ist als geschlossen definiert und dieses Element '<name/>' ist nicht erlaubt oder nicht mit diesem Inhalt erlaubt. Dies kann templateId, code oder id betreffen. Erwartet:  hl7:manufacturedMaterial[@nullFlavor = 'NA'] (rule-reference: d41e47651-true-d3569575e0)</assert>
   </rule>

   <!-- Checking undefined contents for template/element @isClosed="true". Match context that we did not already match -->
   <rule fpi="RUL-QQQ"
         context="*[hl7:substanceAdministration[hl7:templateId[@root = '1.2.40.0.34.6.0.11.3.72'] and hl7:templateId[@root = '2.16.840.1.113883.10.20.1.24'] and hl7:templateId[@root = '1.3.6.1.4.1.19376.1.5.3.1.4.7'] and hl7:templateId[@root = '1.3.6.1.4.1.19376.1.9.1.3.16'] and hl7:templateId[@root = '1.3.6.1.4.1.19376.1.5.3.1.4.7.1']]]/hl7:substanceAdministration[hl7:templateId[@root = '1.2.40.0.34.6.0.11.3.72'] and hl7:templateId[@root = '2.16.840.1.113883.10.20.1.24'] and hl7:templateId[@root = '1.3.6.1.4.1.19376.1.5.3.1.4.7'] and hl7:templateId[@root = '1.3.6.1.4.1.19376.1.9.1.3.16'] and hl7:templateId[@root = '1.3.6.1.4.1.19376.1.5.3.1.4.7.1']]/hl7:entryRelationship[@typeCode='REFR'][hl7:supply/hl7:templateId[@root='1.3.6.1.4.1.19376.1.9.1.3.12']]/*[not(@xsi:nil = 'true')][not(self::hl7:supply[hl7:templateId[@root = '1.3.6.1.4.1.19376.1.9.1.3.12']])]"
         id="d41e47662-true-d3569594e0">
      <assert role="error"
              see="http://elga.art-decor.org/elgatgd-html-20240709T111220/tmp-1.2.40.0.34.6.0.11.3.72-2021-02-19T125222.html"
              test="not(.)">(atcdabbr_entry_MedikationsEinnahmeEntry)/d41e47662-true-d3569594e0: '<value-of select="name(..)"/>' ist als geschlossen definiert und dieses Element '<name/>' ist nicht erlaubt oder nicht mit diesem Inhalt erlaubt. Dies kann templateId, code oder id betreffen. Erwartet:  hl7:supply[hl7:templateId[@root = '1.3.6.1.4.1.19376.1.9.1.3.12']] (rule-reference: d41e47662-true-d3569594e0)</assert>
   </rule>

   <!-- Checking undefined contents for template/element @isClosed="true". Match context that we did not already match -->
   <rule fpi="RUL-QQQ"
         context="*[hl7:substanceAdministration[hl7:templateId[@root = '1.2.40.0.34.6.0.11.3.72'] and hl7:templateId[@root = '2.16.840.1.113883.10.20.1.24'] and hl7:templateId[@root = '1.3.6.1.4.1.19376.1.5.3.1.4.7'] and hl7:templateId[@root = '1.3.6.1.4.1.19376.1.9.1.3.16'] and hl7:templateId[@root = '1.3.6.1.4.1.19376.1.5.3.1.4.7.1']]]/hl7:substanceAdministration[hl7:templateId[@root = '1.2.40.0.34.6.0.11.3.72'] and hl7:templateId[@root = '2.16.840.1.113883.10.20.1.24'] and hl7:templateId[@root = '1.3.6.1.4.1.19376.1.5.3.1.4.7'] and hl7:templateId[@root = '1.3.6.1.4.1.19376.1.9.1.3.16'] and hl7:templateId[@root = '1.3.6.1.4.1.19376.1.5.3.1.4.7.1']]/hl7:entryRelationship[@typeCode='REFR'][hl7:supply/hl7:templateId[@root='1.3.6.1.4.1.19376.1.9.1.3.12']]/hl7:supply[hl7:templateId[@root = '1.3.6.1.4.1.19376.1.9.1.3.12']]/*[not(@xsi:nil = 'true')][not(self::hl7:templateId[@root = '1.3.6.1.4.1.19376.1.9.1.3.12'] | self::hl7:id[not(@nullFlavor)] | self::hl7:code[(@code = 'DISItem' and @codeSystem = '1.3.6.1.4.1.19376.1.9.2.2')])]"
         id="d41e47671-true-d3569623e0">
      <assert role="error"
              see="http://elga.art-decor.org/elgatgd-html-20240709T111220/tmp-1.2.40.0.34.6.0.11.3.72-2021-02-19T125222.html"
              test="not(.)">(atcdabbr_entry_MedikationsEinnahmeEntry)/d41e47671-true-d3569623e0: '<value-of select="name(..)"/>' ist als geschlossen definiert und dieses Element '<name/>' ist nicht erlaubt oder nicht mit diesem Inhalt erlaubt. Dies kann templateId, code oder id betreffen. Erwartet:  hl7:templateId[@root = '1.3.6.1.4.1.19376.1.9.1.3.12'] | hl7:id[not(@nullFlavor)] | hl7:code[(@code = 'DISItem' and @codeSystem = '1.3.6.1.4.1.19376.1.9.2.2')] (rule-reference: d41e47671-true-d3569623e0)</assert>
   </rule>

   <!-- Checking undefined contents for template/element @isClosed="true". Match context that we did not already match -->
   <rule fpi="RUL-QQQ"
         context="*[hl7:substanceAdministration[hl7:templateId[@root = '1.2.40.0.34.6.0.11.3.72'] and hl7:templateId[@root = '2.16.840.1.113883.10.20.1.24'] and hl7:templateId[@root = '1.3.6.1.4.1.19376.1.5.3.1.4.7'] and hl7:templateId[@root = '1.3.6.1.4.1.19376.1.9.1.3.16'] and hl7:templateId[@root = '1.3.6.1.4.1.19376.1.5.3.1.4.7.1']]]/hl7:substanceAdministration[hl7:templateId[@root = '1.2.40.0.34.6.0.11.3.72'] and hl7:templateId[@root = '2.16.840.1.113883.10.20.1.24'] and hl7:templateId[@root = '1.3.6.1.4.1.19376.1.5.3.1.4.7'] and hl7:templateId[@root = '1.3.6.1.4.1.19376.1.9.1.3.16'] and hl7:templateId[@root = '1.3.6.1.4.1.19376.1.5.3.1.4.7.1']]/hl7:entryRelationship[@typeCode='REFR'][hl7:substanceAdministration/hl7:templateId[@root='1.3.6.1.4.1.19376.1.9.1.3.13']]/*[not(@xsi:nil = 'true')][not(self::hl7:substanceAdministration[hl7:templateId[@root = '1.3.6.1.4.1.19376.1.9.1.3.13']])]"
         id="d41e47706-true-d3569654e0">
      <assert role="error"
              see="http://elga.art-decor.org/elgatgd-html-20240709T111220/tmp-1.2.40.0.34.6.0.11.3.72-2021-02-19T125222.html"
              test="not(.)">(atcdabbr_entry_MedikationsEinnahmeEntry)/d41e47706-true-d3569654e0: '<value-of select="name(..)"/>' ist als geschlossen definiert und dieses Element '<name/>' ist nicht erlaubt oder nicht mit diesem Inhalt erlaubt. Dies kann templateId, code oder id betreffen. Erwartet:  hl7:substanceAdministration[hl7:templateId[@root = '1.3.6.1.4.1.19376.1.9.1.3.13']] (rule-reference: d41e47706-true-d3569654e0)</assert>
   </rule>

   <!-- Checking undefined contents for template/element @isClosed="true". Match context that we did not already match -->
   <rule fpi="RUL-QQQ"
         context="*[hl7:substanceAdministration[hl7:templateId[@root = '1.2.40.0.34.6.0.11.3.72'] and hl7:templateId[@root = '2.16.840.1.113883.10.20.1.24'] and hl7:templateId[@root = '1.3.6.1.4.1.19376.1.5.3.1.4.7'] and hl7:templateId[@root = '1.3.6.1.4.1.19376.1.9.1.3.16'] and hl7:templateId[@root = '1.3.6.1.4.1.19376.1.5.3.1.4.7.1']]]/hl7:substanceAdministration[hl7:templateId[@root = '1.2.40.0.34.6.0.11.3.72'] and hl7:templateId[@root = '2.16.840.1.113883.10.20.1.24'] and hl7:templateId[@root = '1.3.6.1.4.1.19376.1.5.3.1.4.7'] and hl7:templateId[@root = '1.3.6.1.4.1.19376.1.9.1.3.16'] and hl7:templateId[@root = '1.3.6.1.4.1.19376.1.5.3.1.4.7.1']]/hl7:entryRelationship[@typeCode='REFR'][hl7:substanceAdministration/hl7:templateId[@root='1.3.6.1.4.1.19376.1.9.1.3.13']]/hl7:substanceAdministration[hl7:templateId[@root = '1.3.6.1.4.1.19376.1.9.1.3.13']]/*[not(@xsi:nil = 'true')][not(self::hl7:templateId[@root = '1.3.6.1.4.1.19376.1.9.1.3.13'] | self::hl7:id[not(@nullFlavor)] | self::hl7:code[(@code = 'PADVItem' and @codeSystem = '1.3.6.1.4.1.19376.1.9.2.2')])]"
         id="d41e47715-true-d3569683e0">
      <assert role="error"
              see="http://elga.art-decor.org/elgatgd-html-20240709T111220/tmp-1.2.40.0.34.6.0.11.3.72-2021-02-19T125222.html"
              test="not(.)">(atcdabbr_entry_MedikationsEinnahmeEntry)/d41e47715-true-d3569683e0: '<value-of select="name(..)"/>' ist als geschlossen definiert und dieses Element '<name/>' ist nicht erlaubt oder nicht mit diesem Inhalt erlaubt. Dies kann templateId, code oder id betreffen. Erwartet:  hl7:templateId[@root = '1.3.6.1.4.1.19376.1.9.1.3.13'] | hl7:id[not(@nullFlavor)] | hl7:code[(@code = 'PADVItem' and @codeSystem = '1.3.6.1.4.1.19376.1.9.2.2')] (rule-reference: d41e47715-true-d3569683e0)</assert>
   </rule>

   <!-- Checking undefined contents for template/element @isClosed="true". Match context that we did not already match -->
   <rule fpi="RUL-QQQ"
         context="*[hl7:substanceAdministration[hl7:templateId[@root = '1.2.40.0.34.6.0.11.3.72'] and hl7:templateId[@root = '2.16.840.1.113883.10.20.1.24'] and hl7:templateId[@root = '1.3.6.1.4.1.19376.1.5.3.1.4.7'] and hl7:templateId[@root = '1.3.6.1.4.1.19376.1.9.1.3.16'] and hl7:templateId[@root = '1.3.6.1.4.1.19376.1.5.3.1.4.7.1']]]/hl7:substanceAdministration[hl7:templateId[@root = '1.2.40.0.34.6.0.11.3.72'] and hl7:templateId[@root = '2.16.840.1.113883.10.20.1.24'] and hl7:templateId[@root = '1.3.6.1.4.1.19376.1.5.3.1.4.7'] and hl7:templateId[@root = '1.3.6.1.4.1.19376.1.9.1.3.16'] and hl7:templateId[@root = '1.3.6.1.4.1.19376.1.5.3.1.4.7.1']]/hl7:entryRelationship[@typeCode='REFR'][hl7:substanceAdministration/hl7:templateId[@root='1.3.6.1.4.1.19376.1.9.1.3.14']]/*[not(@xsi:nil = 'true')][not(self::hl7:substanceAdministration[hl7:templateId[@root = '1.3.6.1.4.1.19376.1.9.1.3.14']])]"
         id="d41e47750-true-d3569714e0">
      <assert role="error"
              see="http://elga.art-decor.org/elgatgd-html-20240709T111220/tmp-1.2.40.0.34.6.0.11.3.72-2021-02-19T125222.html"
              test="not(.)">(atcdabbr_entry_MedikationsEinnahmeEntry)/d41e47750-true-d3569714e0: '<value-of select="name(..)"/>' ist als geschlossen definiert und dieses Element '<name/>' ist nicht erlaubt oder nicht mit diesem Inhalt erlaubt. Dies kann templateId, code oder id betreffen. Erwartet:  hl7:substanceAdministration[hl7:templateId[@root = '1.3.6.1.4.1.19376.1.9.1.3.14']] (rule-reference: d41e47750-true-d3569714e0)</assert>
   </rule>

   <!-- Checking undefined contents for template/element @isClosed="true". Match context that we did not already match -->
   <rule fpi="RUL-QQQ"
         context="*[hl7:substanceAdministration[hl7:templateId[@root = '1.2.40.0.34.6.0.11.3.72'] and hl7:templateId[@root = '2.16.840.1.113883.10.20.1.24'] and hl7:templateId[@root = '1.3.6.1.4.1.19376.1.5.3.1.4.7'] and hl7:templateId[@root = '1.3.6.1.4.1.19376.1.9.1.3.16'] and hl7:templateId[@root = '1.3.6.1.4.1.19376.1.5.3.1.4.7.1']]]/hl7:substanceAdministration[hl7:templateId[@root = '1.2.40.0.34.6.0.11.3.72'] and hl7:templateId[@root = '2.16.840.1.113883.10.20.1.24'] and hl7:templateId[@root = '1.3.6.1.4.1.19376.1.5.3.1.4.7'] and hl7:templateId[@root = '1.3.6.1.4.1.19376.1.9.1.3.16'] and hl7:templateId[@root = '1.3.6.1.4.1.19376.1.5.3.1.4.7.1']]/hl7:entryRelationship[@typeCode='REFR'][hl7:substanceAdministration/hl7:templateId[@root='1.3.6.1.4.1.19376.1.9.1.3.14']]/hl7:substanceAdministration[hl7:templateId[@root = '1.3.6.1.4.1.19376.1.9.1.3.14']]/*[not(@xsi:nil = 'true')][not(self::hl7:templateId[@root = '1.3.6.1.4.1.19376.1.9.1.3.14'] | self::hl7:id[not(@nullFlavor)] | self::hl7:code[(@code = 'CMAItem' and @codeSystem = '1.3.6.1.4.1.19376.1.9.2.2')] | self::hl7:consumable[not(@nullFlavor)][hl7:manufacturedProduct])]"
         id="d41e47759-true-d3569748e0">
      <assert role="error"
              see="http://elga.art-decor.org/elgatgd-html-20240709T111220/tmp-1.2.40.0.34.6.0.11.3.72-2021-02-19T125222.html"
              test="not(.)">(atcdabbr_entry_MedikationsEinnahmeEntry)/d41e47759-true-d3569748e0: '<value-of select="name(..)"/>' ist als geschlossen definiert und dieses Element '<name/>' ist nicht erlaubt oder nicht mit diesem Inhalt erlaubt. Dies kann templateId, code oder id betreffen. Erwartet:  hl7:templateId[@root = '1.3.6.1.4.1.19376.1.9.1.3.14'] | hl7:id[not(@nullFlavor)] | hl7:code[(@code = 'CMAItem' and @codeSystem = '1.3.6.1.4.1.19376.1.9.2.2')] | hl7:consumable[not(@nullFlavor)][hl7:manufacturedProduct] (rule-reference: d41e47759-true-d3569748e0)</assert>
   </rule>

   <!-- Checking undefined contents for template/element @isClosed="true". Match context that we did not already match -->
   <rule fpi="RUL-QQQ"
         context="*[hl7:substanceAdministration[hl7:templateId[@root = '1.2.40.0.34.6.0.11.3.72'] and hl7:templateId[@root = '2.16.840.1.113883.10.20.1.24'] and hl7:templateId[@root = '1.3.6.1.4.1.19376.1.5.3.1.4.7'] and hl7:templateId[@root = '1.3.6.1.4.1.19376.1.9.1.3.16'] and hl7:templateId[@root = '1.3.6.1.4.1.19376.1.5.3.1.4.7.1']]]/hl7:substanceAdministration[hl7:templateId[@root = '1.2.40.0.34.6.0.11.3.72'] and hl7:templateId[@root = '2.16.840.1.113883.10.20.1.24'] and hl7:templateId[@root = '1.3.6.1.4.1.19376.1.5.3.1.4.7'] and hl7:templateId[@root = '1.3.6.1.4.1.19376.1.9.1.3.16'] and hl7:templateId[@root = '1.3.6.1.4.1.19376.1.5.3.1.4.7.1']]/hl7:entryRelationship[@typeCode='REFR'][hl7:substanceAdministration/hl7:templateId[@root='1.3.6.1.4.1.19376.1.9.1.3.14']]/hl7:substanceAdministration[hl7:templateId[@root = '1.3.6.1.4.1.19376.1.9.1.3.14']]/hl7:consumable[not(@nullFlavor)][hl7:manufacturedProduct]/*[not(@xsi:nil = 'true')][not(self::hl7:manufacturedProduct[not(@nullFlavor)][hl7:manufacturedMaterial[@nullFlavor = 'NA']])]"
         id="d41e47796-true-d3569779e0">
      <assert role="error"
              see="http://elga.art-decor.org/elgatgd-html-20240709T111220/tmp-1.2.40.0.34.6.0.11.3.72-2021-02-19T125222.html"
              test="not(.)">(atcdabbr_entry_MedikationsEinnahmeEntry)/d41e47796-true-d3569779e0: '<value-of select="name(..)"/>' ist als geschlossen definiert und dieses Element '<name/>' ist nicht erlaubt oder nicht mit diesem Inhalt erlaubt. Dies kann templateId, code oder id betreffen. Erwartet:  hl7:manufacturedProduct[not(@nullFlavor)][hl7:manufacturedMaterial[@nullFlavor = 'NA']] (rule-reference: d41e47796-true-d3569779e0)</assert>
   </rule>

   <!-- Checking undefined contents for template/element @isClosed="true". Match context that we did not already match -->
   <rule fpi="RUL-QQQ"
         context="*[hl7:substanceAdministration[hl7:templateId[@root = '1.2.40.0.34.6.0.11.3.72'] and hl7:templateId[@root = '2.16.840.1.113883.10.20.1.24'] and hl7:templateId[@root = '1.3.6.1.4.1.19376.1.5.3.1.4.7'] and hl7:templateId[@root = '1.3.6.1.4.1.19376.1.9.1.3.16'] and hl7:templateId[@root = '1.3.6.1.4.1.19376.1.5.3.1.4.7.1']]]/hl7:substanceAdministration[hl7:templateId[@root = '1.2.40.0.34.6.0.11.3.72'] and hl7:templateId[@root = '2.16.840.1.113883.10.20.1.24'] and hl7:templateId[@root = '1.3.6.1.4.1.19376.1.5.3.1.4.7'] and hl7:templateId[@root = '1.3.6.1.4.1.19376.1.9.1.3.16'] and hl7:templateId[@root = '1.3.6.1.4.1.19376.1.5.3.1.4.7.1']]/hl7:entryRelationship[@typeCode='REFR'][hl7:substanceAdministration/hl7:templateId[@root='1.3.6.1.4.1.19376.1.9.1.3.14']]/hl7:substanceAdministration[hl7:templateId[@root = '1.3.6.1.4.1.19376.1.9.1.3.14']]/hl7:consumable[not(@nullFlavor)][hl7:manufacturedProduct]/hl7:manufacturedProduct[not(@nullFlavor)][hl7:manufacturedMaterial[@nullFlavor = 'NA']]/*[not(@xsi:nil = 'true')][not(self::hl7:manufacturedMaterial[@nullFlavor = 'NA'])]"
         id="d41e47798-true-d3569793e0">
      <assert role="error"
              see="http://elga.art-decor.org/elgatgd-html-20240709T111220/tmp-1.2.40.0.34.6.0.11.3.72-2021-02-19T125222.html"
              test="not(.)">(atcdabbr_entry_MedikationsEinnahmeEntry)/d41e47798-true-d3569793e0: '<value-of select="name(..)"/>' ist als geschlossen definiert und dieses Element '<name/>' ist nicht erlaubt oder nicht mit diesem Inhalt erlaubt. Dies kann templateId, code oder id betreffen. Erwartet:  hl7:manufacturedMaterial[@nullFlavor = 'NA'] (rule-reference: d41e47798-true-d3569793e0)</assert>
   </rule>

   <!-- Checking undefined contents for template/element @isClosed="true". Match context that we did not already match -->
   <rule fpi="RUL-QQQ"
         context="*[hl7:substanceAdministration[hl7:templateId[@root = '1.2.40.0.34.6.0.11.3.72'] and hl7:templateId[@root = '2.16.840.1.113883.10.20.1.24'] and hl7:templateId[@root = '1.3.6.1.4.1.19376.1.5.3.1.4.7'] and hl7:templateId[@root = '1.3.6.1.4.1.19376.1.9.1.3.16'] and hl7:templateId[@root = '1.3.6.1.4.1.19376.1.5.3.1.4.7.1']]]/hl7:substanceAdministration[hl7:templateId[@root = '1.2.40.0.34.6.0.11.3.72'] and hl7:templateId[@root = '2.16.840.1.113883.10.20.1.24'] and hl7:templateId[@root = '1.3.6.1.4.1.19376.1.5.3.1.4.7'] and hl7:templateId[@root = '1.3.6.1.4.1.19376.1.9.1.3.16'] and hl7:templateId[@root = '1.3.6.1.4.1.19376.1.5.3.1.4.7.1']]/hl7:reference[@typeCode = 'XCRPT'][hl7:externalDocument]/*[not(@xsi:nil = 'true')][not(self::hl7:externalDocument[not(@nullFlavor)])]"
         id="d41e47809-true-d3569812e0">
      <assert role="error"
              see="http://elga.art-decor.org/elgatgd-html-20240709T111220/tmp-1.2.40.0.34.6.0.11.3.72-2021-02-19T125222.html"
              test="not(.)">(atcdabbr_entry_MedikationsEinnahmeEntry)/d41e47809-true-d3569812e0: '<value-of select="name(..)"/>' ist als geschlossen definiert und dieses Element '<name/>' ist nicht erlaubt oder nicht mit diesem Inhalt erlaubt. Dies kann templateId, code oder id betreffen. Erwartet:  hl7:externalDocument[not(@nullFlavor)] (rule-reference: d41e47809-true-d3569812e0)</assert>
   </rule>

   <!-- Checking undefined contents for template/element @isClosed="true". Match context that we did not already match -->
   <rule fpi="RUL-QQQ"
         context="*[hl7:substanceAdministration[hl7:templateId[@root = '1.2.40.0.34.6.0.11.3.72'] and hl7:templateId[@root = '2.16.840.1.113883.10.20.1.24'] and hl7:templateId[@root = '1.3.6.1.4.1.19376.1.5.3.1.4.7'] and hl7:templateId[@root = '1.3.6.1.4.1.19376.1.9.1.3.16'] and hl7:templateId[@root = '1.3.6.1.4.1.19376.1.5.3.1.4.7.1']]]/hl7:substanceAdministration[hl7:templateId[@root = '1.2.40.0.34.6.0.11.3.72'] and hl7:templateId[@root = '2.16.840.1.113883.10.20.1.24'] and hl7:templateId[@root = '1.3.6.1.4.1.19376.1.5.3.1.4.7'] and hl7:templateId[@root = '1.3.6.1.4.1.19376.1.9.1.3.16'] and hl7:templateId[@root = '1.3.6.1.4.1.19376.1.5.3.1.4.7.1']]/hl7:reference[@typeCode = 'XCRPT'][hl7:externalDocument]/hl7:externalDocument[not(@nullFlavor)]/*[not(@xsi:nil = 'true')][not(self::hl7:id[not(@nullFlavor)])]"
         id="d41e47821-true-d3569826e0">
      <assert role="error"
              see="http://elga.art-decor.org/elgatgd-html-20240709T111220/tmp-1.2.40.0.34.6.0.11.3.72-2021-02-19T125222.html"
              test="not(.)">(atcdabbr_entry_MedikationsEinnahmeEntry)/d41e47821-true-d3569826e0: '<value-of select="name(..)"/>' ist als geschlossen definiert und dieses Element '<name/>' ist nicht erlaubt oder nicht mit diesem Inhalt erlaubt. Dies kann templateId, code oder id betreffen. Erwartet:  hl7:id[not(@nullFlavor)] (rule-reference: d41e47821-true-d3569826e0)</assert>
   </rule>

   <!-- Checking undefined contents for template/element @isClosed="true". Match context that we did not already match -->
   <rule fpi="RUL-QQQ"
         context="*[hl7:substanceAdministration[hl7:templateId[@root = '1.2.40.0.34.6.0.11.3.72'] and hl7:templateId[@root = '2.16.840.1.113883.10.20.1.24'] and hl7:templateId[@root = '1.3.6.1.4.1.19376.1.5.3.1.4.7'] and hl7:templateId[@root = '1.3.6.1.4.1.19376.1.9.1.3.16'] and hl7:templateId[@root = '1.3.6.1.4.1.19376.1.5.3.1.4.7.1']]]/hl7:substanceAdministration[hl7:templateId[@root = '1.2.40.0.34.6.0.11.3.72'] and hl7:templateId[@root = '2.16.840.1.113883.10.20.1.24'] and hl7:templateId[@root = '1.3.6.1.4.1.19376.1.5.3.1.4.7'] and hl7:templateId[@root = '1.3.6.1.4.1.19376.1.9.1.3.16'] and hl7:templateId[@root = '1.3.6.1.4.1.19376.1.5.3.1.4.7.1']]/hl7:precondition[hl7:criterion]/*[not(@xsi:nil = 'true')][not(self::hl7:criterion[not(@nullFlavor)])]"
         id="d41e47833-true-d3569845e0">
      <assert role="error"
              see="http://elga.art-decor.org/elgatgd-html-20240709T111220/tmp-1.2.40.0.34.6.0.11.3.72-2021-02-19T125222.html"
              test="not(.)">(atcdabbr_entry_MedikationsEinnahmeEntry)/d41e47833-true-d3569845e0: '<value-of select="name(..)"/>' ist als geschlossen definiert und dieses Element '<name/>' ist nicht erlaubt oder nicht mit diesem Inhalt erlaubt. Dies kann templateId, code oder id betreffen. Erwartet:  hl7:criterion[not(@nullFlavor)] (rule-reference: d41e47833-true-d3569845e0)</assert>
   </rule>

   <!-- Checking undefined contents for template/element @isClosed="true". Match context that we did not already match -->
   <rule fpi="RUL-QQQ"
         context="*[hl7:substanceAdministration[hl7:templateId[@root = '1.2.40.0.34.6.0.11.3.72'] and hl7:templateId[@root = '2.16.840.1.113883.10.20.1.24'] and hl7:templateId[@root = '1.3.6.1.4.1.19376.1.5.3.1.4.7'] and hl7:templateId[@root = '1.3.6.1.4.1.19376.1.9.1.3.16'] and hl7:templateId[@root = '1.3.6.1.4.1.19376.1.5.3.1.4.7.1']]]/hl7:substanceAdministration[hl7:templateId[@root = '1.2.40.0.34.6.0.11.3.72'] and hl7:templateId[@root = '2.16.840.1.113883.10.20.1.24'] and hl7:templateId[@root = '1.3.6.1.4.1.19376.1.5.3.1.4.7'] and hl7:templateId[@root = '1.3.6.1.4.1.19376.1.9.1.3.16'] and hl7:templateId[@root = '1.3.6.1.4.1.19376.1.5.3.1.4.7.1']]/hl7:precondition[hl7:criterion]/hl7:criterion[not(@nullFlavor)]/*[not(@xsi:nil = 'true')][not(self::hl7:text[not(@nullFlavor)])]"
         id="d41e47838-true-d3569859e0">
      <assert role="error"
              see="http://elga.art-decor.org/elgatgd-html-20240709T111220/tmp-1.2.40.0.34.6.0.11.3.72-2021-02-19T125222.html"
              test="not(.)">(atcdabbr_entry_MedikationsEinnahmeEntry)/d41e47838-true-d3569859e0: '<value-of select="name(..)"/>' ist als geschlossen definiert und dieses Element '<name/>' ist nicht erlaubt oder nicht mit diesem Inhalt erlaubt. Dies kann templateId, code oder id betreffen. Erwartet:  hl7:text[not(@nullFlavor)] (rule-reference: d41e47838-true-d3569859e0)</assert>
   </rule>

   <!-- Checking undefined contents for template/element @isClosed="true". Match context that we did not already match -->
   <rule fpi="RUL-QQQ"
         context="*[hl7:substanceAdministration[hl7:templateId[@root = '1.2.40.0.34.6.0.11.3.72'] and hl7:templateId[@root = '2.16.840.1.113883.10.20.1.24'] and hl7:templateId[@root = '1.3.6.1.4.1.19376.1.5.3.1.4.7'] and hl7:templateId[@root = '1.3.6.1.4.1.19376.1.9.1.3.16'] and hl7:templateId[@root = '1.3.6.1.4.1.19376.1.5.3.1.4.7.1']]]/hl7:substanceAdministration[hl7:templateId[@root = '1.2.40.0.34.6.0.11.3.72'] and hl7:templateId[@root = '2.16.840.1.113883.10.20.1.24'] and hl7:templateId[@root = '1.3.6.1.4.1.19376.1.5.3.1.4.7'] and hl7:templateId[@root = '1.3.6.1.4.1.19376.1.9.1.3.16'] and hl7:templateId[@root = '1.3.6.1.4.1.19376.1.5.3.1.4.7.1']]/hl7:precondition[hl7:criterion]/hl7:criterion[not(@nullFlavor)]/hl7:text[not(@nullFlavor)]/*[not(@xsi:nil = 'true')][not(self::hl7:reference[not(@nullFlavor)])]"
         id="d41e47840-true-d3569873e0">
      <assert role="error"
              see="http://elga.art-decor.org/elgatgd-html-20240709T111220/tmp-1.2.40.0.34.6.0.11.3.72-2021-02-19T125222.html"
              test="not(.)">(atcdabbr_entry_MedikationsEinnahmeEntry)/d41e47840-true-d3569873e0: '<value-of select="name(..)"/>' ist als geschlossen definiert und dieses Element '<name/>' ist nicht erlaubt oder nicht mit diesem Inhalt erlaubt. Dies kann templateId, code oder id betreffen. Erwartet:  hl7:reference[not(@nullFlavor)] (rule-reference: d41e47840-true-d3569873e0)</assert>
   </rule>
</pattern>
