<?xml version="1.0" encoding="UTF-8"?>
<!--
Template derived pattern
===========================================
ID: 1.2.40.0.34.6.0.11.3.53
Name: Logo Entry
Description: 
-->
<pattern xmlns="http://purl.oclc.org/dsdl/schematron"
         id="template-1.2.40.0.34.6.0.11.3.53-2021-02-19T125155-closed">
   <title>Logo Entry</title>

   <!-- Checking undefined contents for template/element @isClosed="true". Match context that we did not already match -->
   <rule fpi="RUL-QQQ"
         context="*[hl7:observationMedia[hl7:templateId[@root = '1.2.40.0.34.6.0.11.3.53']]]/*[not(@xsi:nil = 'true')][not(self::hl7:observationMedia[hl7:templateId[@root = '1.2.40.0.34.6.0.11.3.53']])]"
         id="d41e40027-true-d2766978e0">
      <assert role="error"
              see="http://elga.art-decor.org/elgatgd-html-20240709T111220/tmp-1.2.40.0.34.6.0.11.3.53-2021-02-19T125155.html"
              test="not(.)">(atcdabbr_entry_Logo)/d41e40027-true-d2766978e0: '<value-of select="name(..)"/>' ist als geschlossen definiert und dieses Element '<name/>' ist nicht erlaubt oder nicht mit diesem Inhalt erlaubt. Dies kann templateId, code oder id betreffen. Erwartet:  hl7:observationMedia[hl7:templateId[@root = '1.2.40.0.34.6.0.11.3.53']] (rule-reference: d41e40027-true-d2766978e0)</assert>
   </rule>

   <!-- Checking undefined contents for template/element @isClosed="true". Match context that we did not already match -->
   <rule fpi="RUL-QQQ"
         context="*[hl7:observationMedia[hl7:templateId[@root = '1.2.40.0.34.6.0.11.3.53']]]/hl7:observationMedia[hl7:templateId[@root = '1.2.40.0.34.6.0.11.3.53']]/*[not(@xsi:nil = 'true')][not(self::hl7:templateId[@root = '1.2.40.0.34.6.0.11.3.53'] | self::hl7:value[not(@nullFlavor)] | self::hl7:performer[hl7:templateId[@root = '1.2.40.0.34.6.0.11.9.17']] | self::hl7:author[hl7:assignedAuthor] | self::hl7:informant | self::hl7:participant[@typeCode][hl7:participantRole])]"
         id="d41e40058-true-d2767466e0">
      <assert role="error"
              see="http://elga.art-decor.org/elgatgd-html-20240709T111220/tmp-1.2.40.0.34.6.0.11.3.53-2021-02-19T125155.html"
              test="not(.)">(atcdabbr_entry_Logo)/d41e40058-true-d2767466e0: '<value-of select="name(..)"/>' ist als geschlossen definiert und dieses Element '<name/>' ist nicht erlaubt oder nicht mit diesem Inhalt erlaubt. Dies kann templateId, code oder id betreffen. Erwartet:  hl7:templateId[@root = '1.2.40.0.34.6.0.11.3.53'] | hl7:value[not(@nullFlavor)] | hl7:performer[hl7:templateId[@root = '1.2.40.0.34.6.0.11.9.17']] | hl7:author[hl7:assignedAuthor] | hl7:informant | hl7:participant[@typeCode][hl7:participantRole] (rule-reference: d41e40058-true-d2767466e0)</assert>
   </rule>

   <!-- Checking undefined contents for template/element @isClosed="true". Match context that we did not already match -->
   <rule fpi="RUL-QQQ"
         context="*[hl7:observationMedia[hl7:templateId[@root = '1.2.40.0.34.6.0.11.3.53']]]/hl7:observationMedia[hl7:templateId[@root = '1.2.40.0.34.6.0.11.3.53']]/hl7:performer[hl7:templateId[@root = '1.2.40.0.34.6.0.11.9.17']]/*[not(@xsi:nil = 'true')][not(self::hl7:templateId[@root = '1.2.40.0.34.6.0.11.9.17'] | self::hl7:time | self::hl7:assignedEntity[not(@nullFlavor)])]"
         id="d41e40103-true-d2767621e0">
      <assert role="error"
              see="http://elga.art-decor.org/elgatgd-html-20240709T111220/tmp-1.2.40.0.34.6.0.11.3.53-2021-02-19T125155.html"
              test="not(.)">(atcdabbr_entry_Logo)/d41e40103-true-d2767621e0: '<value-of select="name(..)"/>' ist als geschlossen definiert und dieses Element '<name/>' ist nicht erlaubt oder nicht mit diesem Inhalt erlaubt. Dies kann templateId, code oder id betreffen. Erwartet:  hl7:templateId[@root = '1.2.40.0.34.6.0.11.9.17'] | hl7:time | hl7:assignedEntity[not(@nullFlavor)] (rule-reference: d41e40103-true-d2767621e0)</assert>
   </rule>

   <!-- Checking undefined contents for template/element @isClosed="true". Match context that we did not already match -->
   <rule fpi="RUL-QQQ"
         context="*[hl7:observationMedia[hl7:templateId[@root = '1.2.40.0.34.6.0.11.3.53']]]/hl7:observationMedia[hl7:templateId[@root = '1.2.40.0.34.6.0.11.3.53']]/hl7:performer[hl7:templateId[@root = '1.2.40.0.34.6.0.11.9.17']]/hl7:assignedEntity[not(@nullFlavor)]/*[not(@xsi:nil = 'true')][not(self::hl7:id[not(@nullFlavor)] | self::hl7:id[@nullFlavor='NI'] | self::hl7:id[@nullFlavor='UNK'] | self::hl7:code | self::hl7:addr | self::hl7:telecom | self::hl7:assignedPerson | self::hl7:assignedPerson | self::hl7:representedOrganization)]"
         id="d2767482e14-true-d2767727e0">
      <assert role="error"
              see="http://elga.art-decor.org/elgatgd-html-20240709T111220/tmp-1.2.40.0.34.6.0.11.3.53-2021-02-19T125155.html"
              test="not(.)">(atcdabbr_entry_Logo)/d2767482e14-true-d2767727e0: '<value-of select="name(..)"/>' ist als geschlossen definiert und dieses Element '<name/>' ist nicht erlaubt oder nicht mit diesem Inhalt erlaubt. Dies kann templateId, code oder id betreffen. Erwartet:  hl7:id[not(@nullFlavor)] | hl7:id[@nullFlavor='NI'] | hl7:id[@nullFlavor='UNK'] | hl7:code | hl7:addr | hl7:telecom | hl7:assignedPerson | hl7:assignedPerson | hl7:representedOrganization (rule-reference: d2767482e14-true-d2767727e0)</assert>
   </rule>

   <!-- Checking undefined contents for template/element @isClosed="true". Match context that we did not already match -->
   <rule fpi="RUL-QQQ"
         context="*[hl7:observationMedia[hl7:templateId[@root = '1.2.40.0.34.6.0.11.3.53']]]/hl7:observationMedia[hl7:templateId[@root = '1.2.40.0.34.6.0.11.3.53']]/hl7:performer[hl7:templateId[@root = '1.2.40.0.34.6.0.11.9.17']]/hl7:assignedEntity[not(@nullFlavor)]/hl7:addr/*[not(@xsi:nil = 'true')][not(self::hl7:streetAddressLine | self::hl7:streetName | self::hl7:houseNumber | self::hl7:postalCode | self::hl7:city | self::hl7:state | self::hl7:country | self::hl7:additionalLocator)]"
         id="d2767731e101-true-d2767800e0">
      <assert role="error"
              see="http://elga.art-decor.org/elgatgd-html-20240709T111220/tmp-1.2.40.0.34.6.0.11.3.53-2021-02-19T125155.html"
              test="not(.)">(atcdabbr_entry_Logo)/d2767731e101-true-d2767800e0: '<value-of select="name(..)"/>' ist als geschlossen definiert und dieses Element '<name/>' ist nicht erlaubt oder nicht mit diesem Inhalt erlaubt. Dies kann templateId, code oder id betreffen. Erwartet:  hl7:streetAddressLine | hl7:streetName | hl7:houseNumber | hl7:postalCode | hl7:city | hl7:state | hl7:country | hl7:additionalLocator (rule-reference: d2767731e101-true-d2767800e0)</assert>
   </rule>

   <!-- Checking undefined contents for template/element @isClosed="true". Match context that we did not already match -->
   <rule fpi="RUL-QQQ"
         context="*[hl7:observationMedia[hl7:templateId[@root = '1.2.40.0.34.6.0.11.3.53']]]/hl7:observationMedia[hl7:templateId[@root = '1.2.40.0.34.6.0.11.3.53']]/hl7:performer[hl7:templateId[@root = '1.2.40.0.34.6.0.11.9.17']]/hl7:assignedEntity[not(@nullFlavor)]/hl7:assignedPerson/*[not(@xsi:nil = 'true')][not(self::hl7:name[not(@nullFlavor)])]"
         id="d2767731e174-true-d2767876e0">
      <assert role="error"
              see="http://elga.art-decor.org/elgatgd-html-20240709T111220/tmp-1.2.40.0.34.6.0.11.9.16-2021-05-26T140421.html"
              test="not(.)">( atcdabbr_other_AssignedEntityBody)/d2767731e174-true-d2767876e0: '<value-of select="name(..)"/>' ist als geschlossen definiert und dieses Element '<name/>' ist nicht erlaubt oder nicht mit diesem Inhalt erlaubt. Dies kann templateId, code oder id betreffen. Erwartet:  hl7:name[not(@nullFlavor)] (rule-reference: d2767731e174-true-d2767876e0)</assert>
   </rule>

   <!-- Checking undefined contents for template/element @isClosed="true". Match context that we did not already match -->
   <rule fpi="RUL-QQQ"
         context="*[hl7:observationMedia[hl7:templateId[@root = '1.2.40.0.34.6.0.11.3.53']]]/hl7:observationMedia[hl7:templateId[@root = '1.2.40.0.34.6.0.11.3.53']]/hl7:performer[hl7:templateId[@root = '1.2.40.0.34.6.0.11.9.17']]/hl7:assignedEntity[not(@nullFlavor)]/hl7:assignedPerson/*[not(@xsi:nil = 'true')][not(self::hl7:name[not(@nullFlavor)])]"
         id="d2767731e186-true-d2767898e0">
      <assert role="error"
              see="http://elga.art-decor.org/elgatgd-html-20240709T111220/tmp-1.2.40.0.34.6.0.11.9.16-2021-05-26T140421.html"
              test="not(.)">( atcdabbr_other_AssignedEntityBody)/d2767731e186-true-d2767898e0: '<value-of select="name(..)"/>' ist als geschlossen definiert und dieses Element '<name/>' ist nicht erlaubt oder nicht mit diesem Inhalt erlaubt. Dies kann templateId, code oder id betreffen. Erwartet:  hl7:name[not(@nullFlavor)] (rule-reference: d2767731e186-true-d2767898e0)</assert>
   </rule>

   <!-- Checking undefined contents for template/element @isClosed="true". Match context that we did not already match -->
   <rule fpi="RUL-QQQ"
         context="*[hl7:observationMedia[hl7:templateId[@root = '1.2.40.0.34.6.0.11.3.53']]]/hl7:observationMedia[hl7:templateId[@root = '1.2.40.0.34.6.0.11.3.53']]/hl7:performer[hl7:templateId[@root = '1.2.40.0.34.6.0.11.9.17']]/hl7:assignedEntity[not(@nullFlavor)]/hl7:assignedPerson/hl7:name[not(@nullFlavor)]/*[not(@xsi:nil = 'true')][not(self::hl7:prefix | self::hl7:family[not(@nullFlavor)] | self::hl7:given[not(@nullFlavor)] | self::hl7:suffix)]"
         id="d2767886e12-true-d2767927e0">
      <assert role="error"
              see="http://elga.art-decor.org/elgatgd-html-20240709T111220/tmp-1.2.40.0.34.6.0.11.9.16-2021-05-26T140421.html"
              test="not(.)">( atcdabbr_other_AssignedEntityBody)/d2767886e12-true-d2767927e0: '<value-of select="name(..)"/>' ist als geschlossen definiert und dieses Element '<name/>' ist nicht erlaubt oder nicht mit diesem Inhalt erlaubt. Dies kann templateId, code oder id betreffen. Erwartet:  hl7:prefix | hl7:family[not(@nullFlavor)] | hl7:given[not(@nullFlavor)] | hl7:suffix (rule-reference: d2767886e12-true-d2767927e0)</assert>
   </rule>

   <!-- Checking undefined contents for template/element @isClosed="true". Match context that we did not already match -->
   <rule fpi="RUL-QQQ"
         context="*[hl7:observationMedia[hl7:templateId[@root = '1.2.40.0.34.6.0.11.3.53']]]/hl7:observationMedia[hl7:templateId[@root = '1.2.40.0.34.6.0.11.3.53']]/hl7:performer[hl7:templateId[@root = '1.2.40.0.34.6.0.11.9.17']]/hl7:assignedEntity[not(@nullFlavor)]/hl7:representedOrganization/*[not(@xsi:nil = 'true')][not(self::hl7:id[not(@nullFlavor)] | self::hl7:name[not(@nullFlavor)] | self::hl7:telecom[not(@nullFlavor)] | self::hl7:addr[not(@nullFlavor)])]"
         id="d2767731e198-true-d2767978e0">
      <assert role="error"
              see="http://elga.art-decor.org/elgatgd-html-20240709T111220/tmp-1.2.40.0.34.6.0.11.3.53-2021-02-19T125155.html"
              test="not(.)">(atcdabbr_entry_Logo)/d2767731e198-true-d2767978e0: '<value-of select="name(..)"/>' ist als geschlossen definiert und dieses Element '<name/>' ist nicht erlaubt oder nicht mit diesem Inhalt erlaubt. Dies kann templateId, code oder id betreffen. Erwartet:  hl7:id[not(@nullFlavor)] | hl7:name[not(@nullFlavor)] | hl7:telecom[not(@nullFlavor)] | hl7:addr[not(@nullFlavor)] (rule-reference: d2767731e198-true-d2767978e0)</assert>
   </rule>

   <!-- Checking undefined contents for template/element @isClosed="true". Match context that we did not already match -->
   <rule fpi="RUL-QQQ"
         context="*[hl7:observationMedia[hl7:templateId[@root = '1.2.40.0.34.6.0.11.3.53']]]/hl7:observationMedia[hl7:templateId[@root = '1.2.40.0.34.6.0.11.3.53']]/hl7:performer[hl7:templateId[@root = '1.2.40.0.34.6.0.11.9.17']]/hl7:assignedEntity[not(@nullFlavor)]/hl7:representedOrganization/hl7:addr[not(@nullFlavor)]/*[not(@xsi:nil = 'true')][not(self::hl7:streetAddressLine | self::hl7:streetName | self::hl7:houseNumber | self::hl7:postalCode | self::hl7:city | self::hl7:state | self::hl7:country | self::hl7:additionalLocator)]"
         id="d2767952e58-true-d2768039e0">
      <assert role="error"
              see="http://elga.art-decor.org/elgatgd-html-20240709T111220/tmp-1.2.40.0.34.6.0.11.3.53-2021-02-19T125155.html"
              test="not(.)">(atcdabbr_entry_Logo)/d2767952e58-true-d2768039e0: '<value-of select="name(..)"/>' ist als geschlossen definiert und dieses Element '<name/>' ist nicht erlaubt oder nicht mit diesem Inhalt erlaubt. Dies kann templateId, code oder id betreffen. Erwartet:  hl7:streetAddressLine | hl7:streetName | hl7:houseNumber | hl7:postalCode | hl7:city | hl7:state | hl7:country | hl7:additionalLocator (rule-reference: d2767952e58-true-d2768039e0)</assert>
   </rule>

   <!-- Checking undefined contents for template/element @isClosed="true". Match context that we did not already match -->
   <rule fpi="RUL-QQQ"
         context="*[hl7:observationMedia[hl7:templateId[@root = '1.2.40.0.34.6.0.11.3.53']]]/hl7:observationMedia[hl7:templateId[@root = '1.2.40.0.34.6.0.11.3.53']]/hl7:author[hl7:assignedAuthor]/*[not(@xsi:nil = 'true')][not(self::hl7:functionCode | self::hl7:time[not(@nullFlavor)] | self::hl7:time[@nullFlavor='UNK'] | self::hl7:assignedAuthor)]"
         id="d41e40106-true-d2768206e0">
      <assert role="error"
              see="http://elga.art-decor.org/elgatgd-html-20240709T111220/tmp-1.2.40.0.34.6.0.11.3.53-2021-02-19T125155.html"
              test="not(.)">(atcdabbr_entry_Logo)/d41e40106-true-d2768206e0: '<value-of select="name(..)"/>' ist als geschlossen definiert und dieses Element '<name/>' ist nicht erlaubt oder nicht mit diesem Inhalt erlaubt. Dies kann templateId, code oder id betreffen. Erwartet:  hl7:functionCode | hl7:time[not(@nullFlavor)] | hl7:time[@nullFlavor='UNK'] | hl7:assignedAuthor (rule-reference: d41e40106-true-d2768206e0)</assert>
   </rule>

   <!-- Checking undefined contents for template/element @isClosed="true". Match context that we did not already match -->
   <rule fpi="RUL-QQQ"
         context="*[hl7:observationMedia[hl7:templateId[@root = '1.2.40.0.34.6.0.11.3.53']]]/hl7:observationMedia[hl7:templateId[@root = '1.2.40.0.34.6.0.11.3.53']]/hl7:author[hl7:assignedAuthor]/hl7:assignedAuthor/*[not(@xsi:nil = 'true')][not(self::hl7:id[not(@nullFlavor)] | self::hl7:id[@nullFlavor='UNK'] | self::hl7:code[not(@nullFlavor)] | self::hl7:addr[not(@nullFlavor)] | self::hl7:telecom[not(@nullFlavor)] | self::hl7:assignedPerson | self::hl7:assignedAuthoringDevice | self::hl7:representedOrganization)]"
         id="d2768084e41-true-d2768314e0">
      <assert role="error"
              see="http://elga.art-decor.org/elgatgd-html-20240709T111220/tmp-1.2.40.0.34.6.0.11.3.53-2021-02-19T125155.html"
              test="not(.)">(atcdabbr_entry_Logo)/d2768084e41-true-d2768314e0: '<value-of select="name(..)"/>' ist als geschlossen definiert und dieses Element '<name/>' ist nicht erlaubt oder nicht mit diesem Inhalt erlaubt. Dies kann templateId, code oder id betreffen. Erwartet:  hl7:id[not(@nullFlavor)] | hl7:id[@nullFlavor='UNK'] | hl7:code[not(@nullFlavor)] | hl7:addr[not(@nullFlavor)] | hl7:telecom[not(@nullFlavor)] | hl7:assignedPerson | hl7:assignedAuthoringDevice | hl7:representedOrganization (rule-reference: d2768084e41-true-d2768314e0)</assert>
   </rule>

   <!-- Checking undefined contents for template/element @isClosed="true". Match context that we did not already match -->
   <rule fpi="RUL-QQQ"
         context="*[hl7:observationMedia[hl7:templateId[@root = '1.2.40.0.34.6.0.11.3.53']]]/hl7:observationMedia[hl7:templateId[@root = '1.2.40.0.34.6.0.11.3.53']]/hl7:author[hl7:assignedAuthor]/hl7:assignedAuthor/hl7:addr[not(@nullFlavor)]/*[not(@xsi:nil = 'true')][not(self::hl7:streetAddressLine | self::hl7:streetName | self::hl7:houseNumber | self::hl7:postalCode[not(@nullFlavor)] | self::hl7:city[not(@nullFlavor)] | self::hl7:state | self::hl7:country[not(@nullFlavor)] | self::hl7:additionalLocator)]"
         id="d2768084e60-true-d2768373e0">
      <assert role="error"
              see="http://elga.art-decor.org/elgatgd-html-20240709T111220/tmp-1.2.40.0.34.6.0.11.3.53-2021-02-19T125155.html"
              test="not(.)">(atcdabbr_entry_Logo)/d2768084e60-true-d2768373e0: '<value-of select="name(..)"/>' ist als geschlossen definiert und dieses Element '<name/>' ist nicht erlaubt oder nicht mit diesem Inhalt erlaubt. Dies kann templateId, code oder id betreffen. Erwartet:  hl7:streetAddressLine | hl7:streetName | hl7:houseNumber | hl7:postalCode[not(@nullFlavor)] | hl7:city[not(@nullFlavor)] | hl7:state | hl7:country[not(@nullFlavor)] | hl7:additionalLocator (rule-reference: d2768084e60-true-d2768373e0)</assert>
   </rule>

   <!-- Checking undefined contents for template/element @isClosed="true". Match context that we did not already match -->
   <rule fpi="RUL-QQQ"
         context="*[hl7:observationMedia[hl7:templateId[@root = '1.2.40.0.34.6.0.11.3.53']]]/hl7:observationMedia[hl7:templateId[@root = '1.2.40.0.34.6.0.11.3.53']]/hl7:author[hl7:assignedAuthor]/hl7:assignedAuthor/hl7:assignedPerson/*[not(@xsi:nil = 'true')][not(self::hl7:name[not(@nullFlavor)] | self::hl7:name[@nullFlavor='UNK'] | self::hl7:name[@nullFlavor='MSK'])]"
         id="d2768084e106-true-d2768430e0">
      <assert role="error"
              see="http://elga.art-decor.org/elgatgd-html-20240709T111220/tmp-1.2.40.0.34.6.0.11.3.53-2021-02-19T125155.html"
              test="not(.)">(atcdabbr_entry_Logo)/d2768084e106-true-d2768430e0: '<value-of select="name(..)"/>' ist als geschlossen definiert und dieses Element '<name/>' ist nicht erlaubt oder nicht mit diesem Inhalt erlaubt. Dies kann templateId, code oder id betreffen. Erwartet:  hl7:name[not(@nullFlavor)] | hl7:name[@nullFlavor='UNK'] | hl7:name[@nullFlavor='MSK'] (rule-reference: d2768084e106-true-d2768430e0)</assert>
   </rule>

   <!-- Checking undefined contents for template/element @isClosed="true". Match context that we did not already match -->
   <rule fpi="RUL-QQQ"
         context="*[hl7:observationMedia[hl7:templateId[@root = '1.2.40.0.34.6.0.11.3.53']]]/hl7:observationMedia[hl7:templateId[@root = '1.2.40.0.34.6.0.11.3.53']]/hl7:author[hl7:assignedAuthor]/hl7:assignedAuthor/hl7:assignedPerson/hl7:name[not(@nullFlavor)]/*[not(@xsi:nil = 'true')][not(self::hl7:prefix | self::hl7:family[not(@nullFlavor)] | self::hl7:given[not(@nullFlavor)] | self::hl7:suffix)]"
         id="d2768434e92-true-d2768464e0">
      <assert role="error"
              see="http://elga.art-decor.org/elgatgd-html-20240709T111220/tmp-1.2.40.0.34.6.0.11.9.6-2023-03-31T111555.html"
              test="not(.)">(atcdabbr_other_PersonNameCompilationG2)/d2768434e92-true-d2768464e0: '<value-of select="name(..)"/>' ist als geschlossen definiert und dieses Element '<name/>' ist nicht erlaubt oder nicht mit diesem Inhalt erlaubt. Dies kann templateId, code oder id betreffen. Erwartet:  hl7:prefix | hl7:family[not(@nullFlavor)] | hl7:given[not(@nullFlavor)] | hl7:suffix (rule-reference: d2768434e92-true-d2768464e0)</assert>
   </rule>

   <!-- Checking undefined contents for template/element @isClosed="true". Match context that we did not already match -->
   <rule fpi="RUL-QQQ"
         context="*[hl7:observationMedia[hl7:templateId[@root = '1.2.40.0.34.6.0.11.3.53']]]/hl7:observationMedia[hl7:templateId[@root = '1.2.40.0.34.6.0.11.3.53']]/hl7:author[hl7:assignedAuthor]/hl7:assignedAuthor/hl7:assignedAuthoringDevice/*[not(@xsi:nil = 'true')][not(self::hl7:manufacturerModelName[not(@nullFlavor)] | self::hl7:softwareName[not(@nullFlavor)])]"
         id="d2768084e129-true-d2768512e0">
      <assert role="error"
              see="http://elga.art-decor.org/elgatgd-html-20240709T111220/tmp-1.2.40.0.34.6.0.11.3.53-2021-02-19T125155.html"
              test="not(.)">(atcdabbr_entry_Logo)/d2768084e129-true-d2768512e0: '<value-of select="name(..)"/>' ist als geschlossen definiert und dieses Element '<name/>' ist nicht erlaubt oder nicht mit diesem Inhalt erlaubt. Dies kann templateId, code oder id betreffen. Erwartet:  hl7:manufacturerModelName[not(@nullFlavor)] | hl7:softwareName[not(@nullFlavor)] (rule-reference: d2768084e129-true-d2768512e0)</assert>
   </rule>

   <!-- Checking undefined contents for template/element @isClosed="true". Match context that we did not already match -->
   <rule fpi="RUL-QQQ"
         context="*[hl7:observationMedia[hl7:templateId[@root = '1.2.40.0.34.6.0.11.3.53']]]/hl7:observationMedia[hl7:templateId[@root = '1.2.40.0.34.6.0.11.3.53']]/hl7:author[hl7:assignedAuthor]/hl7:assignedAuthor/hl7:representedOrganization/*[not(@xsi:nil = 'true')][not(self::hl7:id[not(@nullFlavor)] | self::hl7:name[not(@nullFlavor)] | self::hl7:telecom[not(@nullFlavor)] | self::hl7:addr[not(@nullFlavor)])]"
         id="d2768084e145-true-d2768557e0">
      <assert role="error"
              see="http://elga.art-decor.org/elgatgd-html-20240709T111220/tmp-1.2.40.0.34.6.0.11.3.53-2021-02-19T125155.html"
              test="not(.)">(atcdabbr_entry_Logo)/d2768084e145-true-d2768557e0: '<value-of select="name(..)"/>' ist als geschlossen definiert und dieses Element '<name/>' ist nicht erlaubt oder nicht mit diesem Inhalt erlaubt. Dies kann templateId, code oder id betreffen. Erwartet:  hl7:id[not(@nullFlavor)] | hl7:name[not(@nullFlavor)] | hl7:telecom[not(@nullFlavor)] | hl7:addr[not(@nullFlavor)] (rule-reference: d2768084e145-true-d2768557e0)</assert>
   </rule>

   <!-- Checking undefined contents for template/element @isClosed="true". Match context that we did not already match -->
   <rule fpi="RUL-QQQ"
         context="*[hl7:observationMedia[hl7:templateId[@root = '1.2.40.0.34.6.0.11.3.53']]]/hl7:observationMedia[hl7:templateId[@root = '1.2.40.0.34.6.0.11.3.53']]/hl7:author[hl7:assignedAuthor]/hl7:assignedAuthor/hl7:representedOrganization/hl7:addr[not(@nullFlavor)]/*[not(@xsi:nil = 'true')][not(self::hl7:streetAddressLine | self::hl7:streetName | self::hl7:houseNumber | self::hl7:postalCode[not(@nullFlavor)] | self::hl7:city[not(@nullFlavor)] | self::hl7:state | self::hl7:country[not(@nullFlavor)] | self::hl7:additionalLocator)]"
         id="d2768527e67-true-d2768620e0">
      <assert role="error"
              see="http://elga.art-decor.org/elgatgd-html-20240709T111220/tmp-1.2.40.0.34.6.0.11.3.53-2021-02-19T125155.html"
              test="not(.)">(atcdabbr_entry_Logo)/d2768527e67-true-d2768620e0: '<value-of select="name(..)"/>' ist als geschlossen definiert und dieses Element '<name/>' ist nicht erlaubt oder nicht mit diesem Inhalt erlaubt. Dies kann templateId, code oder id betreffen. Erwartet:  hl7:streetAddressLine | hl7:streetName | hl7:houseNumber | hl7:postalCode[not(@nullFlavor)] | hl7:city[not(@nullFlavor)] | hl7:state | hl7:country[not(@nullFlavor)] | hl7:additionalLocator (rule-reference: d2768527e67-true-d2768620e0)</assert>
   </rule>

   <!-- Checking undefined contents for template/element @isClosed="true". Match context that we did not already match -->
   <rule fpi="RUL-QQQ"
         context="*[hl7:observationMedia[hl7:templateId[@root = '1.2.40.0.34.6.0.11.3.53']]]/hl7:observationMedia[hl7:templateId[@root = '1.2.40.0.34.6.0.11.3.53']]/hl7:informant/*[not(@xsi:nil = 'true')][not(self::hl7:assignedEntity | self::hl7:relatedEntity[@classCode = 'PRS'])]"
         id="d41e40108-true-d2768788e0">
      <assert role="error"
              see="http://elga.art-decor.org/elgatgd-html-20240709T111220/tmp-1.2.40.0.34.6.0.11.3.53-2021-02-19T125155.html"
              test="not(.)">(atcdabbr_entry_Logo)/d41e40108-true-d2768788e0: '<value-of select="name(..)"/>' ist als geschlossen definiert und dieses Element '<name/>' ist nicht erlaubt oder nicht mit diesem Inhalt erlaubt. Dies kann templateId, code oder id betreffen. Erwartet:  hl7:assignedEntity | hl7:relatedEntity[@classCode = 'PRS'] (rule-reference: d41e40108-true-d2768788e0)</assert>
   </rule>

   <!-- Checking undefined contents for template/element @isClosed="true". Match context that we did not already match -->
   <rule fpi="RUL-QQQ"
         context="*[hl7:observationMedia[hl7:templateId[@root = '1.2.40.0.34.6.0.11.3.53']]]/hl7:observationMedia[hl7:templateId[@root = '1.2.40.0.34.6.0.11.3.53']]/hl7:informant/hl7:assignedEntity/*[not(@xsi:nil = 'true')][not(self::hl7:id[not(@nullFlavor)] | self::hl7:id[@nullFlavor='NI'] | self::hl7:id[@nullFlavor='UNK'] | self::hl7:code | self::hl7:addr | self::hl7:telecom | self::hl7:assignedPerson | self::hl7:assignedPerson | self::hl7:representedOrganization)]"
         id="d2768665e5-true-d2768920e0">
      <assert role="error"
              see="http://elga.art-decor.org/elgatgd-html-20240709T111220/tmp-1.2.40.0.34.6.0.11.3.53-2021-02-19T125155.html"
              test="not(.)">(atcdabbr_entry_Logo)/d2768665e5-true-d2768920e0: '<value-of select="name(..)"/>' ist als geschlossen definiert und dieses Element '<name/>' ist nicht erlaubt oder nicht mit diesem Inhalt erlaubt. Dies kann templateId, code oder id betreffen. Erwartet:  hl7:id[not(@nullFlavor)] | hl7:id[@nullFlavor='NI'] | hl7:id[@nullFlavor='UNK'] | hl7:code | hl7:addr | hl7:telecom | hl7:assignedPerson | hl7:assignedPerson | hl7:representedOrganization (rule-reference: d2768665e5-true-d2768920e0)</assert>
   </rule>

   <!-- Checking undefined contents for template/element @isClosed="true". Match context that we did not already match -->
   <rule fpi="RUL-QQQ"
         context="*[hl7:observationMedia[hl7:templateId[@root = '1.2.40.0.34.6.0.11.3.53']]]/hl7:observationMedia[hl7:templateId[@root = '1.2.40.0.34.6.0.11.3.53']]/hl7:informant/hl7:assignedEntity/hl7:addr/*[not(@xsi:nil = 'true')][not(self::hl7:streetAddressLine | self::hl7:streetName | self::hl7:houseNumber | self::hl7:postalCode | self::hl7:city | self::hl7:state | self::hl7:country | self::hl7:additionalLocator)]"
         id="d2768793e50-true-d2768986e0">
      <assert role="error"
              see="http://elga.art-decor.org/elgatgd-html-20240709T111220/tmp-1.2.40.0.34.6.0.11.3.53-2021-02-19T125155.html"
              test="not(.)">(atcdabbr_entry_Logo)/d2768793e50-true-d2768986e0: '<value-of select="name(..)"/>' ist als geschlossen definiert und dieses Element '<name/>' ist nicht erlaubt oder nicht mit diesem Inhalt erlaubt. Dies kann templateId, code oder id betreffen. Erwartet:  hl7:streetAddressLine | hl7:streetName | hl7:houseNumber | hl7:postalCode | hl7:city | hl7:state | hl7:country | hl7:additionalLocator (rule-reference: d2768793e50-true-d2768986e0)</assert>
   </rule>

   <!-- Checking undefined contents for template/element @isClosed="true". Match context that we did not already match -->
   <rule fpi="RUL-QQQ"
         context="*[hl7:observationMedia[hl7:templateId[@root = '1.2.40.0.34.6.0.11.3.53']]]/hl7:observationMedia[hl7:templateId[@root = '1.2.40.0.34.6.0.11.3.53']]/hl7:informant/hl7:assignedEntity/hl7:assignedPerson/*[not(@xsi:nil = 'true')][not(self::hl7:name[not(@nullFlavor)])]"
         id="d2768793e120-true-d2769048e0">
      <assert role="error"
              see="http://elga.art-decor.org/elgatgd-html-20240709T111220/tmp-1.2.40.0.34.6.0.11.3.53-2021-02-19T125155.html"
              test="not(.)">(atcdabbr_entry_Logo)/d2768793e120-true-d2769048e0: '<value-of select="name(..)"/>' ist als geschlossen definiert und dieses Element '<name/>' ist nicht erlaubt oder nicht mit diesem Inhalt erlaubt. Dies kann templateId, code oder id betreffen. Erwartet:  hl7:name[not(@nullFlavor)] (rule-reference: d2768793e120-true-d2769048e0)</assert>
   </rule>

   <!-- Checking undefined contents for template/element @isClosed="true". Match context that we did not already match -->
   <rule fpi="RUL-QQQ"
         context="*[hl7:observationMedia[hl7:templateId[@root = '1.2.40.0.34.6.0.11.3.53']]]/hl7:observationMedia[hl7:templateId[@root = '1.2.40.0.34.6.0.11.3.53']]/hl7:informant/hl7:assignedEntity/hl7:assignedPerson/*[not(@xsi:nil = 'true')][not(self::hl7:name[not(@nullFlavor)])]"
         id="d2768793e132-true-d2769070e0">
      <assert role="error"
              see="http://elga.art-decor.org/elgatgd-html-20240709T111220/tmp-1.2.40.0.34.6.0.11.3.53-2021-02-19T125155.html"
              test="not(.)">(atcdabbr_entry_Logo)/d2768793e132-true-d2769070e0: '<value-of select="name(..)"/>' ist als geschlossen definiert und dieses Element '<name/>' ist nicht erlaubt oder nicht mit diesem Inhalt erlaubt. Dies kann templateId, code oder id betreffen. Erwartet:  hl7:name[not(@nullFlavor)] (rule-reference: d2768793e132-true-d2769070e0)</assert>
   </rule>

   <!-- Checking undefined contents for template/element @isClosed="true". Match context that we did not already match -->
   <rule fpi="RUL-QQQ"
         context="*[hl7:observationMedia[hl7:templateId[@root = '1.2.40.0.34.6.0.11.3.53']]]/hl7:observationMedia[hl7:templateId[@root = '1.2.40.0.34.6.0.11.3.53']]/hl7:informant/hl7:assignedEntity/hl7:assignedPerson/hl7:name[not(@nullFlavor)]/*[not(@xsi:nil = 'true')][not(self::hl7:prefix | self::hl7:family[not(@nullFlavor)] | self::hl7:given[not(@nullFlavor)] | self::hl7:suffix)]"
         id="d2769058e12-true-d2769099e0">
      <assert role="error"
              see="http://elga.art-decor.org/elgatgd-html-20240709T111220/tmp-1.2.40.0.34.6.0.11.3.53-2021-02-19T125155.html"
              test="not(.)">(atcdabbr_entry_Logo)/d2769058e12-true-d2769099e0: '<value-of select="name(..)"/>' ist als geschlossen definiert und dieses Element '<name/>' ist nicht erlaubt oder nicht mit diesem Inhalt erlaubt. Dies kann templateId, code oder id betreffen. Erwartet:  hl7:prefix | hl7:family[not(@nullFlavor)] | hl7:given[not(@nullFlavor)] | hl7:suffix (rule-reference: d2769058e12-true-d2769099e0)</assert>
   </rule>

   <!-- Checking undefined contents for template/element @isClosed="true". Match context that we did not already match -->
   <rule fpi="RUL-QQQ"
         context="*[hl7:observationMedia[hl7:templateId[@root = '1.2.40.0.34.6.0.11.3.53']]]/hl7:observationMedia[hl7:templateId[@root = '1.2.40.0.34.6.0.11.3.53']]/hl7:informant/hl7:assignedEntity/hl7:representedOrganization/*[not(@xsi:nil = 'true')][not(self::hl7:id[not(@nullFlavor)] | self::hl7:name[not(@nullFlavor)] | self::hl7:telecom[not(@nullFlavor)] | self::hl7:addr[not(@nullFlavor)])]"
         id="d2768793e143-true-d2769150e0">
      <assert role="error"
              see="http://elga.art-decor.org/elgatgd-html-20240709T111220/tmp-1.2.40.0.34.6.0.11.3.53-2021-02-19T125155.html"
              test="not(.)">(atcdabbr_entry_Logo)/d2768793e143-true-d2769150e0: '<value-of select="name(..)"/>' ist als geschlossen definiert und dieses Element '<name/>' ist nicht erlaubt oder nicht mit diesem Inhalt erlaubt. Dies kann templateId, code oder id betreffen. Erwartet:  hl7:id[not(@nullFlavor)] | hl7:name[not(@nullFlavor)] | hl7:telecom[not(@nullFlavor)] | hl7:addr[not(@nullFlavor)] (rule-reference: d2768793e143-true-d2769150e0)</assert>
   </rule>

   <!-- Checking undefined contents for template/element @isClosed="true". Match context that we did not already match -->
   <rule fpi="RUL-QQQ"
         context="*[hl7:observationMedia[hl7:templateId[@root = '1.2.40.0.34.6.0.11.3.53']]]/hl7:observationMedia[hl7:templateId[@root = '1.2.40.0.34.6.0.11.3.53']]/hl7:informant/hl7:assignedEntity/hl7:representedOrganization/hl7:addr[not(@nullFlavor)]/*[not(@xsi:nil = 'true')][not(self::hl7:streetAddressLine | self::hl7:streetName | self::hl7:houseNumber | self::hl7:postalCode | self::hl7:city | self::hl7:state | self::hl7:country | self::hl7:additionalLocator)]"
         id="d2769124e58-true-d2769211e0">
      <assert role="error"
              see="http://elga.art-decor.org/elgatgd-html-20240709T111220/tmp-1.2.40.0.34.6.0.11.3.53-2021-02-19T125155.html"
              test="not(.)">(atcdabbr_entry_Logo)/d2769124e58-true-d2769211e0: '<value-of select="name(..)"/>' ist als geschlossen definiert und dieses Element '<name/>' ist nicht erlaubt oder nicht mit diesem Inhalt erlaubt. Dies kann templateId, code oder id betreffen. Erwartet:  hl7:streetAddressLine | hl7:streetName | hl7:houseNumber | hl7:postalCode | hl7:city | hl7:state | hl7:country | hl7:additionalLocator (rule-reference: d2769124e58-true-d2769211e0)</assert>
   </rule>

   <!-- Checking undefined contents for template/element @isClosed="true". Match context that we did not already match -->
   <rule fpi="RUL-QQQ"
         context="*[hl7:observationMedia[hl7:templateId[@root = '1.2.40.0.34.6.0.11.3.53']]]/hl7:observationMedia[hl7:templateId[@root = '1.2.40.0.34.6.0.11.3.53']]/hl7:informant/hl7:relatedEntity[@classCode = 'PRS']/*[not(@xsi:nil = 'true')][not(self::hl7:code[not(@nullFlavor)] | self::hl7:addr[not(@nullFlavor)] | self::hl7:telecom[not(@nullFlavor)] | self::hl7:relatedPerson)]"
         id="d2768665e7-true-d2769288e0">
      <assert role="error"
              see="http://elga.art-decor.org/elgatgd-html-20240709T111220/tmp-1.2.40.0.34.6.0.11.3.53-2021-02-19T125155.html"
              test="not(.)">(atcdabbr_entry_Logo)/d2768665e7-true-d2769288e0: '<value-of select="name(..)"/>' ist als geschlossen definiert und dieses Element '<name/>' ist nicht erlaubt oder nicht mit diesem Inhalt erlaubt. Dies kann templateId, code oder id betreffen. Erwartet:  hl7:code[not(@nullFlavor)] | hl7:addr[not(@nullFlavor)] | hl7:telecom[not(@nullFlavor)] | hl7:relatedPerson (rule-reference: d2768665e7-true-d2769288e0)</assert>
   </rule>

   <!-- Checking undefined contents for template/element @isClosed="true". Match context that we did not already match -->
   <rule fpi="RUL-QQQ"
         context="*[hl7:observationMedia[hl7:templateId[@root = '1.2.40.0.34.6.0.11.3.53']]]/hl7:observationMedia[hl7:templateId[@root = '1.2.40.0.34.6.0.11.3.53']]/hl7:informant/hl7:relatedEntity[@classCode = 'PRS']/hl7:addr[not(@nullFlavor)]/*[not(@xsi:nil = 'true')][not(self::hl7:streetAddressLine | self::hl7:streetName | self::hl7:houseNumber | self::hl7:postalCode | self::hl7:city | self::hl7:state | self::hl7:country | self::hl7:additionalLocator)]"
         id="d2768665e16-true-d2769341e0">
      <assert role="error"
              see="http://elga.art-decor.org/elgatgd-html-20240709T111220/tmp-1.2.40.0.34.6.0.11.3.53-2021-02-19T125155.html"
              test="not(.)">(atcdabbr_entry_Logo)/d2768665e16-true-d2769341e0: '<value-of select="name(..)"/>' ist als geschlossen definiert und dieses Element '<name/>' ist nicht erlaubt oder nicht mit diesem Inhalt erlaubt. Dies kann templateId, code oder id betreffen. Erwartet:  hl7:streetAddressLine | hl7:streetName | hl7:houseNumber | hl7:postalCode | hl7:city | hl7:state | hl7:country | hl7:additionalLocator (rule-reference: d2768665e16-true-d2769341e0)</assert>
   </rule>

   <!-- Checking undefined contents for template/element @isClosed="true". Match context that we did not already match -->
   <rule fpi="RUL-QQQ"
         context="*[hl7:observationMedia[hl7:templateId[@root = '1.2.40.0.34.6.0.11.3.53']]]/hl7:observationMedia[hl7:templateId[@root = '1.2.40.0.34.6.0.11.3.53']]/hl7:informant/hl7:relatedEntity[@classCode = 'PRS']/hl7:relatedPerson/*[not(@xsi:nil = 'true')][not(self::hl7:name[not(@nullFlavor)] | self::hl7:name[@nullFlavor='UNK'] | self::hl7:name[@nullFlavor='MSK'])]"
         id="d2768665e20-true-d2769396e0">
      <assert role="error"
              see="http://elga.art-decor.org/elgatgd-html-20240709T111220/tmp-1.2.40.0.34.6.0.11.3.53-2021-02-19T125155.html"
              test="not(.)">(atcdabbr_entry_Logo)/d2768665e20-true-d2769396e0: '<value-of select="name(..)"/>' ist als geschlossen definiert und dieses Element '<name/>' ist nicht erlaubt oder nicht mit diesem Inhalt erlaubt. Dies kann templateId, code oder id betreffen. Erwartet:  hl7:name[not(@nullFlavor)] | hl7:name[@nullFlavor='UNK'] | hl7:name[@nullFlavor='MSK'] (rule-reference: d2768665e20-true-d2769396e0)</assert>
   </rule>

   <!-- Checking undefined contents for template/element @isClosed="true". Match context that we did not already match -->
   <rule fpi="RUL-QQQ"
         context="*[hl7:observationMedia[hl7:templateId[@root = '1.2.40.0.34.6.0.11.3.53']]]/hl7:observationMedia[hl7:templateId[@root = '1.2.40.0.34.6.0.11.3.53']]/hl7:informant/hl7:relatedEntity[@classCode = 'PRS']/hl7:relatedPerson/hl7:name[not(@nullFlavor)]/*[not(@xsi:nil = 'true')][not(self::hl7:prefix | self::hl7:family[not(@nullFlavor)] | self::hl7:given[not(@nullFlavor)] | self::hl7:suffix)]"
         id="d2769389e10-true-d2769423e0">
      <assert role="error"
              see="http://elga.art-decor.org/elgatgd-html-20240709T111220/tmp-1.2.40.0.34.6.0.11.3.53-2021-02-19T125155.html"
              test="not(.)">(atcdabbr_entry_Logo)/d2769389e10-true-d2769423e0: '<value-of select="name(..)"/>' ist als geschlossen definiert und dieses Element '<name/>' ist nicht erlaubt oder nicht mit diesem Inhalt erlaubt. Dies kann templateId, code oder id betreffen. Erwartet:  hl7:prefix | hl7:family[not(@nullFlavor)] | hl7:given[not(@nullFlavor)] | hl7:suffix (rule-reference: d2769389e10-true-d2769423e0)</assert>
   </rule>

   <!-- Checking undefined contents for template/element @isClosed="true". Match context that we did not already match -->
   <rule fpi="RUL-QQQ"
         context="*[hl7:observationMedia[hl7:templateId[@root = '1.2.40.0.34.6.0.11.3.53']]]/hl7:observationMedia[hl7:templateId[@root = '1.2.40.0.34.6.0.11.3.53']]/hl7:participant[@typeCode][hl7:participantRole]/*[not(@xsi:nil = 'true')][not(self::hl7:time | self::hl7:awarenessCode[concat(@code, @codeSystem) = doc('include/voc-2.16.840.1.113883.1.11.10310-DYNAMIC.xml')//valueSet[1]/conceptList/concept/concat(@code, @codeSystem) or @nullFlavor] | self::hl7:participantRole)]"
         id="d41e40110-true-d2769551e0">
      <assert role="error"
              see="http://elga.art-decor.org/elgatgd-html-20240709T111220/tmp-1.2.40.0.34.6.0.11.3.53-2021-02-19T125155.html"
              test="not(.)">(atcdabbr_entry_Logo)/d41e40110-true-d2769551e0: '<value-of select="name(..)"/>' ist als geschlossen definiert und dieses Element '<name/>' ist nicht erlaubt oder nicht mit diesem Inhalt erlaubt. Dies kann templateId, code oder id betreffen. Erwartet:  hl7:time | hl7:awarenessCode[concat(@code, @codeSystem) = doc('include/voc-2.16.840.1.113883.1.11.10310-DYNAMIC.xml')//valueSet[1]/conceptList/concept/concat(@code, @codeSystem) or @nullFlavor] | hl7:participantRole (rule-reference: d41e40110-true-d2769551e0)</assert>
   </rule>

   <!-- Checking undefined contents for template/element @isClosed="true". Match context that we did not already match -->
   <rule fpi="RUL-QQQ"
         context="*[hl7:observationMedia[hl7:templateId[@root = '1.2.40.0.34.6.0.11.3.53']]]/hl7:observationMedia[hl7:templateId[@root = '1.2.40.0.34.6.0.11.3.53']]/hl7:participant[@typeCode][hl7:participantRole]/hl7:participantRole/*[not(@xsi:nil = 'true')][not(self::hl7:id | self::hl7:code | self::hl7:addr | self::hl7:telecom | self::hl7:playingDevice | self::hl7:playingEntity | self::hl7:scopingEntity)]"
         id="d2769454e11-true-d2769659e0">
      <assert role="error"
              see="http://elga.art-decor.org/elgatgd-html-20240709T111220/tmp-1.2.40.0.34.6.0.11.3.53-2021-02-19T125155.html"
              test="not(.)">(atcdabbr_entry_Logo)/d2769454e11-true-d2769659e0: '<value-of select="name(..)"/>' ist als geschlossen definiert und dieses Element '<name/>' ist nicht erlaubt oder nicht mit diesem Inhalt erlaubt. Dies kann templateId, code oder id betreffen. Erwartet:  hl7:id | hl7:code | hl7:addr | hl7:telecom | hl7:playingDevice | hl7:playingEntity | hl7:scopingEntity (rule-reference: d2769454e11-true-d2769659e0)</assert>
   </rule>

   <!-- Checking undefined contents for template/element @isClosed="true". Match context that we did not already match -->
   <rule fpi="RUL-QQQ"
         context="*[hl7:observationMedia[hl7:templateId[@root = '1.2.40.0.34.6.0.11.3.53']]]/hl7:observationMedia[hl7:templateId[@root = '1.2.40.0.34.6.0.11.3.53']]/hl7:participant[@typeCode][hl7:participantRole]/hl7:participantRole/hl7:addr/*[not(@xsi:nil = 'true')][not(self::hl7:streetAddressLine | self::hl7:streetName | self::hl7:houseNumber | self::hl7:postalCode[not(@nullFlavor)] | self::hl7:city[not(@nullFlavor)] | self::hl7:state | self::hl7:country[not(@nullFlavor)] | self::hl7:additionalLocator)]"
         id="d2769454e22-true-d2769721e0">
      <assert role="error"
              see="http://elga.art-decor.org/elgatgd-html-20240709T111220/tmp-1.2.40.0.34.6.0.11.3.53-2021-02-19T125155.html"
              test="not(.)">(atcdabbr_entry_Logo)/d2769454e22-true-d2769721e0: '<value-of select="name(..)"/>' ist als geschlossen definiert und dieses Element '<name/>' ist nicht erlaubt oder nicht mit diesem Inhalt erlaubt. Dies kann templateId, code oder id betreffen. Erwartet:  hl7:streetAddressLine | hl7:streetName | hl7:houseNumber | hl7:postalCode[not(@nullFlavor)] | hl7:city[not(@nullFlavor)] | hl7:state | hl7:country[not(@nullFlavor)] | hl7:additionalLocator (rule-reference: d2769454e22-true-d2769721e0)</assert>
   </rule>

   <!-- Checking undefined contents for template/element @isClosed="true". Match context that we did not already match -->
   <rule fpi="RUL-QQQ"
         context="*[hl7:observationMedia[hl7:templateId[@root = '1.2.40.0.34.6.0.11.3.53']]]/hl7:observationMedia[hl7:templateId[@root = '1.2.40.0.34.6.0.11.3.53']]/hl7:participant[@typeCode][hl7:participantRole]/hl7:participantRole/hl7:playingDevice/*[not(@xsi:nil = 'true')][not(self::hl7:code | self::hl7:manufacturerModelName | self::hl7:softwareName)]"
         id="d2769454e78-true-d2769799e0">
      <assert role="error"
              see="http://elga.art-decor.org/elgatgd-html-20240709T111220/tmp-1.2.40.0.34.6.0.11.3.53-2021-02-19T125155.html"
              test="not(.)">(atcdabbr_entry_Logo)/d2769454e78-true-d2769799e0: '<value-of select="name(..)"/>' ist als geschlossen definiert und dieses Element '<name/>' ist nicht erlaubt oder nicht mit diesem Inhalt erlaubt. Dies kann templateId, code oder id betreffen. Erwartet:  hl7:code | hl7:manufacturerModelName | hl7:softwareName (rule-reference: d2769454e78-true-d2769799e0)</assert>
   </rule>

   <!-- Checking undefined contents for template/element @isClosed="true". Match context that we did not already match -->
   <rule fpi="RUL-QQQ"
         context="*[hl7:observationMedia[hl7:templateId[@root = '1.2.40.0.34.6.0.11.3.53']]]/hl7:observationMedia[hl7:templateId[@root = '1.2.40.0.34.6.0.11.3.53']]/hl7:participant[@typeCode][hl7:participantRole]/hl7:participantRole/hl7:playingEntity/*[not(@xsi:nil = 'true')][not(self::hl7:code | self::hl7:quantity | self::hl7:name | self::sdtc:birthTime | self::hl7:desc)]"
         id="d2769454e80-true-d2769860e0">
      <assert role="error"
              see="http://elga.art-decor.org/elgatgd-html-20240709T111220/tmp-1.2.40.0.34.6.0.11.3.53-2021-02-19T125155.html"
              test="not(.)">(atcdabbr_entry_Logo)/d2769454e80-true-d2769860e0: '<value-of select="name(..)"/>' ist als geschlossen definiert und dieses Element '<name/>' ist nicht erlaubt oder nicht mit diesem Inhalt erlaubt. Dies kann templateId, code oder id betreffen. Erwartet:  hl7:code | hl7:quantity | hl7:name | sdtc:birthTime | hl7:desc (rule-reference: d2769454e80-true-d2769860e0)</assert>
   </rule>

   <!-- Checking undefined contents for template/element @isClosed="true". Match context that we did not already match -->
   <rule fpi="RUL-QQQ"
         context="*[hl7:observationMedia[hl7:templateId[@root = '1.2.40.0.34.6.0.11.3.53']]]/hl7:observationMedia[hl7:templateId[@root = '1.2.40.0.34.6.0.11.3.53']]/hl7:participant[@typeCode][hl7:participantRole]/hl7:participantRole/hl7:scopingEntity/*[not(@xsi:nil = 'true')][not(self::hl7:id | self::hl7:code | self::hl7:desc)]"
         id="d2769454e83-true-d2769918e0">
      <assert role="error"
              see="http://elga.art-decor.org/elgatgd-html-20240709T111220/tmp-1.2.40.0.34.6.0.11.3.53-2021-02-19T125155.html"
              test="not(.)">(atcdabbr_entry_Logo)/d2769454e83-true-d2769918e0: '<value-of select="name(..)"/>' ist als geschlossen definiert und dieses Element '<name/>' ist nicht erlaubt oder nicht mit diesem Inhalt erlaubt. Dies kann templateId, code oder id betreffen. Erwartet:  hl7:id | hl7:code | hl7:desc (rule-reference: d2769454e83-true-d2769918e0)</assert>
   </rule>
</pattern>
