<?xml version="1.0" encoding="UTF-8"?>
<!--
Template derived pattern
===========================================
ID: 1.2.40.0.34.6.0.11.3.72
Name: Medikationseinnahme Entry
Description: 
-->
<pattern xmlns="http://purl.oclc.org/dsdl/schematron"
         id="template-1.2.40.0.34.6.0.11.3.72-2020-07-29T113517-closed">
   <title>Medikationseinnahme Entry</title>

   <!-- Checking undefined contents for template/element @isClosed="true". Match context that we did not already match -->
   <rule fpi="RUL-QQQ"
         context="*[hl7:substanceAdministration[hl7:templateId[@root = '1.2.40.0.34.6.0.11.3.72'] and hl7:templateId[@root = '2.16.840.1.113883.10.20.1.24'] and hl7:templateId[@root = '1.3.6.1.4.1.19376.1.5.3.1.4.7'] and hl7:templateId[@root = '1.3.6.1.4.1.19376.1.9.1.3.16'] and hl7:templateId[@root = '1.3.6.1.4.1.19376.1.5.3.1.4.7.1']]]/*[not(@xsi:nil = 'true')][not(self::hl7:substanceAdministration[hl7:templateId[@root = '1.2.40.0.34.6.0.11.3.72'] and hl7:templateId[@root = '2.16.840.1.113883.10.20.1.24'] and hl7:templateId[@root = '1.3.6.1.4.1.19376.1.5.3.1.4.7'] and hl7:templateId[@root = '1.3.6.1.4.1.19376.1.9.1.3.16'] and hl7:templateId[@root = '1.3.6.1.4.1.19376.1.5.3.1.4.7.1']])]"
         id="d41e49008-true-d3579355e0">
      <assert role="error"
              see="http://elga.art-decor.org/elgatgd-html-20240709T111220/tmp-1.2.40.0.34.6.0.11.3.72-2020-07-29T113517.html"
              test="not(.)">(atcdabbr_entry_MedikationsEinnahmeEntry)/d41e49008-true-d3579355e0: '<value-of select="name(..)"/>' ist als geschlossen definiert und dieses Element '<name/>' ist nicht erlaubt oder nicht mit diesem Inhalt erlaubt. Dies kann templateId, code oder id betreffen. Erwartet:  hl7:substanceAdministration[hl7:templateId[@root = '1.2.40.0.34.6.0.11.3.72'] and hl7:templateId[@root = '2.16.840.1.113883.10.20.1.24'] and hl7:templateId[@root = '1.3.6.1.4.1.19376.1.5.3.1.4.7'] and hl7:templateId[@root = '1.3.6.1.4.1.19376.1.9.1.3.16'] and hl7:templateId[@root = '1.3.6.1.4.1.19376.1.5.3.1.4.7.1']] (rule-reference: d41e49008-true-d3579355e0)</assert>
   </rule>

   <!-- Checking undefined contents for template/element @isClosed="true". Match context that we did not already match -->
   <rule fpi="RUL-QQQ"
         context="*[hl7:substanceAdministration[hl7:templateId[@root = '1.2.40.0.34.6.0.11.3.72'] and hl7:templateId[@root = '2.16.840.1.113883.10.20.1.24'] and hl7:templateId[@root = '1.3.6.1.4.1.19376.1.5.3.1.4.7'] and hl7:templateId[@root = '1.3.6.1.4.1.19376.1.9.1.3.16'] and hl7:templateId[@root = '1.3.6.1.4.1.19376.1.5.3.1.4.7.1']]]/hl7:substanceAdministration[hl7:templateId[@root = '1.2.40.0.34.6.0.11.3.72'] and hl7:templateId[@root = '2.16.840.1.113883.10.20.1.24'] and hl7:templateId[@root = '1.3.6.1.4.1.19376.1.5.3.1.4.7'] and hl7:templateId[@root = '1.3.6.1.4.1.19376.1.9.1.3.16'] and hl7:templateId[@root = '1.3.6.1.4.1.19376.1.5.3.1.4.7.1']]/*[not(@xsi:nil = 'true')][not(self::hl7:templateId[@root = '1.2.40.0.34.6.0.11.3.72'] | self::hl7:templateId[@root = '2.16.840.1.113883.10.20.1.24'] | self::hl7:templateId[@root = '1.3.6.1.4.1.19376.1.5.3.1.4.7'] | self::hl7:templateId[@root = '1.3.6.1.4.1.19376.1.9.1.3.16'] | self::hl7:templateId[@root = '1.3.6.1.4.1.19376.1.5.3.1.4.7.1'] | self::hl7:id[not(@nullFlavor)] | self::hl7:code[@codeSystem = '2.16.840.1.113883.4.642.1.101'] | self::hl7:text[not(@nullFlavor)] | self::hl7:statusCode[@code = 'completed'] | self::hl7:effectiveTime | self::hl7:effectiveTime | self::hl7:effectiveTime | self::hl7:routeCode[@nullFlavor = 'NA'] | self::hl7:approachSiteCode[@nullFlavor = 'NA'] | self::hl7:doseQuantity | self::hl7:rateQuantity[@nullFlavor = 'NA'] | self::hl7:consumable[hl7:manufacturedProduct[hl7:templateId[@root = '1.3.6.1.4.1.19376.1.5.3.1.4.7.2'] and hl7:templateId[@root = '2.16.840.1.113883.10.20.1.53']]] | self::hl7:author[hl7:assignedAuthor] | self::hl7:author | self::hl7:entryRelationship[@typeCode='RSON'][hl7:act/hl7:templateId[@root='1.3.6.1.4.1.19376.1.5.3.1.4.4.1']] | self::hl7:entryRelationship[@typeCode='SUBJ'][hl7:act/hl7:templateId[@root='2.16.840.1.113883.10.20.1.43']] | self::hl7:entryRelationship[@typeCode='COMP'][hl7:supply] | self::hl7:entryRelationship[@typeCode='REFR'][hl7:substanceAdministration/hl7:templateId[@root='1.3.6.1.4.1.19376.1.9.1.3.10']] | self::hl7:entryRelationship[@typeCode='REFR'][hl7:substanceAdministration/hl7:templateId[@root='1.3.6.1.4.1.19376.1.9.1.3.11']] | self::hl7:entryRelationship[@typeCode='REFR'][hl7:substanceAdministration/hl7:templateId[@root='1.3.6.1.4.1.19376.1.9.1.3.12']] | self::hl7:entryRelationship[@typeCode='REFR'][hl7:substanceAdministration/hl7:templateId[@root='1.3.6.1.4.1.19376.1.9.1.3.13']] | self::hl7:entryRelationship[@typeCode='REFR'][hl7:substanceAdministration/hl7:templateId[@root='1.3.6.1.4.1.19376.1.9.1.3.14']] | self::hl7:reference[@typeCode = 'XCRPT'][hl7:externalDocument] | self::hl7:precondition[hl7:criterion])]"
         id="d41e49309-true-d3579620e0">
      <assert role="error"
              see="http://elga.art-decor.org/elgatgd-html-20240709T111220/tmp-1.2.40.0.34.6.0.11.3.72-2020-07-29T113517.html"
              test="not(.)">(atcdabbr_entry_MedikationsEinnahmeEntry)/d41e49309-true-d3579620e0: '<value-of select="name(..)"/>' ist als geschlossen definiert und dieses Element '<name/>' ist nicht erlaubt oder nicht mit diesem Inhalt erlaubt. Dies kann templateId, code oder id betreffen. Erwartet:  hl7:templateId[@root = '1.2.40.0.34.6.0.11.3.72'] | hl7:templateId[@root = '2.16.840.1.113883.10.20.1.24'] | hl7:templateId[@root = '1.3.6.1.4.1.19376.1.5.3.1.4.7'] | hl7:templateId[@root = '1.3.6.1.4.1.19376.1.9.1.3.16'] | hl7:templateId[@root = '1.3.6.1.4.1.19376.1.5.3.1.4.7.1'] | hl7:id[not(@nullFlavor)] | hl7:code[@codeSystem = '2.16.840.1.113883.4.642.1.101'] | hl7:text[not(@nullFlavor)] | hl7:statusCode[@code = 'completed'] | hl7:effectiveTime | hl7:effectiveTime | hl7:effectiveTime | hl7:routeCode[@nullFlavor = 'NA'] | hl7:approachSiteCode[@nullFlavor = 'NA'] | hl7:doseQuantity | hl7:rateQuantity[@nullFlavor = 'NA'] | hl7:consumable[hl7:manufacturedProduct[hl7:templateId[@root = '1.3.6.1.4.1.19376.1.5.3.1.4.7.2'] and hl7:templateId[@root = '2.16.840.1.113883.10.20.1.53']]] | hl7:author[hl7:assignedAuthor] | hl7:author | hl7:entryRelationship[@typeCode='RSON'][hl7:act/hl7:templateId[@root='1.3.6.1.4.1.19376.1.5.3.1.4.4.1']] | hl7:entryRelationship[@typeCode='SUBJ'][hl7:act/hl7:templateId[@root='2.16.840.1.113883.10.20.1.43']] | hl7:entryRelationship[@typeCode='COMP'][hl7:supply] | hl7:entryRelationship[@typeCode='REFR'][hl7:substanceAdministration/hl7:templateId[@root='1.3.6.1.4.1.19376.1.9.1.3.10']] | hl7:entryRelationship[@typeCode='REFR'][hl7:substanceAdministration/hl7:templateId[@root='1.3.6.1.4.1.19376.1.9.1.3.11']] | hl7:entryRelationship[@typeCode='REFR'][hl7:substanceAdministration/hl7:templateId[@root='1.3.6.1.4.1.19376.1.9.1.3.12']] | hl7:entryRelationship[@typeCode='REFR'][hl7:substanceAdministration/hl7:templateId[@root='1.3.6.1.4.1.19376.1.9.1.3.13']] | hl7:entryRelationship[@typeCode='REFR'][hl7:substanceAdministration/hl7:templateId[@root='1.3.6.1.4.1.19376.1.9.1.3.14']] | hl7:reference[@typeCode = 'XCRPT'][hl7:externalDocument] | hl7:precondition[hl7:criterion] (rule-reference: d41e49309-true-d3579620e0)</assert>
   </rule>

   <!-- Checking undefined contents for template/element @isClosed="true". Match context that we did not already match -->
   <rule fpi="RUL-QQQ"
         context="*[hl7:substanceAdministration[hl7:templateId[@root = '1.2.40.0.34.6.0.11.3.72'] and hl7:templateId[@root = '2.16.840.1.113883.10.20.1.24'] and hl7:templateId[@root = '1.3.6.1.4.1.19376.1.5.3.1.4.7'] and hl7:templateId[@root = '1.3.6.1.4.1.19376.1.9.1.3.16'] and hl7:templateId[@root = '1.3.6.1.4.1.19376.1.5.3.1.4.7.1']]]/hl7:substanceAdministration[hl7:templateId[@root = '1.2.40.0.34.6.0.11.3.72'] and hl7:templateId[@root = '2.16.840.1.113883.10.20.1.24'] and hl7:templateId[@root = '1.3.6.1.4.1.19376.1.5.3.1.4.7'] and hl7:templateId[@root = '1.3.6.1.4.1.19376.1.9.1.3.16'] and hl7:templateId[@root = '1.3.6.1.4.1.19376.1.5.3.1.4.7.1']]/hl7:code[@codeSystem = '2.16.840.1.113883.4.642.1.101']/*[not(@xsi:nil = 'true')][not(self::hl7:translation | self::ips:designation)]"
         id="d41e49390-true-d3579675e0">
      <assert role="error"
              see="http://elga.art-decor.org/elgatgd-html-20240709T111220/tmp-1.2.40.0.34.6.0.11.3.72-2020-07-29T113517.html"
              test="not(.)">(atcdabbr_entry_MedikationsEinnahmeEntry)/d41e49390-true-d3579675e0: '<value-of select="name(..)"/>' ist als geschlossen definiert und dieses Element '<name/>' ist nicht erlaubt oder nicht mit diesem Inhalt erlaubt. Dies kann templateId, code oder id betreffen. Erwartet:  hl7:translation | ips:designation (rule-reference: d41e49390-true-d3579675e0)</assert>
   </rule>

   <!-- Checking undefined contents for template/element @isClosed="true". Match context that we did not already match -->
   <rule fpi="RUL-QQQ"
         context="*[hl7:substanceAdministration[hl7:templateId[@root = '1.2.40.0.34.6.0.11.3.72'] and hl7:templateId[@root = '2.16.840.1.113883.10.20.1.24'] and hl7:templateId[@root = '1.3.6.1.4.1.19376.1.5.3.1.4.7'] and hl7:templateId[@root = '1.3.6.1.4.1.19376.1.9.1.3.16'] and hl7:templateId[@root = '1.3.6.1.4.1.19376.1.5.3.1.4.7.1']]]/hl7:substanceAdministration[hl7:templateId[@root = '1.2.40.0.34.6.0.11.3.72'] and hl7:templateId[@root = '2.16.840.1.113883.10.20.1.24'] and hl7:templateId[@root = '1.3.6.1.4.1.19376.1.5.3.1.4.7'] and hl7:templateId[@root = '1.3.6.1.4.1.19376.1.9.1.3.16'] and hl7:templateId[@root = '1.3.6.1.4.1.19376.1.5.3.1.4.7.1']]/hl7:text[not(@nullFlavor)]/*[not(@xsi:nil = 'true')][not(self::hl7:reference[not(@nullFlavor)])]"
         id="d41e49440-true-d3579699e0">
      <assert role="error"
              see="http://elga.art-decor.org/elgatgd-html-20240709T111220/tmp-1.2.40.0.34.6.0.11.3.72-2020-07-29T113517.html"
              test="not(.)">(atcdabbr_entry_MedikationsEinnahmeEntry)/d41e49440-true-d3579699e0: '<value-of select="name(..)"/>' ist als geschlossen definiert und dieses Element '<name/>' ist nicht erlaubt oder nicht mit diesem Inhalt erlaubt. Dies kann templateId, code oder id betreffen. Erwartet:  hl7:reference[not(@nullFlavor)] (rule-reference: d41e49440-true-d3579699e0)</assert>
   </rule>

   <!-- Checking undefined contents for template/element @isClosed="true". Match context that we did not already match -->
   <rule fpi="RUL-QQQ"
         context="*[hl7:substanceAdministration[hl7:templateId[@root = '1.2.40.0.34.6.0.11.3.72'] and hl7:templateId[@root = '2.16.840.1.113883.10.20.1.24'] and hl7:templateId[@root = '1.3.6.1.4.1.19376.1.5.3.1.4.7'] and hl7:templateId[@root = '1.3.6.1.4.1.19376.1.9.1.3.16'] and hl7:templateId[@root = '1.3.6.1.4.1.19376.1.5.3.1.4.7.1']]]/hl7:substanceAdministration[hl7:templateId[@root = '1.2.40.0.34.6.0.11.3.72'] and hl7:templateId[@root = '2.16.840.1.113883.10.20.1.24'] and hl7:templateId[@root = '1.3.6.1.4.1.19376.1.5.3.1.4.7'] and hl7:templateId[@root = '1.3.6.1.4.1.19376.1.9.1.3.16'] and hl7:templateId[@root = '1.3.6.1.4.1.19376.1.5.3.1.4.7.1']]/hl7:consumable[hl7:manufacturedProduct[hl7:templateId[@root = '1.3.6.1.4.1.19376.1.5.3.1.4.7.2'] and hl7:templateId[@root = '2.16.840.1.113883.10.20.1.53']]]/*[not(@xsi:nil = 'true')][not(self::hl7:manufacturedProduct[hl7:templateId[@root = '1.3.6.1.4.1.19376.1.5.3.1.4.7.2'] and hl7:templateId[@root = '2.16.840.1.113883.10.20.1.53']])]"
         id="d41e49610-true-d3579768e0">
      <assert role="error"
              see="http://elga.art-decor.org/elgatgd-html-20240709T111220/tmp-1.2.40.0.34.6.0.11.3.72-2020-07-29T113517.html"
              test="not(.)">(atcdabbr_entry_MedikationsEinnahmeEntry)/d41e49610-true-d3579768e0: '<value-of select="name(..)"/>' ist als geschlossen definiert und dieses Element '<name/>' ist nicht erlaubt oder nicht mit diesem Inhalt erlaubt. Dies kann templateId, code oder id betreffen. Erwartet:  hl7:manufacturedProduct[hl7:templateId[@root = '1.3.6.1.4.1.19376.1.5.3.1.4.7.2'] and hl7:templateId[@root = '2.16.840.1.113883.10.20.1.53']] (rule-reference: d41e49610-true-d3579768e0)</assert>
   </rule>

   <!-- Checking undefined contents for template/element @isClosed="true". Match context that we did not already match -->
   <rule fpi="RUL-QQQ"
         context="*[hl7:substanceAdministration[hl7:templateId[@root = '1.2.40.0.34.6.0.11.3.72'] and hl7:templateId[@root = '2.16.840.1.113883.10.20.1.24'] and hl7:templateId[@root = '1.3.6.1.4.1.19376.1.5.3.1.4.7'] and hl7:templateId[@root = '1.3.6.1.4.1.19376.1.9.1.3.16'] and hl7:templateId[@root = '1.3.6.1.4.1.19376.1.5.3.1.4.7.1']]]/hl7:substanceAdministration[hl7:templateId[@root = '1.2.40.0.34.6.0.11.3.72'] and hl7:templateId[@root = '2.16.840.1.113883.10.20.1.24'] and hl7:templateId[@root = '1.3.6.1.4.1.19376.1.5.3.1.4.7'] and hl7:templateId[@root = '1.3.6.1.4.1.19376.1.9.1.3.16'] and hl7:templateId[@root = '1.3.6.1.4.1.19376.1.5.3.1.4.7.1']]/hl7:consumable[hl7:manufacturedProduct[hl7:templateId[@root = '1.3.6.1.4.1.19376.1.5.3.1.4.7.2'] and hl7:templateId[@root = '2.16.840.1.113883.10.20.1.53']]]/hl7:manufacturedProduct[hl7:templateId[@root = '1.3.6.1.4.1.19376.1.5.3.1.4.7.2'] and hl7:templateId[@root = '2.16.840.1.113883.10.20.1.53']]/*[not(@xsi:nil = 'true')][not(self::hl7:templateId[@root = '1.3.6.1.4.1.19376.1.5.3.1.4.7.2'] | self::hl7:templateId[@root = '2.16.840.1.113883.10.20.1.53'] | self::hl7:manufacturedMaterial[hl7:templateId[@root = '1.2.40.0.34.11.2.3.4'] and hl7:templateId[@root = '1.3.6.1.4.1.19376.1.9.1.3.1']])]"
         id="d3579750e50-true-d3579802e0">
      <assert role="error"
              see="http://elga.art-decor.org/elgatgd-html-20240709T111220/tmp-1.2.40.0.34.6.0.11.3.72-2020-07-29T113517.html"
              test="not(.)">(atcdabbr_entry_MedikationsEinnahmeEntry)/d3579750e50-true-d3579802e0: '<value-of select="name(..)"/>' ist als geschlossen definiert und dieses Element '<name/>' ist nicht erlaubt oder nicht mit diesem Inhalt erlaubt. Dies kann templateId, code oder id betreffen. Erwartet:  hl7:templateId[@root = '1.3.6.1.4.1.19376.1.5.3.1.4.7.2'] | hl7:templateId[@root = '2.16.840.1.113883.10.20.1.53'] | hl7:manufacturedMaterial[hl7:templateId[@root = '1.2.40.0.34.11.2.3.4'] and hl7:templateId[@root = '1.3.6.1.4.1.19376.1.9.1.3.1']] (rule-reference: d3579750e50-true-d3579802e0)</assert>
   </rule>

   <!-- Checking undefined contents for template/element @isClosed="true". Match context that we did not already match -->
   <rule fpi="RUL-QQQ"
         context="*[hl7:substanceAdministration[hl7:templateId[@root = '1.2.40.0.34.6.0.11.3.72'] and hl7:templateId[@root = '2.16.840.1.113883.10.20.1.24'] and hl7:templateId[@root = '1.3.6.1.4.1.19376.1.5.3.1.4.7'] and hl7:templateId[@root = '1.3.6.1.4.1.19376.1.9.1.3.16'] and hl7:templateId[@root = '1.3.6.1.4.1.19376.1.5.3.1.4.7.1']]]/hl7:substanceAdministration[hl7:templateId[@root = '1.2.40.0.34.6.0.11.3.72'] and hl7:templateId[@root = '2.16.840.1.113883.10.20.1.24'] and hl7:templateId[@root = '1.3.6.1.4.1.19376.1.5.3.1.4.7'] and hl7:templateId[@root = '1.3.6.1.4.1.19376.1.9.1.3.16'] and hl7:templateId[@root = '1.3.6.1.4.1.19376.1.5.3.1.4.7.1']]/hl7:consumable[hl7:manufacturedProduct[hl7:templateId[@root = '1.3.6.1.4.1.19376.1.5.3.1.4.7.2'] and hl7:templateId[@root = '2.16.840.1.113883.10.20.1.53']]]/hl7:manufacturedProduct[hl7:templateId[@root = '1.3.6.1.4.1.19376.1.5.3.1.4.7.2'] and hl7:templateId[@root = '2.16.840.1.113883.10.20.1.53']]/hl7:manufacturedMaterial[hl7:templateId[@root = '1.2.40.0.34.11.2.3.4'] and hl7:templateId[@root = '1.3.6.1.4.1.19376.1.9.1.3.1']]/*[not(@xsi:nil = 'true')][not(self::hl7:templateId[@root = '1.2.40.0.34.11.2.3.4'] | self::hl7:templateId[@root = '1.3.6.1.4.1.19376.1.9.1.3.1'] | self::hl7:code[@codeSystem = '1.2.40.0.34.4.16' or @codeSystem = '1.2.40.0.34.4.17' or @nullFlavor] | self::hl7:name | self::pharm:formCode[@codeSystem = '1.2.40.0.10.1.4.3.4.3.5' or @nullFlavor] | self::pharm:asContent[@classCode = 'CONT'][pharm:containerPackagedMedicine[@classCode = 'CONT'][@determinerCode = 'INSTANCE']] | self::pharm:ingredient[@classCode = 'ACTI'][pharm:ingredient[@classCode = 'MMAT'][@determinerCode = 'KIND']])]"
         id="d3579750e64-true-d3579868e0">
      <assert role="error"
              see="http://elga.art-decor.org/elgatgd-html-20240709T111220/tmp-1.2.40.0.34.6.0.11.3.72-2020-07-29T113517.html"
              test="not(.)">(atcdabbr_entry_MedikationsEinnahmeEntry)/d3579750e64-true-d3579868e0: '<value-of select="name(..)"/>' ist als geschlossen definiert und dieses Element '<name/>' ist nicht erlaubt oder nicht mit diesem Inhalt erlaubt. Dies kann templateId, code oder id betreffen. Erwartet:  hl7:templateId[@root = '1.2.40.0.34.11.2.3.4'] | hl7:templateId[@root = '1.3.6.1.4.1.19376.1.9.1.3.1'] | hl7:code[@codeSystem = '1.2.40.0.34.4.16' or @codeSystem = '1.2.40.0.34.4.17' or @nullFlavor] | hl7:name | pharm:formCode[@codeSystem = '1.2.40.0.10.1.4.3.4.3.5' or @nullFlavor] | pharm:asContent[@classCode = 'CONT'][pharm:containerPackagedMedicine[@classCode = 'CONT'][@determinerCode = 'INSTANCE']] | pharm:ingredient[@classCode = 'ACTI'][pharm:ingredient[@classCode = 'MMAT'][@determinerCode = 'KIND']] (rule-reference: d3579750e64-true-d3579868e0)</assert>
   </rule>

   <!-- Checking undefined contents for template/element @isClosed="true". Match context that we did not already match -->
   <rule fpi="RUL-QQQ"
         context="*[hl7:substanceAdministration[hl7:templateId[@root = '1.2.40.0.34.6.0.11.3.72'] and hl7:templateId[@root = '2.16.840.1.113883.10.20.1.24'] and hl7:templateId[@root = '1.3.6.1.4.1.19376.1.5.3.1.4.7'] and hl7:templateId[@root = '1.3.6.1.4.1.19376.1.9.1.3.16'] and hl7:templateId[@root = '1.3.6.1.4.1.19376.1.5.3.1.4.7.1']]]/hl7:substanceAdministration[hl7:templateId[@root = '1.2.40.0.34.6.0.11.3.72'] and hl7:templateId[@root = '2.16.840.1.113883.10.20.1.24'] and hl7:templateId[@root = '1.3.6.1.4.1.19376.1.5.3.1.4.7'] and hl7:templateId[@root = '1.3.6.1.4.1.19376.1.9.1.3.16'] and hl7:templateId[@root = '1.3.6.1.4.1.19376.1.5.3.1.4.7.1']]/hl7:consumable[hl7:manufacturedProduct[hl7:templateId[@root = '1.3.6.1.4.1.19376.1.5.3.1.4.7.2'] and hl7:templateId[@root = '2.16.840.1.113883.10.20.1.53']]]/hl7:manufacturedProduct[hl7:templateId[@root = '1.3.6.1.4.1.19376.1.5.3.1.4.7.2'] and hl7:templateId[@root = '2.16.840.1.113883.10.20.1.53']]/hl7:manufacturedMaterial[hl7:templateId[@root = '1.2.40.0.34.11.2.3.4'] and hl7:templateId[@root = '1.3.6.1.4.1.19376.1.9.1.3.1']]/hl7:code[@codeSystem = '1.2.40.0.34.4.16' or @codeSystem = '1.2.40.0.34.4.17' or @nullFlavor]/*[not(@xsi:nil = 'true')][not(self::hl7:originalText | self::hl7:translation[@codeSystem = '1.2.40.0.34.4.17' or @nullFlavor])]"
         id="d3579750e80-true-d3579902e0">
      <assert role="error"
              see="http://elga.art-decor.org/elgatgd-html-20240709T111220/tmp-1.2.40.0.34.6.0.11.3.72-2020-07-29T113517.html"
              test="not(.)">(atcdabbr_entry_MedikationsEinnahmeEntry)/d3579750e80-true-d3579902e0: '<value-of select="name(..)"/>' ist als geschlossen definiert und dieses Element '<name/>' ist nicht erlaubt oder nicht mit diesem Inhalt erlaubt. Dies kann templateId, code oder id betreffen. Erwartet:  hl7:originalText | hl7:translation[@codeSystem = '1.2.40.0.34.4.17' or @nullFlavor] (rule-reference: d3579750e80-true-d3579902e0)</assert>
   </rule>

   <!-- Checking undefined contents for template/element @isClosed="true". Match context that we did not already match -->
   <rule fpi="RUL-QQQ"
         context="*[hl7:substanceAdministration[hl7:templateId[@root = '1.2.40.0.34.6.0.11.3.72'] and hl7:templateId[@root = '2.16.840.1.113883.10.20.1.24'] and hl7:templateId[@root = '1.3.6.1.4.1.19376.1.5.3.1.4.7'] and hl7:templateId[@root = '1.3.6.1.4.1.19376.1.9.1.3.16'] and hl7:templateId[@root = '1.3.6.1.4.1.19376.1.5.3.1.4.7.1']]]/hl7:substanceAdministration[hl7:templateId[@root = '1.2.40.0.34.6.0.11.3.72'] and hl7:templateId[@root = '2.16.840.1.113883.10.20.1.24'] and hl7:templateId[@root = '1.3.6.1.4.1.19376.1.5.3.1.4.7'] and hl7:templateId[@root = '1.3.6.1.4.1.19376.1.9.1.3.16'] and hl7:templateId[@root = '1.3.6.1.4.1.19376.1.5.3.1.4.7.1']]/hl7:consumable[hl7:manufacturedProduct[hl7:templateId[@root = '1.3.6.1.4.1.19376.1.5.3.1.4.7.2'] and hl7:templateId[@root = '2.16.840.1.113883.10.20.1.53']]]/hl7:manufacturedProduct[hl7:templateId[@root = '1.3.6.1.4.1.19376.1.5.3.1.4.7.2'] and hl7:templateId[@root = '2.16.840.1.113883.10.20.1.53']]/hl7:manufacturedMaterial[hl7:templateId[@root = '1.2.40.0.34.11.2.3.4'] and hl7:templateId[@root = '1.3.6.1.4.1.19376.1.9.1.3.1']]/pharm:asContent[@classCode = 'CONT'][pharm:containerPackagedMedicine[@classCode = 'CONT'][@determinerCode = 'INSTANCE']]/*[not(@xsi:nil = 'true')][not(self::pharm:containerPackagedMedicine[not(@nullFlavor)][@classCode = 'CONT'][@determinerCode = 'INSTANCE'])]"
         id="d3579750e258-true-d3579938e0">
      <assert role="error"
              see="http://elga.art-decor.org/elgatgd-html-20240709T111220/tmp-1.2.40.0.34.6.0.11.3.72-2020-07-29T113517.html"
              test="not(.)">(atcdabbr_entry_MedikationsEinnahmeEntry)/d3579750e258-true-d3579938e0: '<value-of select="name(..)"/>' ist als geschlossen definiert und dieses Element '<name/>' ist nicht erlaubt oder nicht mit diesem Inhalt erlaubt. Dies kann templateId, code oder id betreffen. Erwartet:  pharm:containerPackagedMedicine[not(@nullFlavor)][@classCode = 'CONT'][@determinerCode = 'INSTANCE'] (rule-reference: d3579750e258-true-d3579938e0)</assert>
   </rule>

   <!-- Checking undefined contents for template/element @isClosed="true". Match context that we did not already match -->
   <rule fpi="RUL-QQQ"
         context="*[hl7:substanceAdministration[hl7:templateId[@root = '1.2.40.0.34.6.0.11.3.72'] and hl7:templateId[@root = '2.16.840.1.113883.10.20.1.24'] and hl7:templateId[@root = '1.3.6.1.4.1.19376.1.5.3.1.4.7'] and hl7:templateId[@root = '1.3.6.1.4.1.19376.1.9.1.3.16'] and hl7:templateId[@root = '1.3.6.1.4.1.19376.1.5.3.1.4.7.1']]]/hl7:substanceAdministration[hl7:templateId[@root = '1.2.40.0.34.6.0.11.3.72'] and hl7:templateId[@root = '2.16.840.1.113883.10.20.1.24'] and hl7:templateId[@root = '1.3.6.1.4.1.19376.1.5.3.1.4.7'] and hl7:templateId[@root = '1.3.6.1.4.1.19376.1.9.1.3.16'] and hl7:templateId[@root = '1.3.6.1.4.1.19376.1.5.3.1.4.7.1']]/hl7:consumable[hl7:manufacturedProduct[hl7:templateId[@root = '1.3.6.1.4.1.19376.1.5.3.1.4.7.2'] and hl7:templateId[@root = '2.16.840.1.113883.10.20.1.53']]]/hl7:manufacturedProduct[hl7:templateId[@root = '1.3.6.1.4.1.19376.1.5.3.1.4.7.2'] and hl7:templateId[@root = '2.16.840.1.113883.10.20.1.53']]/hl7:manufacturedMaterial[hl7:templateId[@root = '1.2.40.0.34.11.2.3.4'] and hl7:templateId[@root = '1.3.6.1.4.1.19376.1.9.1.3.1']]/pharm:asContent[@classCode = 'CONT'][pharm:containerPackagedMedicine[@classCode = 'CONT'][@determinerCode = 'INSTANCE']]/pharm:containerPackagedMedicine[not(@nullFlavor)][@classCode = 'CONT'][@determinerCode = 'INSTANCE']/*[not(@xsi:nil = 'true')][not(self::pharm:capacityQuantity[not(@nullFlavor)])]"
         id="d3579750e271-true-d3579952e0">
      <assert role="error"
              see="http://elga.art-decor.org/elgatgd-html-20240709T111220/tmp-1.2.40.0.34.6.0.11.3.72-2020-07-29T113517.html"
              test="not(.)">(atcdabbr_entry_MedikationsEinnahmeEntry)/d3579750e271-true-d3579952e0: '<value-of select="name(..)"/>' ist als geschlossen definiert und dieses Element '<name/>' ist nicht erlaubt oder nicht mit diesem Inhalt erlaubt. Dies kann templateId, code oder id betreffen. Erwartet:  pharm:capacityQuantity[not(@nullFlavor)] (rule-reference: d3579750e271-true-d3579952e0)</assert>
   </rule>

   <!-- Checking undefined contents for template/element @isClosed="true". Match context that we did not already match -->
   <rule fpi="RUL-QQQ"
         context="*[hl7:substanceAdministration[hl7:templateId[@root = '1.2.40.0.34.6.0.11.3.72'] and hl7:templateId[@root = '2.16.840.1.113883.10.20.1.24'] and hl7:templateId[@root = '1.3.6.1.4.1.19376.1.5.3.1.4.7'] and hl7:templateId[@root = '1.3.6.1.4.1.19376.1.9.1.3.16'] and hl7:templateId[@root = '1.3.6.1.4.1.19376.1.5.3.1.4.7.1']]]/hl7:substanceAdministration[hl7:templateId[@root = '1.2.40.0.34.6.0.11.3.72'] and hl7:templateId[@root = '2.16.840.1.113883.10.20.1.24'] and hl7:templateId[@root = '1.3.6.1.4.1.19376.1.5.3.1.4.7'] and hl7:templateId[@root = '1.3.6.1.4.1.19376.1.9.1.3.16'] and hl7:templateId[@root = '1.3.6.1.4.1.19376.1.5.3.1.4.7.1']]/hl7:consumable[hl7:manufacturedProduct[hl7:templateId[@root = '1.3.6.1.4.1.19376.1.5.3.1.4.7.2'] and hl7:templateId[@root = '2.16.840.1.113883.10.20.1.53']]]/hl7:manufacturedProduct[hl7:templateId[@root = '1.3.6.1.4.1.19376.1.5.3.1.4.7.2'] and hl7:templateId[@root = '2.16.840.1.113883.10.20.1.53']]/hl7:manufacturedMaterial[hl7:templateId[@root = '1.2.40.0.34.11.2.3.4'] and hl7:templateId[@root = '1.3.6.1.4.1.19376.1.9.1.3.1']]/pharm:ingredient[@classCode = 'ACTI'][pharm:ingredient[@classCode = 'MMAT'][@determinerCode = 'KIND']]/*[not(@xsi:nil = 'true')][not(self::pharm:ingredient[not(@nullFlavor)][@classCode = 'MMAT'][@determinerCode = 'KIND'])]"
         id="d3579750e304-true-d3579971e0">
      <assert role="error"
              see="http://elga.art-decor.org/elgatgd-html-20240709T111220/tmp-1.2.40.0.34.6.0.11.3.72-2020-07-29T113517.html"
              test="not(.)">(atcdabbr_entry_MedikationsEinnahmeEntry)/d3579750e304-true-d3579971e0: '<value-of select="name(..)"/>' ist als geschlossen definiert und dieses Element '<name/>' ist nicht erlaubt oder nicht mit diesem Inhalt erlaubt. Dies kann templateId, code oder id betreffen. Erwartet:  pharm:ingredient[not(@nullFlavor)][@classCode = 'MMAT'][@determinerCode = 'KIND'] (rule-reference: d3579750e304-true-d3579971e0)</assert>
   </rule>

   <!-- Checking undefined contents for template/element @isClosed="true". Match context that we did not already match -->
   <rule fpi="RUL-QQQ"
         context="*[hl7:substanceAdministration[hl7:templateId[@root = '1.2.40.0.34.6.0.11.3.72'] and hl7:templateId[@root = '2.16.840.1.113883.10.20.1.24'] and hl7:templateId[@root = '1.3.6.1.4.1.19376.1.5.3.1.4.7'] and hl7:templateId[@root = '1.3.6.1.4.1.19376.1.9.1.3.16'] and hl7:templateId[@root = '1.3.6.1.4.1.19376.1.5.3.1.4.7.1']]]/hl7:substanceAdministration[hl7:templateId[@root = '1.2.40.0.34.6.0.11.3.72'] and hl7:templateId[@root = '2.16.840.1.113883.10.20.1.24'] and hl7:templateId[@root = '1.3.6.1.4.1.19376.1.5.3.1.4.7'] and hl7:templateId[@root = '1.3.6.1.4.1.19376.1.9.1.3.16'] and hl7:templateId[@root = '1.3.6.1.4.1.19376.1.5.3.1.4.7.1']]/hl7:consumable[hl7:manufacturedProduct[hl7:templateId[@root = '1.3.6.1.4.1.19376.1.5.3.1.4.7.2'] and hl7:templateId[@root = '2.16.840.1.113883.10.20.1.53']]]/hl7:manufacturedProduct[hl7:templateId[@root = '1.3.6.1.4.1.19376.1.5.3.1.4.7.2'] and hl7:templateId[@root = '2.16.840.1.113883.10.20.1.53']]/hl7:manufacturedMaterial[hl7:templateId[@root = '1.2.40.0.34.11.2.3.4'] and hl7:templateId[@root = '1.3.6.1.4.1.19376.1.9.1.3.1']]/pharm:ingredient[@classCode = 'ACTI'][pharm:ingredient[@classCode = 'MMAT'][@determinerCode = 'KIND']]/pharm:ingredient[not(@nullFlavor)][@classCode = 'MMAT'][@determinerCode = 'KIND']/*[not(@xsi:nil = 'true')][not(self::pharm:code[@codeSystem = '2.16.840.1.113883.6.73' or @codeSystem = '1.2.40.0.34.5.156' or @nullFlavor] | self::pharm:name[not(@nullFlavor)])]"
         id="d3579750e340-true-d3579992e0">
      <assert role="error"
              see="http://elga.art-decor.org/elgatgd-html-20240709T111220/tmp-1.2.40.0.34.6.0.11.3.72-2020-07-29T113517.html"
              test="not(.)">(atcdabbr_entry_MedikationsEinnahmeEntry)/d3579750e340-true-d3579992e0: '<value-of select="name(..)"/>' ist als geschlossen definiert und dieses Element '<name/>' ist nicht erlaubt oder nicht mit diesem Inhalt erlaubt. Dies kann templateId, code oder id betreffen. Erwartet:  pharm:code[@codeSystem = '2.16.840.1.113883.6.73' or @codeSystem = '1.2.40.0.34.5.156' or @nullFlavor] | pharm:name[not(@nullFlavor)] (rule-reference: d3579750e340-true-d3579992e0)</assert>
   </rule>

   <!-- Checking undefined contents for template/element @isClosed="true". Match context that we did not already match -->
   <rule fpi="RUL-QQQ"
         context="*[hl7:substanceAdministration[hl7:templateId[@root = '1.2.40.0.34.6.0.11.3.72'] and hl7:templateId[@root = '2.16.840.1.113883.10.20.1.24'] and hl7:templateId[@root = '1.3.6.1.4.1.19376.1.5.3.1.4.7'] and hl7:templateId[@root = '1.3.6.1.4.1.19376.1.9.1.3.16'] and hl7:templateId[@root = '1.3.6.1.4.1.19376.1.5.3.1.4.7.1']]]/hl7:substanceAdministration[hl7:templateId[@root = '1.2.40.0.34.6.0.11.3.72'] and hl7:templateId[@root = '2.16.840.1.113883.10.20.1.24'] and hl7:templateId[@root = '1.3.6.1.4.1.19376.1.5.3.1.4.7'] and hl7:templateId[@root = '1.3.6.1.4.1.19376.1.9.1.3.16'] and hl7:templateId[@root = '1.3.6.1.4.1.19376.1.5.3.1.4.7.1']]/hl7:consumable[hl7:manufacturedProduct[hl7:templateId[@root = '1.3.6.1.4.1.19376.1.5.3.1.4.7.2'] and hl7:templateId[@root = '2.16.840.1.113883.10.20.1.53']]]/hl7:manufacturedProduct[hl7:templateId[@root = '1.3.6.1.4.1.19376.1.5.3.1.4.7.2'] and hl7:templateId[@root = '2.16.840.1.113883.10.20.1.53']]/hl7:manufacturedMaterial[hl7:templateId[@root = '1.2.40.0.34.11.2.3.4'] and hl7:templateId[@root = '1.3.6.1.4.1.19376.1.9.1.3.1']]/pharm:ingredient[@classCode = 'ACTI'][pharm:ingredient[@classCode = 'MMAT'][@determinerCode = 'KIND']]/pharm:ingredient[not(@nullFlavor)][@classCode = 'MMAT'][@determinerCode = 'KIND']/pharm:code[@codeSystem = '2.16.840.1.113883.6.73' or @codeSystem = '1.2.40.0.34.5.156' or @nullFlavor]/*[not(@xsi:nil = 'true')][not(self::hl7:originalText | self::hl7:translation)]"
         id="d3579750e349-true-d3580012e0">
      <assert role="error"
              see="http://elga.art-decor.org/elgatgd-html-20240709T111220/tmp-1.2.40.0.34.6.0.11.3.72-2020-07-29T113517.html"
              test="not(.)">(atcdabbr_entry_MedikationsEinnahmeEntry)/d3579750e349-true-d3580012e0: '<value-of select="name(..)"/>' ist als geschlossen definiert und dieses Element '<name/>' ist nicht erlaubt oder nicht mit diesem Inhalt erlaubt. Dies kann templateId, code oder id betreffen. Erwartet:  hl7:originalText | hl7:translation (rule-reference: d3579750e349-true-d3580012e0)</assert>
   </rule>

   <!-- Checking undefined contents for template/element @isClosed="true". Match context that we did not already match -->
   <rule fpi="RUL-QQQ"
         context="*[hl7:substanceAdministration[hl7:templateId[@root = '1.2.40.0.34.6.0.11.3.72'] and hl7:templateId[@root = '2.16.840.1.113883.10.20.1.24'] and hl7:templateId[@root = '1.3.6.1.4.1.19376.1.5.3.1.4.7'] and hl7:templateId[@root = '1.3.6.1.4.1.19376.1.9.1.3.16'] and hl7:templateId[@root = '1.3.6.1.4.1.19376.1.5.3.1.4.7.1']]]/hl7:substanceAdministration[hl7:templateId[@root = '1.2.40.0.34.6.0.11.3.72'] and hl7:templateId[@root = '2.16.840.1.113883.10.20.1.24'] and hl7:templateId[@root = '1.3.6.1.4.1.19376.1.5.3.1.4.7'] and hl7:templateId[@root = '1.3.6.1.4.1.19376.1.9.1.3.16'] and hl7:templateId[@root = '1.3.6.1.4.1.19376.1.5.3.1.4.7.1']]/hl7:author[hl7:assignedAuthor]/*[not(@xsi:nil = 'true')][not(self::hl7:functionCode | self::hl7:time[not(@nullFlavor)] | self::hl7:time[@nullFlavor='UNK'] | self::hl7:assignedAuthor)]"
         id="d41e49661-true-d3580154e0">
      <assert role="error"
              see="http://elga.art-decor.org/elgatgd-html-20240709T111220/tmp-1.2.40.0.34.6.0.11.3.72-2020-07-29T113517.html"
              test="not(.)">(atcdabbr_entry_MedikationsEinnahmeEntry)/d41e49661-true-d3580154e0: '<value-of select="name(..)"/>' ist als geschlossen definiert und dieses Element '<name/>' ist nicht erlaubt oder nicht mit diesem Inhalt erlaubt. Dies kann templateId, code oder id betreffen. Erwartet:  hl7:functionCode | hl7:time[not(@nullFlavor)] | hl7:time[@nullFlavor='UNK'] | hl7:assignedAuthor (rule-reference: d41e49661-true-d3580154e0)</assert>
   </rule>

   <!-- Checking undefined contents for template/element @isClosed="true". Match context that we did not already match -->
   <rule fpi="RUL-QQQ"
         context="*[hl7:substanceAdministration[hl7:templateId[@root = '1.2.40.0.34.6.0.11.3.72'] and hl7:templateId[@root = '2.16.840.1.113883.10.20.1.24'] and hl7:templateId[@root = '1.3.6.1.4.1.19376.1.5.3.1.4.7'] and hl7:templateId[@root = '1.3.6.1.4.1.19376.1.9.1.3.16'] and hl7:templateId[@root = '1.3.6.1.4.1.19376.1.5.3.1.4.7.1']]]/hl7:substanceAdministration[hl7:templateId[@root = '1.2.40.0.34.6.0.11.3.72'] and hl7:templateId[@root = '2.16.840.1.113883.10.20.1.24'] and hl7:templateId[@root = '1.3.6.1.4.1.19376.1.5.3.1.4.7'] and hl7:templateId[@root = '1.3.6.1.4.1.19376.1.9.1.3.16'] and hl7:templateId[@root = '1.3.6.1.4.1.19376.1.5.3.1.4.7.1']]/hl7:author[hl7:assignedAuthor]/hl7:assignedAuthor/*[not(@xsi:nil = 'true')][not(self::hl7:id[not(@nullFlavor)] | self::hl7:id[@nullFlavor='UNK'] | self::hl7:code[not(@nullFlavor)] | self::hl7:addr[not(@nullFlavor)] | self::hl7:telecom[not(@nullFlavor)] | self::hl7:assignedPerson | self::hl7:assignedAuthoringDevice | self::hl7:representedOrganization)]"
         id="d3580032e45-true-d3580262e0">
      <assert role="error"
              see="http://elga.art-decor.org/elgatgd-html-20240709T111220/tmp-1.2.40.0.34.6.0.11.3.72-2020-07-29T113517.html"
              test="not(.)">(atcdabbr_entry_MedikationsEinnahmeEntry)/d3580032e45-true-d3580262e0: '<value-of select="name(..)"/>' ist als geschlossen definiert und dieses Element '<name/>' ist nicht erlaubt oder nicht mit diesem Inhalt erlaubt. Dies kann templateId, code oder id betreffen. Erwartet:  hl7:id[not(@nullFlavor)] | hl7:id[@nullFlavor='UNK'] | hl7:code[not(@nullFlavor)] | hl7:addr[not(@nullFlavor)] | hl7:telecom[not(@nullFlavor)] | hl7:assignedPerson | hl7:assignedAuthoringDevice | hl7:representedOrganization (rule-reference: d3580032e45-true-d3580262e0)</assert>
   </rule>

   <!-- Checking undefined contents for template/element @isClosed="true". Match context that we did not already match -->
   <rule fpi="RUL-QQQ"
         context="*[hl7:substanceAdministration[hl7:templateId[@root = '1.2.40.0.34.6.0.11.3.72'] and hl7:templateId[@root = '2.16.840.1.113883.10.20.1.24'] and hl7:templateId[@root = '1.3.6.1.4.1.19376.1.5.3.1.4.7'] and hl7:templateId[@root = '1.3.6.1.4.1.19376.1.9.1.3.16'] and hl7:templateId[@root = '1.3.6.1.4.1.19376.1.5.3.1.4.7.1']]]/hl7:substanceAdministration[hl7:templateId[@root = '1.2.40.0.34.6.0.11.3.72'] and hl7:templateId[@root = '2.16.840.1.113883.10.20.1.24'] and hl7:templateId[@root = '1.3.6.1.4.1.19376.1.5.3.1.4.7'] and hl7:templateId[@root = '1.3.6.1.4.1.19376.1.9.1.3.16'] and hl7:templateId[@root = '1.3.6.1.4.1.19376.1.5.3.1.4.7.1']]/hl7:author[hl7:assignedAuthor]/hl7:assignedAuthor/hl7:addr[not(@nullFlavor)]/*[not(@xsi:nil = 'true')][not(self::hl7:streetAddressLine | self::hl7:streetName | self::hl7:houseNumber | self::hl7:postalCode[not(@nullFlavor)] | self::hl7:city[not(@nullFlavor)] | self::hl7:state | self::hl7:country[not(@nullFlavor)] | self::hl7:additionalLocator)]"
         id="d3580032e64-true-d3580321e0">
      <assert role="error"
              see="http://elga.art-decor.org/elgatgd-html-20240709T111220/tmp-1.2.40.0.34.6.0.11.3.72-2020-07-29T113517.html"
              test="not(.)">(atcdabbr_entry_MedikationsEinnahmeEntry)/d3580032e64-true-d3580321e0: '<value-of select="name(..)"/>' ist als geschlossen definiert und dieses Element '<name/>' ist nicht erlaubt oder nicht mit diesem Inhalt erlaubt. Dies kann templateId, code oder id betreffen. Erwartet:  hl7:streetAddressLine | hl7:streetName | hl7:houseNumber | hl7:postalCode[not(@nullFlavor)] | hl7:city[not(@nullFlavor)] | hl7:state | hl7:country[not(@nullFlavor)] | hl7:additionalLocator (rule-reference: d3580032e64-true-d3580321e0)</assert>
   </rule>

   <!-- Checking undefined contents for template/element @isClosed="true". Match context that we did not already match -->
   <rule fpi="RUL-QQQ"
         context="*[hl7:substanceAdministration[hl7:templateId[@root = '1.2.40.0.34.6.0.11.3.72'] and hl7:templateId[@root = '2.16.840.1.113883.10.20.1.24'] and hl7:templateId[@root = '1.3.6.1.4.1.19376.1.5.3.1.4.7'] and hl7:templateId[@root = '1.3.6.1.4.1.19376.1.9.1.3.16'] and hl7:templateId[@root = '1.3.6.1.4.1.19376.1.5.3.1.4.7.1']]]/hl7:substanceAdministration[hl7:templateId[@root = '1.2.40.0.34.6.0.11.3.72'] and hl7:templateId[@root = '2.16.840.1.113883.10.20.1.24'] and hl7:templateId[@root = '1.3.6.1.4.1.19376.1.5.3.1.4.7'] and hl7:templateId[@root = '1.3.6.1.4.1.19376.1.9.1.3.16'] and hl7:templateId[@root = '1.3.6.1.4.1.19376.1.5.3.1.4.7.1']]/hl7:author[hl7:assignedAuthor]/hl7:assignedAuthor/hl7:assignedPerson/*[not(@xsi:nil = 'true')][not(self::hl7:name[not(@nullFlavor)] | self::hl7:name[@nullFlavor='UNK'] | self::hl7:name[@nullFlavor='MSK'])]"
         id="d3580032e110-true-d3580378e0">
      <assert role="error"
              see="http://elga.art-decor.org/elgatgd-html-20240709T111220/tmp-1.2.40.0.34.6.0.11.3.72-2020-07-29T113517.html"
              test="not(.)">(atcdabbr_entry_MedikationsEinnahmeEntry)/d3580032e110-true-d3580378e0: '<value-of select="name(..)"/>' ist als geschlossen definiert und dieses Element '<name/>' ist nicht erlaubt oder nicht mit diesem Inhalt erlaubt. Dies kann templateId, code oder id betreffen. Erwartet:  hl7:name[not(@nullFlavor)] | hl7:name[@nullFlavor='UNK'] | hl7:name[@nullFlavor='MSK'] (rule-reference: d3580032e110-true-d3580378e0)</assert>
   </rule>

   <!-- Checking undefined contents for template/element @isClosed="true". Match context that we did not already match -->
   <rule fpi="RUL-QQQ"
         context="*[hl7:substanceAdministration[hl7:templateId[@root = '1.2.40.0.34.6.0.11.3.72'] and hl7:templateId[@root = '2.16.840.1.113883.10.20.1.24'] and hl7:templateId[@root = '1.3.6.1.4.1.19376.1.5.3.1.4.7'] and hl7:templateId[@root = '1.3.6.1.4.1.19376.1.9.1.3.16'] and hl7:templateId[@root = '1.3.6.1.4.1.19376.1.5.3.1.4.7.1']]]/hl7:substanceAdministration[hl7:templateId[@root = '1.2.40.0.34.6.0.11.3.72'] and hl7:templateId[@root = '2.16.840.1.113883.10.20.1.24'] and hl7:templateId[@root = '1.3.6.1.4.1.19376.1.5.3.1.4.7'] and hl7:templateId[@root = '1.3.6.1.4.1.19376.1.9.1.3.16'] and hl7:templateId[@root = '1.3.6.1.4.1.19376.1.5.3.1.4.7.1']]/hl7:author[hl7:assignedAuthor]/hl7:assignedAuthor/hl7:assignedPerson/hl7:name[not(@nullFlavor)]/*[not(@xsi:nil = 'true')][not(self::hl7:prefix | self::hl7:family[not(@nullFlavor)] | self::hl7:given[not(@nullFlavor)] | self::hl7:suffix)]"
         id="d3580382e92-true-d3580412e0">
      <assert role="error"
              see="http://elga.art-decor.org/elgatgd-html-20240709T111220/tmp-1.2.40.0.34.6.0.11.9.6-2023-03-31T111555.html"
              test="not(.)">(atcdabbr_other_PersonNameCompilationG2)/d3580382e92-true-d3580412e0: '<value-of select="name(..)"/>' ist als geschlossen definiert und dieses Element '<name/>' ist nicht erlaubt oder nicht mit diesem Inhalt erlaubt. Dies kann templateId, code oder id betreffen. Erwartet:  hl7:prefix | hl7:family[not(@nullFlavor)] | hl7:given[not(@nullFlavor)] | hl7:suffix (rule-reference: d3580382e92-true-d3580412e0)</assert>
   </rule>

   <!-- Checking undefined contents for template/element @isClosed="true". Match context that we did not already match -->
   <rule fpi="RUL-QQQ"
         context="*[hl7:substanceAdministration[hl7:templateId[@root = '1.2.40.0.34.6.0.11.3.72'] and hl7:templateId[@root = '2.16.840.1.113883.10.20.1.24'] and hl7:templateId[@root = '1.3.6.1.4.1.19376.1.5.3.1.4.7'] and hl7:templateId[@root = '1.3.6.1.4.1.19376.1.9.1.3.16'] and hl7:templateId[@root = '1.3.6.1.4.1.19376.1.5.3.1.4.7.1']]]/hl7:substanceAdministration[hl7:templateId[@root = '1.2.40.0.34.6.0.11.3.72'] and hl7:templateId[@root = '2.16.840.1.113883.10.20.1.24'] and hl7:templateId[@root = '1.3.6.1.4.1.19376.1.5.3.1.4.7'] and hl7:templateId[@root = '1.3.6.1.4.1.19376.1.9.1.3.16'] and hl7:templateId[@root = '1.3.6.1.4.1.19376.1.5.3.1.4.7.1']]/hl7:author[hl7:assignedAuthor]/hl7:assignedAuthor/hl7:assignedAuthoringDevice/*[not(@xsi:nil = 'true')][not(self::hl7:manufacturerModelName[not(@nullFlavor)] | self::hl7:softwareName[not(@nullFlavor)])]"
         id="d3580032e133-true-d3580460e0">
      <assert role="error"
              see="http://elga.art-decor.org/elgatgd-html-20240709T111220/tmp-1.2.40.0.34.6.0.11.3.72-2020-07-29T113517.html"
              test="not(.)">(atcdabbr_entry_MedikationsEinnahmeEntry)/d3580032e133-true-d3580460e0: '<value-of select="name(..)"/>' ist als geschlossen definiert und dieses Element '<name/>' ist nicht erlaubt oder nicht mit diesem Inhalt erlaubt. Dies kann templateId, code oder id betreffen. Erwartet:  hl7:manufacturerModelName[not(@nullFlavor)] | hl7:softwareName[not(@nullFlavor)] (rule-reference: d3580032e133-true-d3580460e0)</assert>
   </rule>

   <!-- Checking undefined contents for template/element @isClosed="true". Match context that we did not already match -->
   <rule fpi="RUL-QQQ"
         context="*[hl7:substanceAdministration[hl7:templateId[@root = '1.2.40.0.34.6.0.11.3.72'] and hl7:templateId[@root = '2.16.840.1.113883.10.20.1.24'] and hl7:templateId[@root = '1.3.6.1.4.1.19376.1.5.3.1.4.7'] and hl7:templateId[@root = '1.3.6.1.4.1.19376.1.9.1.3.16'] and hl7:templateId[@root = '1.3.6.1.4.1.19376.1.5.3.1.4.7.1']]]/hl7:substanceAdministration[hl7:templateId[@root = '1.2.40.0.34.6.0.11.3.72'] and hl7:templateId[@root = '2.16.840.1.113883.10.20.1.24'] and hl7:templateId[@root = '1.3.6.1.4.1.19376.1.5.3.1.4.7'] and hl7:templateId[@root = '1.3.6.1.4.1.19376.1.9.1.3.16'] and hl7:templateId[@root = '1.3.6.1.4.1.19376.1.5.3.1.4.7.1']]/hl7:author[hl7:assignedAuthor]/hl7:assignedAuthor/hl7:representedOrganization/*[not(@xsi:nil = 'true')][not(self::hl7:id[not(@nullFlavor)] | self::hl7:name[not(@nullFlavor)] | self::hl7:telecom[not(@nullFlavor)] | self::hl7:addr[not(@nullFlavor)])]"
         id="d3580032e149-true-d3580505e0">
      <assert role="error"
              see="http://elga.art-decor.org/elgatgd-html-20240709T111220/tmp-1.2.40.0.34.6.0.11.3.72-2020-07-29T113517.html"
              test="not(.)">(atcdabbr_entry_MedikationsEinnahmeEntry)/d3580032e149-true-d3580505e0: '<value-of select="name(..)"/>' ist als geschlossen definiert und dieses Element '<name/>' ist nicht erlaubt oder nicht mit diesem Inhalt erlaubt. Dies kann templateId, code oder id betreffen. Erwartet:  hl7:id[not(@nullFlavor)] | hl7:name[not(@nullFlavor)] | hl7:telecom[not(@nullFlavor)] | hl7:addr[not(@nullFlavor)] (rule-reference: d3580032e149-true-d3580505e0)</assert>
   </rule>

   <!-- Checking undefined contents for template/element @isClosed="true". Match context that we did not already match -->
   <rule fpi="RUL-QQQ"
         context="*[hl7:substanceAdministration[hl7:templateId[@root = '1.2.40.0.34.6.0.11.3.72'] and hl7:templateId[@root = '2.16.840.1.113883.10.20.1.24'] and hl7:templateId[@root = '1.3.6.1.4.1.19376.1.5.3.1.4.7'] and hl7:templateId[@root = '1.3.6.1.4.1.19376.1.9.1.3.16'] and hl7:templateId[@root = '1.3.6.1.4.1.19376.1.5.3.1.4.7.1']]]/hl7:substanceAdministration[hl7:templateId[@root = '1.2.40.0.34.6.0.11.3.72'] and hl7:templateId[@root = '2.16.840.1.113883.10.20.1.24'] and hl7:templateId[@root = '1.3.6.1.4.1.19376.1.5.3.1.4.7'] and hl7:templateId[@root = '1.3.6.1.4.1.19376.1.9.1.3.16'] and hl7:templateId[@root = '1.3.6.1.4.1.19376.1.5.3.1.4.7.1']]/hl7:author[hl7:assignedAuthor]/hl7:assignedAuthor/hl7:representedOrganization/hl7:addr[not(@nullFlavor)]/*[not(@xsi:nil = 'true')][not(self::hl7:streetAddressLine | self::hl7:streetName | self::hl7:houseNumber | self::hl7:postalCode[not(@nullFlavor)] | self::hl7:city[not(@nullFlavor)] | self::hl7:state | self::hl7:country[not(@nullFlavor)] | self::hl7:additionalLocator)]"
         id="d3580475e67-true-d3580568e0">
      <assert role="error"
              see="http://elga.art-decor.org/elgatgd-html-20240709T111220/tmp-1.2.40.0.34.6.0.11.3.72-2020-07-29T113517.html"
              test="not(.)">(atcdabbr_entry_MedikationsEinnahmeEntry)/d3580475e67-true-d3580568e0: '<value-of select="name(..)"/>' ist als geschlossen definiert und dieses Element '<name/>' ist nicht erlaubt oder nicht mit diesem Inhalt erlaubt. Dies kann templateId, code oder id betreffen. Erwartet:  hl7:streetAddressLine | hl7:streetName | hl7:houseNumber | hl7:postalCode[not(@nullFlavor)] | hl7:city[not(@nullFlavor)] | hl7:state | hl7:country[not(@nullFlavor)] | hl7:additionalLocator (rule-reference: d3580475e67-true-d3580568e0)</assert>
   </rule>

   <!-- Checking undefined contents for template/element @isClosed="true". Match context that we did not already match -->
   <rule fpi="RUL-QQQ"
         context="*[hl7:substanceAdministration[hl7:templateId[@root = '1.2.40.0.34.6.0.11.3.72'] and hl7:templateId[@root = '2.16.840.1.113883.10.20.1.24'] and hl7:templateId[@root = '1.3.6.1.4.1.19376.1.5.3.1.4.7'] and hl7:templateId[@root = '1.3.6.1.4.1.19376.1.9.1.3.16'] and hl7:templateId[@root = '1.3.6.1.4.1.19376.1.5.3.1.4.7.1']]]/hl7:substanceAdministration[hl7:templateId[@root = '1.2.40.0.34.6.0.11.3.72'] and hl7:templateId[@root = '2.16.840.1.113883.10.20.1.24'] and hl7:templateId[@root = '1.3.6.1.4.1.19376.1.5.3.1.4.7'] and hl7:templateId[@root = '1.3.6.1.4.1.19376.1.9.1.3.16'] and hl7:templateId[@root = '1.3.6.1.4.1.19376.1.5.3.1.4.7.1']]/hl7:entryRelationship[@typeCode='RSON'][hl7:act/hl7:templateId[@root='1.3.6.1.4.1.19376.1.5.3.1.4.4.1']]/*[not(@xsi:nil = 'true')][not(self::hl7:act[hl7:templateId[@root = '1.3.6.1.4.1.19376.1.5.3.1.4.4.1']])]"
         id="d41e49676-true-d3580627e0">
      <assert role="error"
              see="http://elga.art-decor.org/elgatgd-html-20240709T111220/tmp-1.2.40.0.34.6.0.11.3.72-2020-07-29T113517.html"
              test="not(.)">(atcdabbr_entry_MedikationsEinnahmeEntry)/d41e49676-true-d3580627e0: '<value-of select="name(..)"/>' ist als geschlossen definiert und dieses Element '<name/>' ist nicht erlaubt oder nicht mit diesem Inhalt erlaubt. Dies kann templateId, code oder id betreffen. Erwartet:  hl7:act[hl7:templateId[@root = '1.3.6.1.4.1.19376.1.5.3.1.4.4.1']] (rule-reference: d41e49676-true-d3580627e0)</assert>
   </rule>

   <!-- Checking undefined contents for template/element @isClosed="true". Match context that we did not already match -->
   <rule fpi="RUL-QQQ"
         context="*[hl7:substanceAdministration[hl7:templateId[@root = '1.2.40.0.34.6.0.11.3.72'] and hl7:templateId[@root = '2.16.840.1.113883.10.20.1.24'] and hl7:templateId[@root = '1.3.6.1.4.1.19376.1.5.3.1.4.7'] and hl7:templateId[@root = '1.3.6.1.4.1.19376.1.9.1.3.16'] and hl7:templateId[@root = '1.3.6.1.4.1.19376.1.5.3.1.4.7.1']]]/hl7:substanceAdministration[hl7:templateId[@root = '1.2.40.0.34.6.0.11.3.72'] and hl7:templateId[@root = '2.16.840.1.113883.10.20.1.24'] and hl7:templateId[@root = '1.3.6.1.4.1.19376.1.5.3.1.4.7'] and hl7:templateId[@root = '1.3.6.1.4.1.19376.1.9.1.3.16'] and hl7:templateId[@root = '1.3.6.1.4.1.19376.1.5.3.1.4.7.1']]/hl7:entryRelationship[@typeCode='RSON'][hl7:act/hl7:templateId[@root='1.3.6.1.4.1.19376.1.5.3.1.4.4.1']]/hl7:act[hl7:templateId[@root = '1.3.6.1.4.1.19376.1.5.3.1.4.4.1']]/*[not(@xsi:nil = 'true')][not(self::hl7:templateId[@root = '1.3.6.1.4.1.19376.1.5.3.1.4.4.1'] | self::hl7:id[not(@nullFlavor)])]"
         id="d41e49690-true-d3580649e0">
      <assert role="error"
              see="http://elga.art-decor.org/elgatgd-html-20240709T111220/tmp-1.2.40.0.34.6.0.11.3.72-2020-07-29T113517.html"
              test="not(.)">(atcdabbr_entry_MedikationsEinnahmeEntry)/d41e49690-true-d3580649e0: '<value-of select="name(..)"/>' ist als geschlossen definiert und dieses Element '<name/>' ist nicht erlaubt oder nicht mit diesem Inhalt erlaubt. Dies kann templateId, code oder id betreffen. Erwartet:  hl7:templateId[@root = '1.3.6.1.4.1.19376.1.5.3.1.4.4.1'] | hl7:id[not(@nullFlavor)] (rule-reference: d41e49690-true-d3580649e0)</assert>
   </rule>

   <!-- Checking undefined contents for template/element @isClosed="true". Match context that we did not already match -->
   <rule fpi="RUL-QQQ"
         context="*[hl7:substanceAdministration[hl7:templateId[@root = '1.2.40.0.34.6.0.11.3.72'] and hl7:templateId[@root = '2.16.840.1.113883.10.20.1.24'] and hl7:templateId[@root = '1.3.6.1.4.1.19376.1.5.3.1.4.7'] and hl7:templateId[@root = '1.3.6.1.4.1.19376.1.9.1.3.16'] and hl7:templateId[@root = '1.3.6.1.4.1.19376.1.5.3.1.4.7.1']]]/hl7:substanceAdministration[hl7:templateId[@root = '1.2.40.0.34.6.0.11.3.72'] and hl7:templateId[@root = '2.16.840.1.113883.10.20.1.24'] and hl7:templateId[@root = '1.3.6.1.4.1.19376.1.5.3.1.4.7'] and hl7:templateId[@root = '1.3.6.1.4.1.19376.1.9.1.3.16'] and hl7:templateId[@root = '1.3.6.1.4.1.19376.1.5.3.1.4.7.1']]/hl7:entryRelationship[@typeCode='SUBJ'][hl7:act/hl7:templateId[@root='2.16.840.1.113883.10.20.1.43']]/*[not(@xsi:nil = 'true')][not(self::hl7:act[hl7:templateId[@root = '2.16.840.1.113883.10.20.1.43'] and hl7:templateId[@root = '1.3.6.1.4.1.19376.1.5.3.1.4.3.1']])]"
         id="d41e49710-true-d3580676e0">
      <assert role="error"
              see="http://elga.art-decor.org/elgatgd-html-20240709T111220/tmp-1.2.40.0.34.6.0.11.3.72-2020-07-29T113517.html"
              test="not(.)">(atcdabbr_entry_MedikationsEinnahmeEntry)/d41e49710-true-d3580676e0: '<value-of select="name(..)"/>' ist als geschlossen definiert und dieses Element '<name/>' ist nicht erlaubt oder nicht mit diesem Inhalt erlaubt. Dies kann templateId, code oder id betreffen. Erwartet:  hl7:act[hl7:templateId[@root = '2.16.840.1.113883.10.20.1.43'] and hl7:templateId[@root = '1.3.6.1.4.1.19376.1.5.3.1.4.3.1']] (rule-reference: d41e49710-true-d3580676e0)</assert>
   </rule>

   <!-- Checking undefined contents for template/element @isClosed="true". Match context that we did not already match -->
   <rule fpi="RUL-QQQ"
         context="*[hl7:substanceAdministration[hl7:templateId[@root = '1.2.40.0.34.6.0.11.3.72'] and hl7:templateId[@root = '2.16.840.1.113883.10.20.1.24'] and hl7:templateId[@root = '1.3.6.1.4.1.19376.1.5.3.1.4.7'] and hl7:templateId[@root = '1.3.6.1.4.1.19376.1.9.1.3.16'] and hl7:templateId[@root = '1.3.6.1.4.1.19376.1.5.3.1.4.7.1']]]/hl7:substanceAdministration[hl7:templateId[@root = '1.2.40.0.34.6.0.11.3.72'] and hl7:templateId[@root = '2.16.840.1.113883.10.20.1.24'] and hl7:templateId[@root = '1.3.6.1.4.1.19376.1.5.3.1.4.7'] and hl7:templateId[@root = '1.3.6.1.4.1.19376.1.9.1.3.16'] and hl7:templateId[@root = '1.3.6.1.4.1.19376.1.5.3.1.4.7.1']]/hl7:entryRelationship[@typeCode='SUBJ'][hl7:act/hl7:templateId[@root='2.16.840.1.113883.10.20.1.43']]/hl7:act[hl7:templateId[@root = '2.16.840.1.113883.10.20.1.43'] and hl7:templateId[@root = '1.3.6.1.4.1.19376.1.5.3.1.4.3.1']]/*[not(@xsi:nil = 'true')][not(self::hl7:templateId[@root = '2.16.840.1.113883.10.20.1.43'] | self::hl7:templateId[@root = '1.3.6.1.4.1.19376.1.5.3.1.4.3.1'] | self::hl7:code[(@code = 'FINSTRUCT' and @codeSystem = '1.3.6.1.4.1.19376.1.5.3.2')] | self::hl7:text[not(@nullFlavor)] | self::hl7:statusCode[@code = 'completed'])]"
         id="d41e49721-true-d3580720e0">
      <assert role="error"
              see="http://elga.art-decor.org/elgatgd-html-20240709T111220/tmp-1.2.40.0.34.6.0.11.3.72-2020-07-29T113517.html"
              test="not(.)">(atcdabbr_entry_MedikationsEinnahmeEntry)/d41e49721-true-d3580720e0: '<value-of select="name(..)"/>' ist als geschlossen definiert und dieses Element '<name/>' ist nicht erlaubt oder nicht mit diesem Inhalt erlaubt. Dies kann templateId, code oder id betreffen. Erwartet:  hl7:templateId[@root = '2.16.840.1.113883.10.20.1.43'] | hl7:templateId[@root = '1.3.6.1.4.1.19376.1.5.3.1.4.3.1'] | hl7:code[(@code = 'FINSTRUCT' and @codeSystem = '1.3.6.1.4.1.19376.1.5.3.2')] | hl7:text[not(@nullFlavor)] | hl7:statusCode[@code = 'completed'] (rule-reference: d41e49721-true-d3580720e0)</assert>
   </rule>

   <!-- Checking undefined contents for template/element @isClosed="true". Match context that we did not already match -->
   <rule fpi="RUL-QQQ"
         context="*[hl7:substanceAdministration[hl7:templateId[@root = '1.2.40.0.34.6.0.11.3.72'] and hl7:templateId[@root = '2.16.840.1.113883.10.20.1.24'] and hl7:templateId[@root = '1.3.6.1.4.1.19376.1.5.3.1.4.7'] and hl7:templateId[@root = '1.3.6.1.4.1.19376.1.9.1.3.16'] and hl7:templateId[@root = '1.3.6.1.4.1.19376.1.5.3.1.4.7.1']]]/hl7:substanceAdministration[hl7:templateId[@root = '1.2.40.0.34.6.0.11.3.72'] and hl7:templateId[@root = '2.16.840.1.113883.10.20.1.24'] and hl7:templateId[@root = '1.3.6.1.4.1.19376.1.5.3.1.4.7'] and hl7:templateId[@root = '1.3.6.1.4.1.19376.1.9.1.3.16'] and hl7:templateId[@root = '1.3.6.1.4.1.19376.1.5.3.1.4.7.1']]/hl7:entryRelationship[@typeCode='SUBJ'][hl7:act/hl7:templateId[@root='2.16.840.1.113883.10.20.1.43']]/hl7:act[hl7:templateId[@root = '2.16.840.1.113883.10.20.1.43'] and hl7:templateId[@root = '1.3.6.1.4.1.19376.1.5.3.1.4.3.1']]/hl7:text[not(@nullFlavor)]/*[not(@xsi:nil = 'true')][not(self::hl7:reference[not(@nullFlavor)])]"
         id="d41e49743-true-d3580752e0">
      <assert role="error"
              see="http://elga.art-decor.org/elgatgd-html-20240709T111220/tmp-1.2.40.0.34.6.0.11.3.72-2020-07-29T113517.html"
              test="not(.)">(atcdabbr_entry_MedikationsEinnahmeEntry)/d41e49743-true-d3580752e0: '<value-of select="name(..)"/>' ist als geschlossen definiert und dieses Element '<name/>' ist nicht erlaubt oder nicht mit diesem Inhalt erlaubt. Dies kann templateId, code oder id betreffen. Erwartet:  hl7:reference[not(@nullFlavor)] (rule-reference: d41e49743-true-d3580752e0)</assert>
   </rule>

   <!-- Checking undefined contents for template/element @isClosed="true". Match context that we did not already match -->
   <rule fpi="RUL-QQQ"
         context="*[hl7:substanceAdministration[hl7:templateId[@root = '1.2.40.0.34.6.0.11.3.72'] and hl7:templateId[@root = '2.16.840.1.113883.10.20.1.24'] and hl7:templateId[@root = '1.3.6.1.4.1.19376.1.5.3.1.4.7'] and hl7:templateId[@root = '1.3.6.1.4.1.19376.1.9.1.3.16'] and hl7:templateId[@root = '1.3.6.1.4.1.19376.1.5.3.1.4.7.1']]]/hl7:substanceAdministration[hl7:templateId[@root = '1.2.40.0.34.6.0.11.3.72'] and hl7:templateId[@root = '2.16.840.1.113883.10.20.1.24'] and hl7:templateId[@root = '1.3.6.1.4.1.19376.1.5.3.1.4.7'] and hl7:templateId[@root = '1.3.6.1.4.1.19376.1.9.1.3.16'] and hl7:templateId[@root = '1.3.6.1.4.1.19376.1.5.3.1.4.7.1']]/hl7:entryRelationship[@typeCode='COMP'][hl7:supply]/*[not(@xsi:nil = 'true')][not(self::hl7:supply[not(@nullFlavor)][@classCode = 'SPLY'][@moodCode = 'RQO'])]"
         id="d41e49766-true-d3580775e0">
      <assert role="error"
              see="http://elga.art-decor.org/elgatgd-html-20240709T111220/tmp-1.2.40.0.34.6.0.11.3.72-2020-07-29T113517.html"
              test="not(.)">(atcdabbr_entry_MedikationsEinnahmeEntry)/d41e49766-true-d3580775e0: '<value-of select="name(..)"/>' ist als geschlossen definiert und dieses Element '<name/>' ist nicht erlaubt oder nicht mit diesem Inhalt erlaubt. Dies kann templateId, code oder id betreffen. Erwartet:  hl7:supply[not(@nullFlavor)][@classCode = 'SPLY'][@moodCode = 'RQO'] (rule-reference: d41e49766-true-d3580775e0)</assert>
   </rule>

   <!-- Checking undefined contents for template/element @isClosed="true". Match context that we did not already match -->
   <rule fpi="RUL-QQQ"
         context="*[hl7:substanceAdministration[hl7:templateId[@root = '1.2.40.0.34.6.0.11.3.72'] and hl7:templateId[@root = '2.16.840.1.113883.10.20.1.24'] and hl7:templateId[@root = '1.3.6.1.4.1.19376.1.5.3.1.4.7'] and hl7:templateId[@root = '1.3.6.1.4.1.19376.1.9.1.3.16'] and hl7:templateId[@root = '1.3.6.1.4.1.19376.1.5.3.1.4.7.1']]]/hl7:substanceAdministration[hl7:templateId[@root = '1.2.40.0.34.6.0.11.3.72'] and hl7:templateId[@root = '2.16.840.1.113883.10.20.1.24'] and hl7:templateId[@root = '1.3.6.1.4.1.19376.1.5.3.1.4.7'] and hl7:templateId[@root = '1.3.6.1.4.1.19376.1.9.1.3.16'] and hl7:templateId[@root = '1.3.6.1.4.1.19376.1.5.3.1.4.7.1']]/hl7:entryRelationship[@typeCode='COMP'][hl7:supply]/hl7:supply[not(@nullFlavor)][@classCode = 'SPLY'][@moodCode = 'RQO']/*[not(@xsi:nil = 'true')][not(self::hl7:independentInd[not(@nullFlavor)] | self::hl7:quantity)]"
         id="d41e49791-true-d3580794e0">
      <assert role="error"
              see="http://elga.art-decor.org/elgatgd-html-20240709T111220/tmp-1.2.40.0.34.6.0.11.3.72-2020-07-29T113517.html"
              test="not(.)">(atcdabbr_entry_MedikationsEinnahmeEntry)/d41e49791-true-d3580794e0: '<value-of select="name(..)"/>' ist als geschlossen definiert und dieses Element '<name/>' ist nicht erlaubt oder nicht mit diesem Inhalt erlaubt. Dies kann templateId, code oder id betreffen. Erwartet:  hl7:independentInd[not(@nullFlavor)] | hl7:quantity (rule-reference: d41e49791-true-d3580794e0)</assert>
   </rule>

   <!-- Checking undefined contents for template/element @isClosed="true". Match context that we did not already match -->
   <rule fpi="RUL-QQQ"
         context="*[hl7:substanceAdministration[hl7:templateId[@root = '1.2.40.0.34.6.0.11.3.72'] and hl7:templateId[@root = '2.16.840.1.113883.10.20.1.24'] and hl7:templateId[@root = '1.3.6.1.4.1.19376.1.5.3.1.4.7'] and hl7:templateId[@root = '1.3.6.1.4.1.19376.1.9.1.3.16'] and hl7:templateId[@root = '1.3.6.1.4.1.19376.1.5.3.1.4.7.1']]]/hl7:substanceAdministration[hl7:templateId[@root = '1.2.40.0.34.6.0.11.3.72'] and hl7:templateId[@root = '2.16.840.1.113883.10.20.1.24'] and hl7:templateId[@root = '1.3.6.1.4.1.19376.1.5.3.1.4.7'] and hl7:templateId[@root = '1.3.6.1.4.1.19376.1.9.1.3.16'] and hl7:templateId[@root = '1.3.6.1.4.1.19376.1.5.3.1.4.7.1']]/hl7:entryRelationship[@typeCode='REFR'][hl7:substanceAdministration/hl7:templateId[@root='1.3.6.1.4.1.19376.1.9.1.3.10']]/*[not(@xsi:nil = 'true')][not(self::hl7:substanceAdministration[hl7:templateId[@root = '1.3.6.1.4.1.19376.1.9.1.3.10']])]"
         id="d41e49839-true-d3580818e0">
      <assert role="error"
              see="http://elga.art-decor.org/elgatgd-html-20240709T111220/tmp-1.2.40.0.34.6.0.11.3.72-2020-07-29T113517.html"
              test="not(.)">(atcdabbr_entry_MedikationsEinnahmeEntry)/d41e49839-true-d3580818e0: '<value-of select="name(..)"/>' ist als geschlossen definiert und dieses Element '<name/>' ist nicht erlaubt oder nicht mit diesem Inhalt erlaubt. Dies kann templateId, code oder id betreffen. Erwartet:  hl7:substanceAdministration[hl7:templateId[@root = '1.3.6.1.4.1.19376.1.9.1.3.10']] (rule-reference: d41e49839-true-d3580818e0)</assert>
   </rule>

   <!-- Checking undefined contents for template/element @isClosed="true". Match context that we did not already match -->
   <rule fpi="RUL-QQQ"
         context="*[hl7:substanceAdministration[hl7:templateId[@root = '1.2.40.0.34.6.0.11.3.72'] and hl7:templateId[@root = '2.16.840.1.113883.10.20.1.24'] and hl7:templateId[@root = '1.3.6.1.4.1.19376.1.5.3.1.4.7'] and hl7:templateId[@root = '1.3.6.1.4.1.19376.1.9.1.3.16'] and hl7:templateId[@root = '1.3.6.1.4.1.19376.1.5.3.1.4.7.1']]]/hl7:substanceAdministration[hl7:templateId[@root = '1.2.40.0.34.6.0.11.3.72'] and hl7:templateId[@root = '2.16.840.1.113883.10.20.1.24'] and hl7:templateId[@root = '1.3.6.1.4.1.19376.1.5.3.1.4.7'] and hl7:templateId[@root = '1.3.6.1.4.1.19376.1.9.1.3.16'] and hl7:templateId[@root = '1.3.6.1.4.1.19376.1.5.3.1.4.7.1']]/hl7:entryRelationship[@typeCode='REFR'][hl7:substanceAdministration/hl7:templateId[@root='1.3.6.1.4.1.19376.1.9.1.3.10']]/hl7:substanceAdministration[hl7:templateId[@root = '1.3.6.1.4.1.19376.1.9.1.3.10']]/*[not(@xsi:nil = 'true')][not(self::hl7:templateId[@root = '1.3.6.1.4.1.19376.1.9.1.3.10'] | self::hl7:id[not(@nullFlavor)] | self::hl7:code[(@code = 'MTPItem' and @codeSystem = '1.3.6.1.4.1.19376.1.9.2.2')] | self::hl7:consumable[not(@nullFlavor)][hl7:manufacturedProduct])]"
         id="d41e49853-true-d3580852e0">
      <assert role="error"
              see="http://elga.art-decor.org/elgatgd-html-20240709T111220/tmp-1.2.40.0.34.6.0.11.3.72-2020-07-29T113517.html"
              test="not(.)">(atcdabbr_entry_MedikationsEinnahmeEntry)/d41e49853-true-d3580852e0: '<value-of select="name(..)"/>' ist als geschlossen definiert und dieses Element '<name/>' ist nicht erlaubt oder nicht mit diesem Inhalt erlaubt. Dies kann templateId, code oder id betreffen. Erwartet:  hl7:templateId[@root = '1.3.6.1.4.1.19376.1.9.1.3.10'] | hl7:id[not(@nullFlavor)] | hl7:code[(@code = 'MTPItem' and @codeSystem = '1.3.6.1.4.1.19376.1.9.2.2')] | hl7:consumable[not(@nullFlavor)][hl7:manufacturedProduct] (rule-reference: d41e49853-true-d3580852e0)</assert>
   </rule>

   <!-- Checking undefined contents for template/element @isClosed="true". Match context that we did not already match -->
   <rule fpi="RUL-QQQ"
         context="*[hl7:substanceAdministration[hl7:templateId[@root = '1.2.40.0.34.6.0.11.3.72'] and hl7:templateId[@root = '2.16.840.1.113883.10.20.1.24'] and hl7:templateId[@root = '1.3.6.1.4.1.19376.1.5.3.1.4.7'] and hl7:templateId[@root = '1.3.6.1.4.1.19376.1.9.1.3.16'] and hl7:templateId[@root = '1.3.6.1.4.1.19376.1.5.3.1.4.7.1']]]/hl7:substanceAdministration[hl7:templateId[@root = '1.2.40.0.34.6.0.11.3.72'] and hl7:templateId[@root = '2.16.840.1.113883.10.20.1.24'] and hl7:templateId[@root = '1.3.6.1.4.1.19376.1.5.3.1.4.7'] and hl7:templateId[@root = '1.3.6.1.4.1.19376.1.9.1.3.16'] and hl7:templateId[@root = '1.3.6.1.4.1.19376.1.5.3.1.4.7.1']]/hl7:entryRelationship[@typeCode='REFR'][hl7:substanceAdministration/hl7:templateId[@root='1.3.6.1.4.1.19376.1.9.1.3.10']]/hl7:substanceAdministration[hl7:templateId[@root = '1.3.6.1.4.1.19376.1.9.1.3.10']]/hl7:consumable[not(@nullFlavor)][hl7:manufacturedProduct]/*[not(@xsi:nil = 'true')][not(self::hl7:manufacturedProduct[not(@nullFlavor)][hl7:manufacturedMaterial[@nullFlavor = 'NA']])]"
         id="d41e49887-true-d3580883e0">
      <assert role="error"
              see="http://elga.art-decor.org/elgatgd-html-20240709T111220/tmp-1.2.40.0.34.6.0.11.3.72-2020-07-29T113517.html"
              test="not(.)">(atcdabbr_entry_MedikationsEinnahmeEntry)/d41e49887-true-d3580883e0: '<value-of select="name(..)"/>' ist als geschlossen definiert und dieses Element '<name/>' ist nicht erlaubt oder nicht mit diesem Inhalt erlaubt. Dies kann templateId, code oder id betreffen. Erwartet:  hl7:manufacturedProduct[not(@nullFlavor)][hl7:manufacturedMaterial[@nullFlavor = 'NA']] (rule-reference: d41e49887-true-d3580883e0)</assert>
   </rule>

   <!-- Checking undefined contents for template/element @isClosed="true". Match context that we did not already match -->
   <rule fpi="RUL-QQQ"
         context="*[hl7:substanceAdministration[hl7:templateId[@root = '1.2.40.0.34.6.0.11.3.72'] and hl7:templateId[@root = '2.16.840.1.113883.10.20.1.24'] and hl7:templateId[@root = '1.3.6.1.4.1.19376.1.5.3.1.4.7'] and hl7:templateId[@root = '1.3.6.1.4.1.19376.1.9.1.3.16'] and hl7:templateId[@root = '1.3.6.1.4.1.19376.1.5.3.1.4.7.1']]]/hl7:substanceAdministration[hl7:templateId[@root = '1.2.40.0.34.6.0.11.3.72'] and hl7:templateId[@root = '2.16.840.1.113883.10.20.1.24'] and hl7:templateId[@root = '1.3.6.1.4.1.19376.1.5.3.1.4.7'] and hl7:templateId[@root = '1.3.6.1.4.1.19376.1.9.1.3.16'] and hl7:templateId[@root = '1.3.6.1.4.1.19376.1.5.3.1.4.7.1']]/hl7:entryRelationship[@typeCode='REFR'][hl7:substanceAdministration/hl7:templateId[@root='1.3.6.1.4.1.19376.1.9.1.3.10']]/hl7:substanceAdministration[hl7:templateId[@root = '1.3.6.1.4.1.19376.1.9.1.3.10']]/hl7:consumable[not(@nullFlavor)][hl7:manufacturedProduct]/hl7:manufacturedProduct[not(@nullFlavor)][hl7:manufacturedMaterial[@nullFlavor = 'NA']]/*[not(@xsi:nil = 'true')][not(self::hl7:manufacturedMaterial[@nullFlavor = 'NA'])]"
         id="d41e49889-true-d3580897e0">
      <assert role="error"
              see="http://elga.art-decor.org/elgatgd-html-20240709T111220/tmp-1.2.40.0.34.6.0.11.3.72-2020-07-29T113517.html"
              test="not(.)">(atcdabbr_entry_MedikationsEinnahmeEntry)/d41e49889-true-d3580897e0: '<value-of select="name(..)"/>' ist als geschlossen definiert und dieses Element '<name/>' ist nicht erlaubt oder nicht mit diesem Inhalt erlaubt. Dies kann templateId, code oder id betreffen. Erwartet:  hl7:manufacturedMaterial[@nullFlavor = 'NA'] (rule-reference: d41e49889-true-d3580897e0)</assert>
   </rule>

   <!-- Checking undefined contents for template/element @isClosed="true". Match context that we did not already match -->
   <rule fpi="RUL-QQQ"
         context="*[hl7:substanceAdministration[hl7:templateId[@root = '1.2.40.0.34.6.0.11.3.72'] and hl7:templateId[@root = '2.16.840.1.113883.10.20.1.24'] and hl7:templateId[@root = '1.3.6.1.4.1.19376.1.5.3.1.4.7'] and hl7:templateId[@root = '1.3.6.1.4.1.19376.1.9.1.3.16'] and hl7:templateId[@root = '1.3.6.1.4.1.19376.1.5.3.1.4.7.1']]]/hl7:substanceAdministration[hl7:templateId[@root = '1.2.40.0.34.6.0.11.3.72'] and hl7:templateId[@root = '2.16.840.1.113883.10.20.1.24'] and hl7:templateId[@root = '1.3.6.1.4.1.19376.1.5.3.1.4.7'] and hl7:templateId[@root = '1.3.6.1.4.1.19376.1.9.1.3.16'] and hl7:templateId[@root = '1.3.6.1.4.1.19376.1.5.3.1.4.7.1']]/hl7:entryRelationship[@typeCode='REFR'][hl7:substanceAdministration/hl7:templateId[@root='1.3.6.1.4.1.19376.1.9.1.3.11']]/*[not(@xsi:nil = 'true')][not(self::hl7:substanceAdministration[hl7:templateId[@root = '1.3.6.1.4.1.19376.1.9.1.3.11']])]"
         id="d41e49900-true-d3580916e0">
      <assert role="error"
              see="http://elga.art-decor.org/elgatgd-html-20240709T111220/tmp-1.2.40.0.34.6.0.11.3.72-2020-07-29T113517.html"
              test="not(.)">(atcdabbr_entry_MedikationsEinnahmeEntry)/d41e49900-true-d3580916e0: '<value-of select="name(..)"/>' ist als geschlossen definiert und dieses Element '<name/>' ist nicht erlaubt oder nicht mit diesem Inhalt erlaubt. Dies kann templateId, code oder id betreffen. Erwartet:  hl7:substanceAdministration[hl7:templateId[@root = '1.3.6.1.4.1.19376.1.9.1.3.11']] (rule-reference: d41e49900-true-d3580916e0)</assert>
   </rule>

   <!-- Checking undefined contents for template/element @isClosed="true". Match context that we did not already match -->
   <rule fpi="RUL-QQQ"
         context="*[hl7:substanceAdministration[hl7:templateId[@root = '1.2.40.0.34.6.0.11.3.72'] and hl7:templateId[@root = '2.16.840.1.113883.10.20.1.24'] and hl7:templateId[@root = '1.3.6.1.4.1.19376.1.5.3.1.4.7'] and hl7:templateId[@root = '1.3.6.1.4.1.19376.1.9.1.3.16'] and hl7:templateId[@root = '1.3.6.1.4.1.19376.1.5.3.1.4.7.1']]]/hl7:substanceAdministration[hl7:templateId[@root = '1.2.40.0.34.6.0.11.3.72'] and hl7:templateId[@root = '2.16.840.1.113883.10.20.1.24'] and hl7:templateId[@root = '1.3.6.1.4.1.19376.1.5.3.1.4.7'] and hl7:templateId[@root = '1.3.6.1.4.1.19376.1.9.1.3.16'] and hl7:templateId[@root = '1.3.6.1.4.1.19376.1.5.3.1.4.7.1']]/hl7:entryRelationship[@typeCode='REFR'][hl7:substanceAdministration/hl7:templateId[@root='1.3.6.1.4.1.19376.1.9.1.3.11']]/hl7:substanceAdministration[hl7:templateId[@root = '1.3.6.1.4.1.19376.1.9.1.3.11']]/*[not(@xsi:nil = 'true')][not(self::hl7:templateId[@root = '1.3.6.1.4.1.19376.1.9.1.3.11'] | self::hl7:id[not(@nullFlavor)] | self::hl7:code[(@code = 'PREItem' and @codeSystem = '1.3.6.1.4.1.19376.1.9.2.2')] | self::hl7:consumable[not(@nullFlavor)][hl7:manufacturedProduct])]"
         id="d41e49909-true-d3580950e0">
      <assert role="error"
              see="http://elga.art-decor.org/elgatgd-html-20240709T111220/tmp-1.2.40.0.34.6.0.11.3.72-2020-07-29T113517.html"
              test="not(.)">(atcdabbr_entry_MedikationsEinnahmeEntry)/d41e49909-true-d3580950e0: '<value-of select="name(..)"/>' ist als geschlossen definiert und dieses Element '<name/>' ist nicht erlaubt oder nicht mit diesem Inhalt erlaubt. Dies kann templateId, code oder id betreffen. Erwartet:  hl7:templateId[@root = '1.3.6.1.4.1.19376.1.9.1.3.11'] | hl7:id[not(@nullFlavor)] | hl7:code[(@code = 'PREItem' and @codeSystem = '1.3.6.1.4.1.19376.1.9.2.2')] | hl7:consumable[not(@nullFlavor)][hl7:manufacturedProduct] (rule-reference: d41e49909-true-d3580950e0)</assert>
   </rule>

   <!-- Checking undefined contents for template/element @isClosed="true". Match context that we did not already match -->
   <rule fpi="RUL-QQQ"
         context="*[hl7:substanceAdministration[hl7:templateId[@root = '1.2.40.0.34.6.0.11.3.72'] and hl7:templateId[@root = '2.16.840.1.113883.10.20.1.24'] and hl7:templateId[@root = '1.3.6.1.4.1.19376.1.5.3.1.4.7'] and hl7:templateId[@root = '1.3.6.1.4.1.19376.1.9.1.3.16'] and hl7:templateId[@root = '1.3.6.1.4.1.19376.1.5.3.1.4.7.1']]]/hl7:substanceAdministration[hl7:templateId[@root = '1.2.40.0.34.6.0.11.3.72'] and hl7:templateId[@root = '2.16.840.1.113883.10.20.1.24'] and hl7:templateId[@root = '1.3.6.1.4.1.19376.1.5.3.1.4.7'] and hl7:templateId[@root = '1.3.6.1.4.1.19376.1.9.1.3.16'] and hl7:templateId[@root = '1.3.6.1.4.1.19376.1.5.3.1.4.7.1']]/hl7:entryRelationship[@typeCode='REFR'][hl7:substanceAdministration/hl7:templateId[@root='1.3.6.1.4.1.19376.1.9.1.3.11']]/hl7:substanceAdministration[hl7:templateId[@root = '1.3.6.1.4.1.19376.1.9.1.3.11']]/hl7:consumable[not(@nullFlavor)][hl7:manufacturedProduct]/*[not(@xsi:nil = 'true')][not(self::hl7:manufacturedProduct[not(@nullFlavor)][hl7:manufacturedMaterial[@nullFlavor = 'NA']])]"
         id="d41e49943-true-d3580981e0">
      <assert role="error"
              see="http://elga.art-decor.org/elgatgd-html-20240709T111220/tmp-1.2.40.0.34.6.0.11.3.72-2020-07-29T113517.html"
              test="not(.)">(atcdabbr_entry_MedikationsEinnahmeEntry)/d41e49943-true-d3580981e0: '<value-of select="name(..)"/>' ist als geschlossen definiert und dieses Element '<name/>' ist nicht erlaubt oder nicht mit diesem Inhalt erlaubt. Dies kann templateId, code oder id betreffen. Erwartet:  hl7:manufacturedProduct[not(@nullFlavor)][hl7:manufacturedMaterial[@nullFlavor = 'NA']] (rule-reference: d41e49943-true-d3580981e0)</assert>
   </rule>

   <!-- Checking undefined contents for template/element @isClosed="true". Match context that we did not already match -->
   <rule fpi="RUL-QQQ"
         context="*[hl7:substanceAdministration[hl7:templateId[@root = '1.2.40.0.34.6.0.11.3.72'] and hl7:templateId[@root = '2.16.840.1.113883.10.20.1.24'] and hl7:templateId[@root = '1.3.6.1.4.1.19376.1.5.3.1.4.7'] and hl7:templateId[@root = '1.3.6.1.4.1.19376.1.9.1.3.16'] and hl7:templateId[@root = '1.3.6.1.4.1.19376.1.5.3.1.4.7.1']]]/hl7:substanceAdministration[hl7:templateId[@root = '1.2.40.0.34.6.0.11.3.72'] and hl7:templateId[@root = '2.16.840.1.113883.10.20.1.24'] and hl7:templateId[@root = '1.3.6.1.4.1.19376.1.5.3.1.4.7'] and hl7:templateId[@root = '1.3.6.1.4.1.19376.1.9.1.3.16'] and hl7:templateId[@root = '1.3.6.1.4.1.19376.1.5.3.1.4.7.1']]/hl7:entryRelationship[@typeCode='REFR'][hl7:substanceAdministration/hl7:templateId[@root='1.3.6.1.4.1.19376.1.9.1.3.11']]/hl7:substanceAdministration[hl7:templateId[@root = '1.3.6.1.4.1.19376.1.9.1.3.11']]/hl7:consumable[not(@nullFlavor)][hl7:manufacturedProduct]/hl7:manufacturedProduct[not(@nullFlavor)][hl7:manufacturedMaterial[@nullFlavor = 'NA']]/*[not(@xsi:nil = 'true')][not(self::hl7:manufacturedMaterial[@nullFlavor = 'NA'])]"
         id="d41e49945-true-d3580995e0">
      <assert role="error"
              see="http://elga.art-decor.org/elgatgd-html-20240709T111220/tmp-1.2.40.0.34.6.0.11.3.72-2020-07-29T113517.html"
              test="not(.)">(atcdabbr_entry_MedikationsEinnahmeEntry)/d41e49945-true-d3580995e0: '<value-of select="name(..)"/>' ist als geschlossen definiert und dieses Element '<name/>' ist nicht erlaubt oder nicht mit diesem Inhalt erlaubt. Dies kann templateId, code oder id betreffen. Erwartet:  hl7:manufacturedMaterial[@nullFlavor = 'NA'] (rule-reference: d41e49945-true-d3580995e0)</assert>
   </rule>

   <!-- Checking undefined contents for template/element @isClosed="true". Match context that we did not already match -->
   <rule fpi="RUL-QQQ"
         context="*[hl7:substanceAdministration[hl7:templateId[@root = '1.2.40.0.34.6.0.11.3.72'] and hl7:templateId[@root = '2.16.840.1.113883.10.20.1.24'] and hl7:templateId[@root = '1.3.6.1.4.1.19376.1.5.3.1.4.7'] and hl7:templateId[@root = '1.3.6.1.4.1.19376.1.9.1.3.16'] and hl7:templateId[@root = '1.3.6.1.4.1.19376.1.5.3.1.4.7.1']]]/hl7:substanceAdministration[hl7:templateId[@root = '1.2.40.0.34.6.0.11.3.72'] and hl7:templateId[@root = '2.16.840.1.113883.10.20.1.24'] and hl7:templateId[@root = '1.3.6.1.4.1.19376.1.5.3.1.4.7'] and hl7:templateId[@root = '1.3.6.1.4.1.19376.1.9.1.3.16'] and hl7:templateId[@root = '1.3.6.1.4.1.19376.1.5.3.1.4.7.1']]/hl7:entryRelationship[@typeCode='REFR'][hl7:substanceAdministration/hl7:templateId[@root='1.3.6.1.4.1.19376.1.9.1.3.12']]/*[not(@xsi:nil = 'true')][not(self::hl7:substanceAdministration[hl7:templateId[@root = '1.3.6.1.4.1.19376.1.9.1.3.12']])]"
         id="d41e49956-true-d3581014e0">
      <assert role="error"
              see="http://elga.art-decor.org/elgatgd-html-20240709T111220/tmp-1.2.40.0.34.6.0.11.3.72-2020-07-29T113517.html"
              test="not(.)">(atcdabbr_entry_MedikationsEinnahmeEntry)/d41e49956-true-d3581014e0: '<value-of select="name(..)"/>' ist als geschlossen definiert und dieses Element '<name/>' ist nicht erlaubt oder nicht mit diesem Inhalt erlaubt. Dies kann templateId, code oder id betreffen. Erwartet:  hl7:substanceAdministration[hl7:templateId[@root = '1.3.6.1.4.1.19376.1.9.1.3.12']] (rule-reference: d41e49956-true-d3581014e0)</assert>
   </rule>

   <!-- Checking undefined contents for template/element @isClosed="true". Match context that we did not already match -->
   <rule fpi="RUL-QQQ"
         context="*[hl7:substanceAdministration[hl7:templateId[@root = '1.2.40.0.34.6.0.11.3.72'] and hl7:templateId[@root = '2.16.840.1.113883.10.20.1.24'] and hl7:templateId[@root = '1.3.6.1.4.1.19376.1.5.3.1.4.7'] and hl7:templateId[@root = '1.3.6.1.4.1.19376.1.9.1.3.16'] and hl7:templateId[@root = '1.3.6.1.4.1.19376.1.5.3.1.4.7.1']]]/hl7:substanceAdministration[hl7:templateId[@root = '1.2.40.0.34.6.0.11.3.72'] and hl7:templateId[@root = '2.16.840.1.113883.10.20.1.24'] and hl7:templateId[@root = '1.3.6.1.4.1.19376.1.5.3.1.4.7'] and hl7:templateId[@root = '1.3.6.1.4.1.19376.1.9.1.3.16'] and hl7:templateId[@root = '1.3.6.1.4.1.19376.1.5.3.1.4.7.1']]/hl7:entryRelationship[@typeCode='REFR'][hl7:substanceAdministration/hl7:templateId[@root='1.3.6.1.4.1.19376.1.9.1.3.12']]/hl7:substanceAdministration[hl7:templateId[@root = '1.3.6.1.4.1.19376.1.9.1.3.12']]/*[not(@xsi:nil = 'true')][not(self::hl7:templateId[@root = '1.3.6.1.4.1.19376.1.9.1.3.12'] | self::hl7:id[not(@nullFlavor)] | self::hl7:code[(@code = 'DISItem' and @codeSystem = '1.3.6.1.4.1.19376.1.9.2.2')])]"
         id="d41e49965-true-d3581043e0">
      <assert role="error"
              see="http://elga.art-decor.org/elgatgd-html-20240709T111220/tmp-1.2.40.0.34.6.0.11.3.72-2020-07-29T113517.html"
              test="not(.)">(atcdabbr_entry_MedikationsEinnahmeEntry)/d41e49965-true-d3581043e0: '<value-of select="name(..)"/>' ist als geschlossen definiert und dieses Element '<name/>' ist nicht erlaubt oder nicht mit diesem Inhalt erlaubt. Dies kann templateId, code oder id betreffen. Erwartet:  hl7:templateId[@root = '1.3.6.1.4.1.19376.1.9.1.3.12'] | hl7:id[not(@nullFlavor)] | hl7:code[(@code = 'DISItem' and @codeSystem = '1.3.6.1.4.1.19376.1.9.2.2')] (rule-reference: d41e49965-true-d3581043e0)</assert>
   </rule>

   <!-- Checking undefined contents for template/element @isClosed="true". Match context that we did not already match -->
   <rule fpi="RUL-QQQ"
         context="*[hl7:substanceAdministration[hl7:templateId[@root = '1.2.40.0.34.6.0.11.3.72'] and hl7:templateId[@root = '2.16.840.1.113883.10.20.1.24'] and hl7:templateId[@root = '1.3.6.1.4.1.19376.1.5.3.1.4.7'] and hl7:templateId[@root = '1.3.6.1.4.1.19376.1.9.1.3.16'] and hl7:templateId[@root = '1.3.6.1.4.1.19376.1.5.3.1.4.7.1']]]/hl7:substanceAdministration[hl7:templateId[@root = '1.2.40.0.34.6.0.11.3.72'] and hl7:templateId[@root = '2.16.840.1.113883.10.20.1.24'] and hl7:templateId[@root = '1.3.6.1.4.1.19376.1.5.3.1.4.7'] and hl7:templateId[@root = '1.3.6.1.4.1.19376.1.9.1.3.16'] and hl7:templateId[@root = '1.3.6.1.4.1.19376.1.5.3.1.4.7.1']]/hl7:entryRelationship[@typeCode='REFR'][hl7:substanceAdministration/hl7:templateId[@root='1.3.6.1.4.1.19376.1.9.1.3.13']]/*[not(@xsi:nil = 'true')][not(self::hl7:substanceAdministration[hl7:templateId[@root = '1.3.6.1.4.1.19376.1.9.1.3.13']])]"
         id="d41e50000-true-d3581074e0">
      <assert role="error"
              see="http://elga.art-decor.org/elgatgd-html-20240709T111220/tmp-1.2.40.0.34.6.0.11.3.72-2020-07-29T113517.html"
              test="not(.)">(atcdabbr_entry_MedikationsEinnahmeEntry)/d41e50000-true-d3581074e0: '<value-of select="name(..)"/>' ist als geschlossen definiert und dieses Element '<name/>' ist nicht erlaubt oder nicht mit diesem Inhalt erlaubt. Dies kann templateId, code oder id betreffen. Erwartet:  hl7:substanceAdministration[hl7:templateId[@root = '1.3.6.1.4.1.19376.1.9.1.3.13']] (rule-reference: d41e50000-true-d3581074e0)</assert>
   </rule>

   <!-- Checking undefined contents for template/element @isClosed="true". Match context that we did not already match -->
   <rule fpi="RUL-QQQ"
         context="*[hl7:substanceAdministration[hl7:templateId[@root = '1.2.40.0.34.6.0.11.3.72'] and hl7:templateId[@root = '2.16.840.1.113883.10.20.1.24'] and hl7:templateId[@root = '1.3.6.1.4.1.19376.1.5.3.1.4.7'] and hl7:templateId[@root = '1.3.6.1.4.1.19376.1.9.1.3.16'] and hl7:templateId[@root = '1.3.6.1.4.1.19376.1.5.3.1.4.7.1']]]/hl7:substanceAdministration[hl7:templateId[@root = '1.2.40.0.34.6.0.11.3.72'] and hl7:templateId[@root = '2.16.840.1.113883.10.20.1.24'] and hl7:templateId[@root = '1.3.6.1.4.1.19376.1.5.3.1.4.7'] and hl7:templateId[@root = '1.3.6.1.4.1.19376.1.9.1.3.16'] and hl7:templateId[@root = '1.3.6.1.4.1.19376.1.5.3.1.4.7.1']]/hl7:entryRelationship[@typeCode='REFR'][hl7:substanceAdministration/hl7:templateId[@root='1.3.6.1.4.1.19376.1.9.1.3.13']]/hl7:substanceAdministration[hl7:templateId[@root = '1.3.6.1.4.1.19376.1.9.1.3.13']]/*[not(@xsi:nil = 'true')][not(self::hl7:templateId[@root = '1.3.6.1.4.1.19376.1.9.1.3.13'] | self::hl7:id[not(@nullFlavor)] | self::hl7:code[(@code = 'PADVItem' and @codeSystem = '1.3.6.1.4.1.19376.1.9.2.2')])]"
         id="d41e50009-true-d3581103e0">
      <assert role="error"
              see="http://elga.art-decor.org/elgatgd-html-20240709T111220/tmp-1.2.40.0.34.6.0.11.3.72-2020-07-29T113517.html"
              test="not(.)">(atcdabbr_entry_MedikationsEinnahmeEntry)/d41e50009-true-d3581103e0: '<value-of select="name(..)"/>' ist als geschlossen definiert und dieses Element '<name/>' ist nicht erlaubt oder nicht mit diesem Inhalt erlaubt. Dies kann templateId, code oder id betreffen. Erwartet:  hl7:templateId[@root = '1.3.6.1.4.1.19376.1.9.1.3.13'] | hl7:id[not(@nullFlavor)] | hl7:code[(@code = 'PADVItem' and @codeSystem = '1.3.6.1.4.1.19376.1.9.2.2')] (rule-reference: d41e50009-true-d3581103e0)</assert>
   </rule>

   <!-- Checking undefined contents for template/element @isClosed="true". Match context that we did not already match -->
   <rule fpi="RUL-QQQ"
         context="*[hl7:substanceAdministration[hl7:templateId[@root = '1.2.40.0.34.6.0.11.3.72'] and hl7:templateId[@root = '2.16.840.1.113883.10.20.1.24'] and hl7:templateId[@root = '1.3.6.1.4.1.19376.1.5.3.1.4.7'] and hl7:templateId[@root = '1.3.6.1.4.1.19376.1.9.1.3.16'] and hl7:templateId[@root = '1.3.6.1.4.1.19376.1.5.3.1.4.7.1']]]/hl7:substanceAdministration[hl7:templateId[@root = '1.2.40.0.34.6.0.11.3.72'] and hl7:templateId[@root = '2.16.840.1.113883.10.20.1.24'] and hl7:templateId[@root = '1.3.6.1.4.1.19376.1.5.3.1.4.7'] and hl7:templateId[@root = '1.3.6.1.4.1.19376.1.9.1.3.16'] and hl7:templateId[@root = '1.3.6.1.4.1.19376.1.5.3.1.4.7.1']]/hl7:entryRelationship[@typeCode='REFR'][hl7:substanceAdministration/hl7:templateId[@root='1.3.6.1.4.1.19376.1.9.1.3.14']]/*[not(@xsi:nil = 'true')][not(self::hl7:substanceAdministration[hl7:templateId[@root = '1.3.6.1.4.1.19376.1.9.1.3.14']])]"
         id="d41e50044-true-d3581134e0">
      <assert role="error"
              see="http://elga.art-decor.org/elgatgd-html-20240709T111220/tmp-1.2.40.0.34.6.0.11.3.72-2020-07-29T113517.html"
              test="not(.)">(atcdabbr_entry_MedikationsEinnahmeEntry)/d41e50044-true-d3581134e0: '<value-of select="name(..)"/>' ist als geschlossen definiert und dieses Element '<name/>' ist nicht erlaubt oder nicht mit diesem Inhalt erlaubt. Dies kann templateId, code oder id betreffen. Erwartet:  hl7:substanceAdministration[hl7:templateId[@root = '1.3.6.1.4.1.19376.1.9.1.3.14']] (rule-reference: d41e50044-true-d3581134e0)</assert>
   </rule>

   <!-- Checking undefined contents for template/element @isClosed="true". Match context that we did not already match -->
   <rule fpi="RUL-QQQ"
         context="*[hl7:substanceAdministration[hl7:templateId[@root = '1.2.40.0.34.6.0.11.3.72'] and hl7:templateId[@root = '2.16.840.1.113883.10.20.1.24'] and hl7:templateId[@root = '1.3.6.1.4.1.19376.1.5.3.1.4.7'] and hl7:templateId[@root = '1.3.6.1.4.1.19376.1.9.1.3.16'] and hl7:templateId[@root = '1.3.6.1.4.1.19376.1.5.3.1.4.7.1']]]/hl7:substanceAdministration[hl7:templateId[@root = '1.2.40.0.34.6.0.11.3.72'] and hl7:templateId[@root = '2.16.840.1.113883.10.20.1.24'] and hl7:templateId[@root = '1.3.6.1.4.1.19376.1.5.3.1.4.7'] and hl7:templateId[@root = '1.3.6.1.4.1.19376.1.9.1.3.16'] and hl7:templateId[@root = '1.3.6.1.4.1.19376.1.5.3.1.4.7.1']]/hl7:entryRelationship[@typeCode='REFR'][hl7:substanceAdministration/hl7:templateId[@root='1.3.6.1.4.1.19376.1.9.1.3.14']]/hl7:substanceAdministration[hl7:templateId[@root = '1.3.6.1.4.1.19376.1.9.1.3.14']]/*[not(@xsi:nil = 'true')][not(self::hl7:templateId[@root = '1.3.6.1.4.1.19376.1.9.1.3.14'] | self::hl7:id[not(@nullFlavor)] | self::hl7:code[(@code = 'CMAItem' and @codeSystem = '1.3.6.1.4.1.19376.1.9.2.2')] | self::hl7:consumable[not(@nullFlavor)][hl7:manufacturedProduct])]"
         id="d41e50053-true-d3581168e0">
      <assert role="error"
              see="http://elga.art-decor.org/elgatgd-html-20240709T111220/tmp-1.2.40.0.34.6.0.11.3.72-2020-07-29T113517.html"
              test="not(.)">(atcdabbr_entry_MedikationsEinnahmeEntry)/d41e50053-true-d3581168e0: '<value-of select="name(..)"/>' ist als geschlossen definiert und dieses Element '<name/>' ist nicht erlaubt oder nicht mit diesem Inhalt erlaubt. Dies kann templateId, code oder id betreffen. Erwartet:  hl7:templateId[@root = '1.3.6.1.4.1.19376.1.9.1.3.14'] | hl7:id[not(@nullFlavor)] | hl7:code[(@code = 'CMAItem' and @codeSystem = '1.3.6.1.4.1.19376.1.9.2.2')] | hl7:consumable[not(@nullFlavor)][hl7:manufacturedProduct] (rule-reference: d41e50053-true-d3581168e0)</assert>
   </rule>

   <!-- Checking undefined contents for template/element @isClosed="true". Match context that we did not already match -->
   <rule fpi="RUL-QQQ"
         context="*[hl7:substanceAdministration[hl7:templateId[@root = '1.2.40.0.34.6.0.11.3.72'] and hl7:templateId[@root = '2.16.840.1.113883.10.20.1.24'] and hl7:templateId[@root = '1.3.6.1.4.1.19376.1.5.3.1.4.7'] and hl7:templateId[@root = '1.3.6.1.4.1.19376.1.9.1.3.16'] and hl7:templateId[@root = '1.3.6.1.4.1.19376.1.5.3.1.4.7.1']]]/hl7:substanceAdministration[hl7:templateId[@root = '1.2.40.0.34.6.0.11.3.72'] and hl7:templateId[@root = '2.16.840.1.113883.10.20.1.24'] and hl7:templateId[@root = '1.3.6.1.4.1.19376.1.5.3.1.4.7'] and hl7:templateId[@root = '1.3.6.1.4.1.19376.1.9.1.3.16'] and hl7:templateId[@root = '1.3.6.1.4.1.19376.1.5.3.1.4.7.1']]/hl7:entryRelationship[@typeCode='REFR'][hl7:substanceAdministration/hl7:templateId[@root='1.3.6.1.4.1.19376.1.9.1.3.14']]/hl7:substanceAdministration[hl7:templateId[@root = '1.3.6.1.4.1.19376.1.9.1.3.14']]/hl7:consumable[not(@nullFlavor)][hl7:manufacturedProduct]/*[not(@xsi:nil = 'true')][not(self::hl7:manufacturedProduct[not(@nullFlavor)][hl7:manufacturedMaterial[@nullFlavor = 'NA']])]"
         id="d41e50090-true-d3581199e0">
      <assert role="error"
              see="http://elga.art-decor.org/elgatgd-html-20240709T111220/tmp-1.2.40.0.34.6.0.11.3.72-2020-07-29T113517.html"
              test="not(.)">(atcdabbr_entry_MedikationsEinnahmeEntry)/d41e50090-true-d3581199e0: '<value-of select="name(..)"/>' ist als geschlossen definiert und dieses Element '<name/>' ist nicht erlaubt oder nicht mit diesem Inhalt erlaubt. Dies kann templateId, code oder id betreffen. Erwartet:  hl7:manufacturedProduct[not(@nullFlavor)][hl7:manufacturedMaterial[@nullFlavor = 'NA']] (rule-reference: d41e50090-true-d3581199e0)</assert>
   </rule>

   <!-- Checking undefined contents for template/element @isClosed="true". Match context that we did not already match -->
   <rule fpi="RUL-QQQ"
         context="*[hl7:substanceAdministration[hl7:templateId[@root = '1.2.40.0.34.6.0.11.3.72'] and hl7:templateId[@root = '2.16.840.1.113883.10.20.1.24'] and hl7:templateId[@root = '1.3.6.1.4.1.19376.1.5.3.1.4.7'] and hl7:templateId[@root = '1.3.6.1.4.1.19376.1.9.1.3.16'] and hl7:templateId[@root = '1.3.6.1.4.1.19376.1.5.3.1.4.7.1']]]/hl7:substanceAdministration[hl7:templateId[@root = '1.2.40.0.34.6.0.11.3.72'] and hl7:templateId[@root = '2.16.840.1.113883.10.20.1.24'] and hl7:templateId[@root = '1.3.6.1.4.1.19376.1.5.3.1.4.7'] and hl7:templateId[@root = '1.3.6.1.4.1.19376.1.9.1.3.16'] and hl7:templateId[@root = '1.3.6.1.4.1.19376.1.5.3.1.4.7.1']]/hl7:entryRelationship[@typeCode='REFR'][hl7:substanceAdministration/hl7:templateId[@root='1.3.6.1.4.1.19376.1.9.1.3.14']]/hl7:substanceAdministration[hl7:templateId[@root = '1.3.6.1.4.1.19376.1.9.1.3.14']]/hl7:consumable[not(@nullFlavor)][hl7:manufacturedProduct]/hl7:manufacturedProduct[not(@nullFlavor)][hl7:manufacturedMaterial[@nullFlavor = 'NA']]/*[not(@xsi:nil = 'true')][not(self::hl7:manufacturedMaterial[@nullFlavor = 'NA'])]"
         id="d41e50092-true-d3581213e0">
      <assert role="error"
              see="http://elga.art-decor.org/elgatgd-html-20240709T111220/tmp-1.2.40.0.34.6.0.11.3.72-2020-07-29T113517.html"
              test="not(.)">(atcdabbr_entry_MedikationsEinnahmeEntry)/d41e50092-true-d3581213e0: '<value-of select="name(..)"/>' ist als geschlossen definiert und dieses Element '<name/>' ist nicht erlaubt oder nicht mit diesem Inhalt erlaubt. Dies kann templateId, code oder id betreffen. Erwartet:  hl7:manufacturedMaterial[@nullFlavor = 'NA'] (rule-reference: d41e50092-true-d3581213e0)</assert>
   </rule>

   <!-- Checking undefined contents for template/element @isClosed="true". Match context that we did not already match -->
   <rule fpi="RUL-QQQ"
         context="*[hl7:substanceAdministration[hl7:templateId[@root = '1.2.40.0.34.6.0.11.3.72'] and hl7:templateId[@root = '2.16.840.1.113883.10.20.1.24'] and hl7:templateId[@root = '1.3.6.1.4.1.19376.1.5.3.1.4.7'] and hl7:templateId[@root = '1.3.6.1.4.1.19376.1.9.1.3.16'] and hl7:templateId[@root = '1.3.6.1.4.1.19376.1.5.3.1.4.7.1']]]/hl7:substanceAdministration[hl7:templateId[@root = '1.2.40.0.34.6.0.11.3.72'] and hl7:templateId[@root = '2.16.840.1.113883.10.20.1.24'] and hl7:templateId[@root = '1.3.6.1.4.1.19376.1.5.3.1.4.7'] and hl7:templateId[@root = '1.3.6.1.4.1.19376.1.9.1.3.16'] and hl7:templateId[@root = '1.3.6.1.4.1.19376.1.5.3.1.4.7.1']]/hl7:reference[@typeCode = 'XCRPT'][hl7:externalDocument]/*[not(@xsi:nil = 'true')][not(self::hl7:externalDocument[not(@nullFlavor)])]"
         id="d41e50104-true-d3581232e0">
      <assert role="error"
              see="http://elga.art-decor.org/elgatgd-html-20240709T111220/tmp-1.2.40.0.34.6.0.11.3.72-2020-07-29T113517.html"
              test="not(.)">(atcdabbr_entry_MedikationsEinnahmeEntry)/d41e50104-true-d3581232e0: '<value-of select="name(..)"/>' ist als geschlossen definiert und dieses Element '<name/>' ist nicht erlaubt oder nicht mit diesem Inhalt erlaubt. Dies kann templateId, code oder id betreffen. Erwartet:  hl7:externalDocument[not(@nullFlavor)] (rule-reference: d41e50104-true-d3581232e0)</assert>
   </rule>

   <!-- Checking undefined contents for template/element @isClosed="true". Match context that we did not already match -->
   <rule fpi="RUL-QQQ"
         context="*[hl7:substanceAdministration[hl7:templateId[@root = '1.2.40.0.34.6.0.11.3.72'] and hl7:templateId[@root = '2.16.840.1.113883.10.20.1.24'] and hl7:templateId[@root = '1.3.6.1.4.1.19376.1.5.3.1.4.7'] and hl7:templateId[@root = '1.3.6.1.4.1.19376.1.9.1.3.16'] and hl7:templateId[@root = '1.3.6.1.4.1.19376.1.5.3.1.4.7.1']]]/hl7:substanceAdministration[hl7:templateId[@root = '1.2.40.0.34.6.0.11.3.72'] and hl7:templateId[@root = '2.16.840.1.113883.10.20.1.24'] and hl7:templateId[@root = '1.3.6.1.4.1.19376.1.5.3.1.4.7'] and hl7:templateId[@root = '1.3.6.1.4.1.19376.1.9.1.3.16'] and hl7:templateId[@root = '1.3.6.1.4.1.19376.1.5.3.1.4.7.1']]/hl7:reference[@typeCode = 'XCRPT'][hl7:externalDocument]/hl7:externalDocument[not(@nullFlavor)]/*[not(@xsi:nil = 'true')][not(self::hl7:id[not(@nullFlavor)])]"
         id="d41e50116-true-d3581246e0">
      <assert role="error"
              see="http://elga.art-decor.org/elgatgd-html-20240709T111220/tmp-1.2.40.0.34.6.0.11.3.72-2020-07-29T113517.html"
              test="not(.)">(atcdabbr_entry_MedikationsEinnahmeEntry)/d41e50116-true-d3581246e0: '<value-of select="name(..)"/>' ist als geschlossen definiert und dieses Element '<name/>' ist nicht erlaubt oder nicht mit diesem Inhalt erlaubt. Dies kann templateId, code oder id betreffen. Erwartet:  hl7:id[not(@nullFlavor)] (rule-reference: d41e50116-true-d3581246e0)</assert>
   </rule>

   <!-- Checking undefined contents for template/element @isClosed="true". Match context that we did not already match -->
   <rule fpi="RUL-QQQ"
         context="*[hl7:substanceAdministration[hl7:templateId[@root = '1.2.40.0.34.6.0.11.3.72'] and hl7:templateId[@root = '2.16.840.1.113883.10.20.1.24'] and hl7:templateId[@root = '1.3.6.1.4.1.19376.1.5.3.1.4.7'] and hl7:templateId[@root = '1.3.6.1.4.1.19376.1.9.1.3.16'] and hl7:templateId[@root = '1.3.6.1.4.1.19376.1.5.3.1.4.7.1']]]/hl7:substanceAdministration[hl7:templateId[@root = '1.2.40.0.34.6.0.11.3.72'] and hl7:templateId[@root = '2.16.840.1.113883.10.20.1.24'] and hl7:templateId[@root = '1.3.6.1.4.1.19376.1.5.3.1.4.7'] and hl7:templateId[@root = '1.3.6.1.4.1.19376.1.9.1.3.16'] and hl7:templateId[@root = '1.3.6.1.4.1.19376.1.5.3.1.4.7.1']]/hl7:precondition[hl7:criterion]/*[not(@xsi:nil = 'true')][not(self::hl7:criterion[not(@nullFlavor)])]"
         id="d41e50127-true-d3581265e0">
      <assert role="error"
              see="http://elga.art-decor.org/elgatgd-html-20240709T111220/tmp-1.2.40.0.34.6.0.11.3.72-2020-07-29T113517.html"
              test="not(.)">(atcdabbr_entry_MedikationsEinnahmeEntry)/d41e50127-true-d3581265e0: '<value-of select="name(..)"/>' ist als geschlossen definiert und dieses Element '<name/>' ist nicht erlaubt oder nicht mit diesem Inhalt erlaubt. Dies kann templateId, code oder id betreffen. Erwartet:  hl7:criterion[not(@nullFlavor)] (rule-reference: d41e50127-true-d3581265e0)</assert>
   </rule>

   <!-- Checking undefined contents for template/element @isClosed="true". Match context that we did not already match -->
   <rule fpi="RUL-QQQ"
         context="*[hl7:substanceAdministration[hl7:templateId[@root = '1.2.40.0.34.6.0.11.3.72'] and hl7:templateId[@root = '2.16.840.1.113883.10.20.1.24'] and hl7:templateId[@root = '1.3.6.1.4.1.19376.1.5.3.1.4.7'] and hl7:templateId[@root = '1.3.6.1.4.1.19376.1.9.1.3.16'] and hl7:templateId[@root = '1.3.6.1.4.1.19376.1.5.3.1.4.7.1']]]/hl7:substanceAdministration[hl7:templateId[@root = '1.2.40.0.34.6.0.11.3.72'] and hl7:templateId[@root = '2.16.840.1.113883.10.20.1.24'] and hl7:templateId[@root = '1.3.6.1.4.1.19376.1.5.3.1.4.7'] and hl7:templateId[@root = '1.3.6.1.4.1.19376.1.9.1.3.16'] and hl7:templateId[@root = '1.3.6.1.4.1.19376.1.5.3.1.4.7.1']]/hl7:precondition[hl7:criterion]/hl7:criterion[not(@nullFlavor)]/*[not(@xsi:nil = 'true')][not(self::hl7:text[not(@nullFlavor)])]"
         id="d41e50132-true-d3581279e0">
      <assert role="error"
              see="http://elga.art-decor.org/elgatgd-html-20240709T111220/tmp-1.2.40.0.34.6.0.11.3.72-2020-07-29T113517.html"
              test="not(.)">(atcdabbr_entry_MedikationsEinnahmeEntry)/d41e50132-true-d3581279e0: '<value-of select="name(..)"/>' ist als geschlossen definiert und dieses Element '<name/>' ist nicht erlaubt oder nicht mit diesem Inhalt erlaubt. Dies kann templateId, code oder id betreffen. Erwartet:  hl7:text[not(@nullFlavor)] (rule-reference: d41e50132-true-d3581279e0)</assert>
   </rule>

   <!-- Checking undefined contents for template/element @isClosed="true". Match context that we did not already match -->
   <rule fpi="RUL-QQQ"
         context="*[hl7:substanceAdministration[hl7:templateId[@root = '1.2.40.0.34.6.0.11.3.72'] and hl7:templateId[@root = '2.16.840.1.113883.10.20.1.24'] and hl7:templateId[@root = '1.3.6.1.4.1.19376.1.5.3.1.4.7'] and hl7:templateId[@root = '1.3.6.1.4.1.19376.1.9.1.3.16'] and hl7:templateId[@root = '1.3.6.1.4.1.19376.1.5.3.1.4.7.1']]]/hl7:substanceAdministration[hl7:templateId[@root = '1.2.40.0.34.6.0.11.3.72'] and hl7:templateId[@root = '2.16.840.1.113883.10.20.1.24'] and hl7:templateId[@root = '1.3.6.1.4.1.19376.1.5.3.1.4.7'] and hl7:templateId[@root = '1.3.6.1.4.1.19376.1.9.1.3.16'] and hl7:templateId[@root = '1.3.6.1.4.1.19376.1.5.3.1.4.7.1']]/hl7:precondition[hl7:criterion]/hl7:criterion[not(@nullFlavor)]/hl7:text[not(@nullFlavor)]/*[not(@xsi:nil = 'true')][not(self::hl7:reference[not(@nullFlavor)])]"
         id="d41e50134-true-d3581293e0">
      <assert role="error"
              see="http://elga.art-decor.org/elgatgd-html-20240709T111220/tmp-1.2.40.0.34.6.0.11.3.72-2020-07-29T113517.html"
              test="not(.)">(atcdabbr_entry_MedikationsEinnahmeEntry)/d41e50134-true-d3581293e0: '<value-of select="name(..)"/>' ist als geschlossen definiert und dieses Element '<name/>' ist nicht erlaubt oder nicht mit diesem Inhalt erlaubt. Dies kann templateId, code oder id betreffen. Erwartet:  hl7:reference[not(@nullFlavor)] (rule-reference: d41e50134-true-d3581293e0)</assert>
   </rule>
</pattern>
