<?xml version="1.0" encoding="UTF-8"?>
<!--
Template derived pattern
===========================================
ID: 1.2.40.0.34.6.0.11.3.80
Name: Device Software Revison Information Observation
Description: Die Device Software Revision Information Observation dokumentiert die Software-Version des verwendeten Gerätes. In PCHA konformen Geräten, kommen die Informationen aus dem Production Specification Attribut und aus dem Device Information Service bei Bluetooth Low Energy health devices.
-->
<pattern xmlns="http://purl.oclc.org/dsdl/schematron"
         id="template-1.2.40.0.34.6.0.11.3.80-2021-02-18T133255-closed">
   <title>Device Software Revison Information Observation</title>

   <!-- Checking undefined contents for template/element @isClosed="true". Match context that we did not already match -->
   <rule fpi="RUL-QQQ"
         context="*[hl7:observation[hl7:templateId[@root = '1.2.40.0.34.6.0.11.3.80'] and hl7:templateId[@root = '2.16.840.1.113883.10.20.36.17'][@extension = '2015-08-17'] and hl7:templateId[@root = '2.16.840.1.113883.10.20.36.24'][@extension = '2015-08-17']]]/*[not(@xsi:nil = 'true')][not(self::hl7:observation[hl7:templateId[@root = '1.2.40.0.34.6.0.11.3.80'] and hl7:templateId[@root = '2.16.840.1.113883.10.20.36.17'][@extension = '2015-08-17'] and hl7:templateId[@root = '2.16.840.1.113883.10.20.36.24'][@extension = '2015-08-17']])]"
         id="d41e53489-true-d3604986e0">
      <assert role="error"
              see="http://elga.art-decor.org/elgatgd-html-20240709T111220/tmp-1.2.40.0.34.6.0.11.3.80-2021-02-18T133255.html"
              test="not(.)">(atcdabbr_entry_DeviceSoftwareRevisonInformationObservation)/d41e53489-true-d3604986e0: '<value-of select="name(..)"/>' ist als geschlossen definiert und dieses Element '<name/>' ist nicht erlaubt oder nicht mit diesem Inhalt erlaubt. Dies kann templateId, code oder id betreffen. Erwartet:  hl7:observation[hl7:templateId[@root = '1.2.40.0.34.6.0.11.3.80'] and hl7:templateId[@root = '2.16.840.1.113883.10.20.36.17'][@extension = '2015-08-17'] and hl7:templateId[@root = '2.16.840.1.113883.10.20.36.24'][@extension = '2015-08-17']] (rule-reference: d41e53489-true-d3604986e0)</assert>
   </rule>

   <!-- Checking undefined contents for template/element @isClosed="true". Match context that we did not already match -->
   <rule fpi="RUL-QQQ"
         context="*[hl7:observation[hl7:templateId[@root = '1.2.40.0.34.6.0.11.3.80'] and hl7:templateId[@root = '2.16.840.1.113883.10.20.36.17'][@extension = '2015-08-17'] and hl7:templateId[@root = '2.16.840.1.113883.10.20.36.24'][@extension = '2015-08-17']]]/hl7:observation[hl7:templateId[@root = '1.2.40.0.34.6.0.11.3.80'] and hl7:templateId[@root = '2.16.840.1.113883.10.20.36.17'][@extension = '2015-08-17'] and hl7:templateId[@root = '2.16.840.1.113883.10.20.36.24'][@extension = '2015-08-17']]/*[not(@xsi:nil = 'true')][not(self::hl7:templateId[@root = '1.2.40.0.34.6.0.11.3.80'] | self::hl7:templateId[@root = '2.16.840.1.113883.10.20.36.17'][@extension = '2015-08-17'] | self::hl7:templateId[@root = '2.16.840.1.113883.10.20.36.24'][@extension = '2015-08-17'] | self::hl7:code[(@code = '531975' and @codeSystem = '2.16.840.1.113883.6.24')] | self::hl7:text[not(@nullFlavor)] | self::hl7:value[not(@nullFlavor)][resolve-QName(@xsi:type, .) = QName('urn:hl7-org:v3', 'ST')])]"
         id="d41e53555-true-d3605036e0">
      <assert role="error"
              see="http://elga.art-decor.org/elgatgd-html-20240709T111220/tmp-1.2.40.0.34.6.0.11.3.80-2021-02-18T133255.html"
              test="not(.)">(atcdabbr_entry_DeviceSoftwareRevisonInformationObservation)/d41e53555-true-d3605036e0: '<value-of select="name(..)"/>' ist als geschlossen definiert und dieses Element '<name/>' ist nicht erlaubt oder nicht mit diesem Inhalt erlaubt. Dies kann templateId, code oder id betreffen. Erwartet:  hl7:templateId[@root = '1.2.40.0.34.6.0.11.3.80'] | hl7:templateId[@root = '2.16.840.1.113883.10.20.36.17'][@extension = '2015-08-17'] | hl7:templateId[@root = '2.16.840.1.113883.10.20.36.24'][@extension = '2015-08-17'] | hl7:code[(@code = '531975' and @codeSystem = '2.16.840.1.113883.6.24')] | hl7:text[not(@nullFlavor)] | hl7:value[not(@nullFlavor)][resolve-QName(@xsi:type, .) = QName('urn:hl7-org:v3', 'ST')] (rule-reference: d41e53555-true-d3605036e0)</assert>
   </rule>

   <!-- Checking undefined contents for template/element @isClosed="true". Match context that we did not already match -->
   <rule fpi="RUL-QQQ"
         context="*[hl7:observation[hl7:templateId[@root = '1.2.40.0.34.6.0.11.3.80'] and hl7:templateId[@root = '2.16.840.1.113883.10.20.36.17'][@extension = '2015-08-17'] and hl7:templateId[@root = '2.16.840.1.113883.10.20.36.24'][@extension = '2015-08-17']]]/hl7:observation[hl7:templateId[@root = '1.2.40.0.34.6.0.11.3.80'] and hl7:templateId[@root = '2.16.840.1.113883.10.20.36.17'][@extension = '2015-08-17'] and hl7:templateId[@root = '2.16.840.1.113883.10.20.36.24'][@extension = '2015-08-17']]/hl7:code[(@code = '531975' and @codeSystem = '2.16.840.1.113883.6.24')]/*[not(@xsi:nil = 'true')][not(self::hl7:translation | self::ips:designation)]"
         id="d41e53593-true-d3605074e0">
      <assert role="error"
              see="http://elga.art-decor.org/elgatgd-html-20240709T111220/tmp-1.2.40.0.34.6.0.11.3.80-2021-02-18T133255.html"
              test="not(.)">(atcdabbr_entry_DeviceSoftwareRevisonInformationObservation)/d41e53593-true-d3605074e0: '<value-of select="name(..)"/>' ist als geschlossen definiert und dieses Element '<name/>' ist nicht erlaubt oder nicht mit diesem Inhalt erlaubt. Dies kann templateId, code oder id betreffen. Erwartet:  hl7:translation | ips:designation (rule-reference: d41e53593-true-d3605074e0)</assert>
   </rule>

   <!-- Checking undefined contents for template/element @isClosed="true". Match context that we did not already match -->
   <rule fpi="RUL-QQQ"
         context="*[hl7:observation[hl7:templateId[@root = '1.2.40.0.34.6.0.11.3.80'] and hl7:templateId[@root = '2.16.840.1.113883.10.20.36.17'][@extension = '2015-08-17'] and hl7:templateId[@root = '2.16.840.1.113883.10.20.36.24'][@extension = '2015-08-17']]]/hl7:observation[hl7:templateId[@root = '1.2.40.0.34.6.0.11.3.80'] and hl7:templateId[@root = '2.16.840.1.113883.10.20.36.17'][@extension = '2015-08-17'] and hl7:templateId[@root = '2.16.840.1.113883.10.20.36.24'][@extension = '2015-08-17']]/hl7:text[not(@nullFlavor)]/*[not(@xsi:nil = 'true')][not(self::hl7:reference[not(@nullFlavor)])]"
         id="d41e53627-true-d3605098e0">
      <assert role="error"
              see="http://elga.art-decor.org/elgatgd-html-20240709T111220/tmp-1.2.40.0.34.6.0.11.3.80-2021-02-18T133255.html"
              test="not(.)">(atcdabbr_entry_DeviceSoftwareRevisonInformationObservation)/d41e53627-true-d3605098e0: '<value-of select="name(..)"/>' ist als geschlossen definiert und dieses Element '<name/>' ist nicht erlaubt oder nicht mit diesem Inhalt erlaubt. Dies kann templateId, code oder id betreffen. Erwartet:  hl7:reference[not(@nullFlavor)] (rule-reference: d41e53627-true-d3605098e0)</assert>
   </rule>
</pattern>
