<?xml version="1.0" encoding="UTF-8"?>
<!--
Template derived pattern
===========================================
ID: 1.2.40.0.34.6.0.11.3.60
Name: EMS Hospitalisierung
Description: Im Zuge der Arztmeldung ist es möglich festzuhalten ob ein Patient/eine Patientin in ein Kran-kenhaus eingewiesen wurde. Diese Information wird in einem act Element codiert. Ist die Ad-resse der Krankenanstalt bekannt, kann diese noch beim patientRole-Element im CDA-Header als temporäre
                        Aufenthaltsadresse geführt werden. Hierbei ist beim addr-Element das @use Attribute mit dem Wert „TMP“ zu verwenden
-->
<pattern xmlns="http://purl.oclc.org/dsdl/schematron"
         id="template-1.2.40.0.34.6.0.11.3.60-2020-02-20T160212">
   <title>EMS Hospitalisierung</title>
   <!--
Template derived rules for ID: 1.2.40.0.34.6.0.11.3.60
Context: *[hl7:act[hl7:templateId[@root = '1.2.40.0.34.6.0.11.3.60'] and hl7:templateId[@root = '1.2.40.0.34.11.6.3.6']]]
Item: (epims_entry_hospitalization)
-->

   <!--
Template derived rules for ID: 1.2.40.0.34.6.0.11.3.60
Context: *[hl7:act[hl7:templateId[@root = '1.2.40.0.34.6.0.11.3.60'] and hl7:templateId[@root = '1.2.40.0.34.11.6.3.6']]]/hl7:act[hl7:templateId[@root = '1.2.40.0.34.6.0.11.3.60'] and hl7:templateId[@root = '1.2.40.0.34.11.6.3.6']]
Item: (epims_entry_hospitalization)
-->

   <rule fpi="RULC-1"
         context="*[hl7:act[hl7:templateId[@root = '1.2.40.0.34.6.0.11.3.60'] and hl7:templateId[@root = '1.2.40.0.34.11.6.3.6']]]/hl7:act[hl7:templateId[@root = '1.2.40.0.34.6.0.11.3.60'] and hl7:templateId[@root = '1.2.40.0.34.11.6.3.6']]"
         id="d42e21713-false-d235539e0">
      <assert role="error"
              see="https://elga.art-decor.org/epims-html-20250116T123132/tmp-1.2.40.0.34.6.0.11.3.60-2020-02-20T160212.html"
              test="string(@classCode) = ('ACT')">(epims_entry_hospitalization): Der Wert von classCode MUSS 'ACT' sein. Gefunden: "<value-of select="@classCode"/>"</assert>
      <assert role="error"
              see="https://elga.art-decor.org/epims-html-20250116T123132/tmp-1.2.40.0.34.6.0.11.3.60-2020-02-20T160212.html"
              test="string(@moodCode) = ('EVN')">(epims_entry_hospitalization): Der Wert von moodCode MUSS 'EVN' sein. Gefunden: "<value-of select="@moodCode"/>"</assert>
      <assert role="error"
              see="https://elga.art-decor.org/epims-html-20250116T123132/tmp-1.2.40.0.34.6.0.11.3.60-2020-02-20T160212.html"
              test="count(hl7:templateId[@root = '1.2.40.0.34.6.0.11.3.60']) &gt;= 1">(epims_entry_hospitalization): Element hl7:templateId[@root = '1.2.40.0.34.6.0.11.3.60'] ist mandatory [min 1x].</assert>
      <assert role="error"
              see="https://elga.art-decor.org/epims-html-20250116T123132/tmp-1.2.40.0.34.6.0.11.3.60-2020-02-20T160212.html"
              test="count(hl7:templateId[@root = '1.2.40.0.34.6.0.11.3.60']) &lt;= 1">(epims_entry_hospitalization): Element hl7:templateId[@root = '1.2.40.0.34.6.0.11.3.60'] kommt zu häufig vor [max 1x].</assert>
      <assert role="error"
              see="https://elga.art-decor.org/epims-html-20250116T123132/tmp-1.2.40.0.34.6.0.11.3.60-2020-02-20T160212.html"
              test="count(hl7:templateId[@root = '1.2.40.0.34.11.6.3.6']) &gt;= 1">(epims_entry_hospitalization): Element hl7:templateId[@root = '1.2.40.0.34.11.6.3.6'] ist mandatory [min 1x].</assert>
      <assert role="error"
              see="https://elga.art-decor.org/epims-html-20250116T123132/tmp-1.2.40.0.34.6.0.11.3.60-2020-02-20T160212.html"
              test="count(hl7:templateId[@root = '1.2.40.0.34.11.6.3.6']) &lt;= 1">(epims_entry_hospitalization): Element hl7:templateId[@root = '1.2.40.0.34.11.6.3.6'] kommt zu häufig vor [max 1x].</assert>
      <assert role="error"
              see="https://elga.art-decor.org/epims-html-20250116T123132/tmp-1.2.40.0.34.6.0.11.3.60-2020-02-20T160212.html"
              test="count(hl7:code[(@code = '32485007' and @codeSystem = '2.16.840.1.113883.6.96')]) &gt;= 1">(epims_entry_hospitalization): Element hl7:code[(@code = '32485007' and @codeSystem = '2.16.840.1.113883.6.96')] ist mandatory [min 1x].</assert>
      <assert role="error"
              see="https://elga.art-decor.org/epims-html-20250116T123132/tmp-1.2.40.0.34.6.0.11.3.60-2020-02-20T160212.html"
              test="count(hl7:code[(@code = '32485007' and @codeSystem = '2.16.840.1.113883.6.96')]) &lt;= 1">(epims_entry_hospitalization): Element hl7:code[(@code = '32485007' and @codeSystem = '2.16.840.1.113883.6.96')] kommt zu häufig vor [max 1x].</assert>
      <assert role="error"
              see="https://elga.art-decor.org/epims-html-20250116T123132/tmp-1.2.40.0.34.6.0.11.3.60-2020-02-20T160212.html"
              test="count(hl7:effectiveTime) &lt;= 1">(epims_entry_hospitalization): Element hl7:effectiveTime kommt zu häufig vor [max 1x].</assert>
   </rule>
   <!--
Template derived rules for ID: 1.2.40.0.34.6.0.11.3.60
Context: *[hl7:act[hl7:templateId[@root = '1.2.40.0.34.6.0.11.3.60'] and hl7:templateId[@root = '1.2.40.0.34.11.6.3.6']]]/hl7:act[hl7:templateId[@root = '1.2.40.0.34.6.0.11.3.60'] and hl7:templateId[@root = '1.2.40.0.34.11.6.3.6']]/hl7:templateId[@root = '1.2.40.0.34.6.0.11.3.60']
Item: (epims_entry_hospitalization)
-->

   <rule fpi="RULC-1"
         context="*[hl7:act[hl7:templateId[@root = '1.2.40.0.34.6.0.11.3.60'] and hl7:templateId[@root = '1.2.40.0.34.11.6.3.6']]]/hl7:act[hl7:templateId[@root = '1.2.40.0.34.6.0.11.3.60'] and hl7:templateId[@root = '1.2.40.0.34.11.6.3.6']]/hl7:templateId[@root = '1.2.40.0.34.6.0.11.3.60']"
         id="d42e21719-false-d235589e0">
      <extends rule="II"/>
      <assert role="error"
              see="https://elga.art-decor.org/epims-html-20250116T123132/tmp-1.2.40.0.34.6.0.11.3.60-2020-02-20T160212.html"
              test="empty(@xsi:type) or resolve-QName(@xsi:type, .) = QName('urn:hl7-org:v3', 'II')">(epims_entry_hospitalization): Wenn eine @xsi:type Instruktion anwesend ist MUSS diese den Wert "{urn:hl7-org:v3}:II" haben. Gefunden "{<value-of select="namespace-uri-from-QName(resolve-QName(@xsi:type,.))"/>}:<value-of select="local-name-from-QName(resolve-QName(@xsi:type,.))"/>"</assert>
      <assert role="error"
              see="https://elga.art-decor.org/epims-html-20250116T123132/tmp-1.2.40.0.34.6.0.11.3.60-2020-02-20T160212.html"
              test="string(@root) = ('1.2.40.0.34.6.0.11.3.60')">(epims_entry_hospitalization): Der Wert von root MUSS '1.2.40.0.34.6.0.11.3.60' sein. Gefunden: "<value-of select="@root"/>"</assert>
   </rule>
   <!--
Template derived rules for ID: 1.2.40.0.34.6.0.11.3.60
Context: *[hl7:act[hl7:templateId[@root = '1.2.40.0.34.6.0.11.3.60'] and hl7:templateId[@root = '1.2.40.0.34.11.6.3.6']]]/hl7:act[hl7:templateId[@root = '1.2.40.0.34.6.0.11.3.60'] and hl7:templateId[@root = '1.2.40.0.34.11.6.3.6']]/hl7:templateId[@root = '1.2.40.0.34.11.6.3.6']
Item: (epims_entry_hospitalization)
-->

   <rule fpi="RULC-1"
         context="*[hl7:act[hl7:templateId[@root = '1.2.40.0.34.6.0.11.3.60'] and hl7:templateId[@root = '1.2.40.0.34.11.6.3.6']]]/hl7:act[hl7:templateId[@root = '1.2.40.0.34.6.0.11.3.60'] and hl7:templateId[@root = '1.2.40.0.34.11.6.3.6']]/hl7:templateId[@root = '1.2.40.0.34.11.6.3.6']"
         id="d42e21724-false-d235604e0">
      <extends rule="II"/>
      <assert role="error"
              see="https://elga.art-decor.org/epims-html-20250116T123132/tmp-1.2.40.0.34.6.0.11.3.60-2020-02-20T160212.html"
              test="empty(@xsi:type) or resolve-QName(@xsi:type, .) = QName('urn:hl7-org:v3', 'II')">(epims_entry_hospitalization): Wenn eine @xsi:type Instruktion anwesend ist MUSS diese den Wert "{urn:hl7-org:v3}:II" haben. Gefunden "{<value-of select="namespace-uri-from-QName(resolve-QName(@xsi:type,.))"/>}:<value-of select="local-name-from-QName(resolve-QName(@xsi:type,.))"/>"</assert>
      <assert role="error"
              see="https://elga.art-decor.org/epims-html-20250116T123132/tmp-1.2.40.0.34.6.0.11.3.60-2020-02-20T160212.html"
              test="string(@root) = ('1.2.40.0.34.11.6.3.6')">(epims_entry_hospitalization): Der Wert von root MUSS '1.2.40.0.34.11.6.3.6' sein. Gefunden: "<value-of select="@root"/>"</assert>
   </rule>
   <!--
Template derived rules for ID: 1.2.40.0.34.6.0.11.3.60
Context: *[hl7:act[hl7:templateId[@root = '1.2.40.0.34.6.0.11.3.60'] and hl7:templateId[@root = '1.2.40.0.34.11.6.3.6']]]/hl7:act[hl7:templateId[@root = '1.2.40.0.34.6.0.11.3.60'] and hl7:templateId[@root = '1.2.40.0.34.11.6.3.6']]/hl7:code[(@code = '32485007' and @codeSystem = '2.16.840.1.113883.6.96')]
Item: (epims_entry_hospitalization)
-->

   <rule fpi="RULC-1"
         context="*[hl7:act[hl7:templateId[@root = '1.2.40.0.34.6.0.11.3.60'] and hl7:templateId[@root = '1.2.40.0.34.11.6.3.6']]]/hl7:act[hl7:templateId[@root = '1.2.40.0.34.6.0.11.3.60'] and hl7:templateId[@root = '1.2.40.0.34.11.6.3.6']]/hl7:code[(@code = '32485007' and @codeSystem = '2.16.840.1.113883.6.96')]"
         id="d42e21729-false-d235619e0">
      <extends rule="CE"/>
      <assert role="error"
              see="https://elga.art-decor.org/epims-html-20250116T123132/tmp-1.2.40.0.34.6.0.11.3.60-2020-02-20T160212.html"
              test="empty(@xsi:type) or resolve-QName(@xsi:type, .) = QName('urn:hl7-org:v3', 'CE')">(epims_entry_hospitalization): Wenn eine @xsi:type Instruktion anwesend ist MUSS diese den Wert "{urn:hl7-org:v3}:CE" haben. Gefunden "{<value-of select="namespace-uri-from-QName(resolve-QName(@xsi:type,.))"/>}:<value-of select="local-name-from-QName(resolve-QName(@xsi:type,.))"/>"</assert>
      <assert role="error"
              see="https://elga.art-decor.org/epims-html-20250116T123132/tmp-1.2.40.0.34.6.0.11.3.60-2020-02-20T160212.html"
              test="@nullFlavor or (@code='32485007' and @codeSystem='2.16.840.1.113883.6.96' and @displayName='Hospital admission (procedure)' and @codeSystemName='SNOMED CT')">(epims_entry_hospitalization): Der Elementinhalt MUSS einer von 'code '32485007' codeSystem '2.16.840.1.113883.6.96' displayName='Hospital admission (procedure)' codeSystemName='SNOMED CT'' sein.</assert>
   </rule>
   <!--
Template derived rules for ID: 1.2.40.0.34.6.0.11.3.60
Context: *[hl7:act[hl7:templateId[@root = '1.2.40.0.34.6.0.11.3.60'] and hl7:templateId[@root = '1.2.40.0.34.11.6.3.6']]]/hl7:act[hl7:templateId[@root = '1.2.40.0.34.6.0.11.3.60'] and hl7:templateId[@root = '1.2.40.0.34.11.6.3.6']]/hl7:effectiveTime
Item: (epims_entry_hospitalization)
-->

   <rule fpi="RULC-1"
         context="*[hl7:act[hl7:templateId[@root = '1.2.40.0.34.6.0.11.3.60'] and hl7:templateId[@root = '1.2.40.0.34.11.6.3.6']]]/hl7:act[hl7:templateId[@root = '1.2.40.0.34.6.0.11.3.60'] and hl7:templateId[@root = '1.2.40.0.34.11.6.3.6']]/hl7:effectiveTime"
         id="d42e21735-false-d235635e0">
      <extends rule="IVL_TS"/>
      <assert role="error"
              see="https://elga.art-decor.org/epims-html-20250116T123132/tmp-1.2.40.0.34.6.0.11.3.60-2020-02-20T160212.html"
              test="empty(@xsi:type) or resolve-QName(@xsi:type, .) = QName('urn:hl7-org:v3', 'IVL_TS')">(epims_entry_hospitalization): Wenn eine @xsi:type Instruktion anwesend ist MUSS diese den Wert "{urn:hl7-org:v3}:IVL_TS" haben. Gefunden "{<value-of select="namespace-uri-from-QName(resolve-QName(@xsi:type,.))"/>}:<value-of select="local-name-from-QName(resolve-QName(@xsi:type,.))"/>"</assert>
   </rule>
</pattern>
