<?xml version="1.0" encoding="UTF-8"?>
<!--
Template derived pattern
===========================================
ID: 1.2.40.0.34.6.0.11.3.95
Name: EMS Organizer Tätigkeitsbereich
Description: Dieser Organizer wird verwendet um den bzw. die Tätigkeitsbereiche des Patient/der Patientin anzugeben. Derzeitige Verwendung findet dieses Element im Zuge der Arztmeldung an das EMS.
-->
<pattern xmlns="http://purl.oclc.org/dsdl/schematron"
         id="template-1.2.40.0.34.6.0.11.3.95-2020-04-24T132411">
   <title>EMS Organizer Tätigkeitsbereich</title>
   <!--
Template derived rules for ID: 1.2.40.0.34.6.0.11.3.95
Context: *[hl7:organizer[hl7:templateId[@root = '1.2.40.0.34.6.0.11.3.95']]]
Item: (epims_entry_OrganizerTaetigkeitsbereich)
-->

   <!--
Template derived rules for ID: 1.2.40.0.34.6.0.11.3.95
Context: *[hl7:organizer[hl7:templateId[@root = '1.2.40.0.34.6.0.11.3.95']]]/hl7:organizer[hl7:templateId[@root = '1.2.40.0.34.6.0.11.3.95']]
Item: (epims_entry_OrganizerTaetigkeitsbereich)
-->

   <rule fpi="RULC-1"
         context="*[hl7:organizer[hl7:templateId[@root = '1.2.40.0.34.6.0.11.3.95']]]/hl7:organizer[hl7:templateId[@root = '1.2.40.0.34.6.0.11.3.95']]"
         id="d42e23236-false-d292035e0">
      <assert role="error"
              see="https://elga.art-decor.org/epims-html-20250116T123132/tmp-1.2.40.0.34.6.0.11.3.95-2020-04-24T132411.html"
              test="string(@classCode) = ('BATTERY')">(epims_entry_OrganizerTaetigkeitsbereich): Der Wert von classCode MUSS 'BATTERY' sein. Gefunden: "<value-of select="@classCode"/>"</assert>
      <assert role="error"
              see="https://elga.art-decor.org/epims-html-20250116T123132/tmp-1.2.40.0.34.6.0.11.3.95-2020-04-24T132411.html"
              test="string(@moodCode) = ('EVN')">(epims_entry_OrganizerTaetigkeitsbereich): Der Wert von moodCode MUSS 'EVN' sein. Gefunden: "<value-of select="@moodCode"/>"</assert>
      <assert role="error"
              see="https://elga.art-decor.org/epims-html-20250116T123132/tmp-1.2.40.0.34.6.0.11.3.95-2020-04-24T132411.html"
              test="count(hl7:templateId[@root = '1.2.40.0.34.6.0.11.3.95']) &gt;= 1">(epims_entry_OrganizerTaetigkeitsbereich): Element hl7:templateId[@root = '1.2.40.0.34.6.0.11.3.95'] ist mandatory [min 1x].</assert>
      <assert role="error"
              see="https://elga.art-decor.org/epims-html-20250116T123132/tmp-1.2.40.0.34.6.0.11.3.95-2020-04-24T132411.html"
              test="count(hl7:templateId[@root = '1.2.40.0.34.6.0.11.3.95']) &lt;= 1">(epims_entry_OrganizerTaetigkeitsbereich): Element hl7:templateId[@root = '1.2.40.0.34.6.0.11.3.95'] kommt zu häufig vor [max 1x].</assert>
      <assert role="error"
              see="https://elga.art-decor.org/epims-html-20250116T123132/tmp-1.2.40.0.34.6.0.11.3.95-2020-04-24T132411.html"
              test="count(hl7:code[(@code = '40' and @codeSystem = '1.2.40.0.34.5.189')]) &gt;= 1">(epims_entry_OrganizerTaetigkeitsbereich): Element hl7:code[(@code = '40' and @codeSystem = '1.2.40.0.34.5.189')] ist mandatory [min 1x].</assert>
      <assert role="error"
              see="https://elga.art-decor.org/epims-html-20250116T123132/tmp-1.2.40.0.34.6.0.11.3.95-2020-04-24T132411.html"
              test="count(hl7:code[(@code = '40' and @codeSystem = '1.2.40.0.34.5.189')]) &lt;= 1">(epims_entry_OrganizerTaetigkeitsbereich): Element hl7:code[(@code = '40' and @codeSystem = '1.2.40.0.34.5.189')] kommt zu häufig vor [max 1x].</assert>
      <assert role="error"
              see="https://elga.art-decor.org/epims-html-20250116T123132/tmp-1.2.40.0.34.6.0.11.3.95-2020-04-24T132411.html"
              test="count(hl7:statusCode[@code = 'completed']) &gt;= 1">(epims_entry_OrganizerTaetigkeitsbereich): Element hl7:statusCode[@code = 'completed'] ist mandatory [min 1x].</assert>
      <assert role="error"
              see="https://elga.art-decor.org/epims-html-20250116T123132/tmp-1.2.40.0.34.6.0.11.3.95-2020-04-24T132411.html"
              test="count(hl7:statusCode[@code = 'completed']) &lt;= 1">(epims_entry_OrganizerTaetigkeitsbereich): Element hl7:statusCode[@code = 'completed'] kommt zu häufig vor [max 1x].</assert>
      <assert role="error"
              see="https://elga.art-decor.org/epims-html-20250116T123132/tmp-1.2.40.0.34.6.0.11.3.95-2020-04-24T132411.html"
              test="count(hl7:component[hl7:act[hl7:templateId[@root = '1.2.40.0.34.6.0.11.3.94']]]) &gt;= 1">(epims_entry_OrganizerTaetigkeitsbereich): Element hl7:component[hl7:act[hl7:templateId[@root = '1.2.40.0.34.6.0.11.3.94']]] ist required [min 1x].</assert>
   </rule>
   <!--
Template derived rules for ID: 1.2.40.0.34.6.0.11.3.95
Context: *[hl7:organizer[hl7:templateId[@root = '1.2.40.0.34.6.0.11.3.95']]]/hl7:organizer[hl7:templateId[@root = '1.2.40.0.34.6.0.11.3.95']]/hl7:templateId[@root = '1.2.40.0.34.6.0.11.3.95']
Item: (epims_entry_OrganizerTaetigkeitsbereich)
-->

   <rule fpi="RULC-1"
         context="*[hl7:organizer[hl7:templateId[@root = '1.2.40.0.34.6.0.11.3.95']]]/hl7:organizer[hl7:templateId[@root = '1.2.40.0.34.6.0.11.3.95']]/hl7:templateId[@root = '1.2.40.0.34.6.0.11.3.95']"
         id="d42e23242-false-d292087e0">
      <extends rule="II"/>
      <assert role="error"
              see="https://elga.art-decor.org/epims-html-20250116T123132/tmp-1.2.40.0.34.6.0.11.3.95-2020-04-24T132411.html"
              test="empty(@xsi:type) or resolve-QName(@xsi:type, .) = QName('urn:hl7-org:v3', 'II')">(epims_entry_OrganizerTaetigkeitsbereich): Wenn eine @xsi:type Instruktion anwesend ist MUSS diese den Wert "{urn:hl7-org:v3}:II" haben. Gefunden "{<value-of select="namespace-uri-from-QName(resolve-QName(@xsi:type,.))"/>}:<value-of select="local-name-from-QName(resolve-QName(@xsi:type,.))"/>"</assert>
      <assert role="error"
              see="https://elga.art-decor.org/epims-html-20250116T123132/tmp-1.2.40.0.34.6.0.11.3.95-2020-04-24T132411.html"
              test="string(@root) = ('1.2.40.0.34.6.0.11.3.95')">(epims_entry_OrganizerTaetigkeitsbereich): Der Wert von root MUSS '1.2.40.0.34.6.0.11.3.95' sein. Gefunden: "<value-of select="@root"/>"</assert>
   </rule>
   <!--
Template derived rules for ID: 1.2.40.0.34.6.0.11.3.95
Context: *[hl7:organizer[hl7:templateId[@root = '1.2.40.0.34.6.0.11.3.95']]]/hl7:organizer[hl7:templateId[@root = '1.2.40.0.34.6.0.11.3.95']]/hl7:code[(@code = '40' and @codeSystem = '1.2.40.0.34.5.189')]
Item: (epims_entry_OrganizerTaetigkeitsbereich)
-->

   <rule fpi="RULC-1"
         context="*[hl7:organizer[hl7:templateId[@root = '1.2.40.0.34.6.0.11.3.95']]]/hl7:organizer[hl7:templateId[@root = '1.2.40.0.34.6.0.11.3.95']]/hl7:code[(@code = '40' and @codeSystem = '1.2.40.0.34.5.189')]"
         id="d42e23247-false-d292102e0">
      <extends rule="CE"/>
      <assert role="error"
              see="https://elga.art-decor.org/epims-html-20250116T123132/tmp-1.2.40.0.34.6.0.11.3.95-2020-04-24T132411.html"
              test="empty(@xsi:type) or resolve-QName(@xsi:type, .) = QName('urn:hl7-org:v3', 'CE')">(epims_entry_OrganizerTaetigkeitsbereich): Wenn eine @xsi:type Instruktion anwesend ist MUSS diese den Wert "{urn:hl7-org:v3}:CE" haben. Gefunden "{<value-of select="namespace-uri-from-QName(resolve-QName(@xsi:type,.))"/>}:<value-of select="local-name-from-QName(resolve-QName(@xsi:type,.))"/>"</assert>
      <assert role="error"
              see="https://elga.art-decor.org/epims-html-20250116T123132/tmp-1.2.40.0.34.6.0.11.3.95-2020-04-24T132411.html"
              test="@nullFlavor or (@code='40' and @codeSystem='1.2.40.0.34.5.189')">(epims_entry_OrganizerTaetigkeitsbereich): Der Elementinhalt MUSS einer von 'code '40' codeSystem '1.2.40.0.34.5.189'' sein.</assert>
      <assert role="error"
              see="https://elga.art-decor.org/epims-html-20250116T123132/tmp-1.2.40.0.34.6.0.11.3.95-2020-04-24T132411.html"
              test="string(@codeSystemName) = ('EMS_struktur_elemente') or not(@codeSystemName)">(epims_entry_OrganizerTaetigkeitsbereich): Der Wert von codeSystemName MUSS 'EMS_struktur_elemente' sein. Gefunden: "<value-of select="@codeSystemName"/>"</assert>
      <assert role="error"
              see="https://elga.art-decor.org/epims-html-20250116T123132/tmp-1.2.40.0.34.6.0.11.3.95-2020-04-24T132411.html"
              test="not(@codeSystemName) or string-length(@codeSystemName)&gt;0">(epims_entry_OrganizerTaetigkeitsbereich): Attribute @codeSystemName MUSS vom Datentyp 'st' sein  - '<value-of select="@codeSystemName"/>'</assert>
      <assert role="error"
              see="https://elga.art-decor.org/epims-html-20250116T123132/tmp-1.2.40.0.34.6.0.11.3.95-2020-04-24T132411.html"
              test="string(@displayName) = ('EMS_Organizer_Taetigkeitsbereich') or not(@displayName)">(epims_entry_OrganizerTaetigkeitsbereich): Der Wert von displayName MUSS 'EMS_Organizer_Taetigkeitsbereich' sein. Gefunden: "<value-of select="@displayName"/>"</assert>
      <assert role="error"
              see="https://elga.art-decor.org/epims-html-20250116T123132/tmp-1.2.40.0.34.6.0.11.3.95-2020-04-24T132411.html"
              test="not(@displayName) or string-length(@displayName)&gt;0">(epims_entry_OrganizerTaetigkeitsbereich): Attribute @displayName MUSS vom Datentyp 'st' sein  - '<value-of select="@displayName"/>'</assert>
   </rule>
   <!--
Template derived rules for ID: 1.2.40.0.34.6.0.11.3.95
Context: *[hl7:organizer[hl7:templateId[@root = '1.2.40.0.34.6.0.11.3.95']]]/hl7:organizer[hl7:templateId[@root = '1.2.40.0.34.6.0.11.3.95']]/hl7:statusCode[@code = 'completed']
Item: (epims_entry_OrganizerTaetigkeitsbereich)
-->

   <rule fpi="RULC-1"
         context="*[hl7:organizer[hl7:templateId[@root = '1.2.40.0.34.6.0.11.3.95']]]/hl7:organizer[hl7:templateId[@root = '1.2.40.0.34.6.0.11.3.95']]/hl7:statusCode[@code = 'completed']"
         id="d42e23256-false-d292131e0">
      <extends rule="CS"/>
      <assert role="error"
              see="https://elga.art-decor.org/epims-html-20250116T123132/tmp-1.2.40.0.34.6.0.11.3.95-2020-04-24T132411.html"
              test="empty(@xsi:type) or resolve-QName(@xsi:type, .) = QName('urn:hl7-org:v3', 'CS')">(epims_entry_OrganizerTaetigkeitsbereich): Wenn eine @xsi:type Instruktion anwesend ist MUSS diese den Wert "{urn:hl7-org:v3}:CS" haben. Gefunden "{<value-of select="namespace-uri-from-QName(resolve-QName(@xsi:type,.))"/>}:<value-of select="local-name-from-QName(resolve-QName(@xsi:type,.))"/>"</assert>
      <assert role="error"
              see="https://elga.art-decor.org/epims-html-20250116T123132/tmp-1.2.40.0.34.6.0.11.3.95-2020-04-24T132411.html"
              test="@nullFlavor or (@code='completed')">(epims_entry_OrganizerTaetigkeitsbereich): Der Elementinhalt MUSS einer von 'code 'completed'' sein.</assert>
   </rule>
   <!--
Template derived rules for ID: 1.2.40.0.34.6.0.11.3.95
Context: *[hl7:organizer[hl7:templateId[@root = '1.2.40.0.34.6.0.11.3.95']]]/hl7:organizer[hl7:templateId[@root = '1.2.40.0.34.6.0.11.3.95']]/hl7:component[hl7:act[hl7:templateId[@root = '1.2.40.0.34.6.0.11.3.94']]]
Item: (epims_entry_OrganizerTaetigkeitsbereich)
-->

   <rule fpi="RULC-1"
         context="*[hl7:organizer[hl7:templateId[@root = '1.2.40.0.34.6.0.11.3.95']]]/hl7:organizer[hl7:templateId[@root = '1.2.40.0.34.6.0.11.3.95']]/hl7:component[hl7:act[hl7:templateId[@root = '1.2.40.0.34.6.0.11.3.94']]]"
         id="d42e23262-false-d292151e0">
      <assert role="error"
              see="https://elga.art-decor.org/epims-html-20250116T123132/tmp-1.2.40.0.34.6.0.11.3.95-2020-04-24T132411.html"
              test="string(@typeCode) = ('COMP')">(epims_entry_OrganizerTaetigkeitsbereich): Der Wert von typeCode MUSS 'COMP' sein. Gefunden: "<value-of select="@typeCode"/>"</assert>
      <assert role="error"
              see="https://elga.art-decor.org/epims-html-20250116T123132/tmp-1.2.40.0.34.6.0.11.3.95-2020-04-24T132411.html"
              test="not(@contextConductionInd) or string(@contextConductionInd)=('true','false')">(epims_entry_OrganizerTaetigkeitsbereich): Attribute @contextConductionInd MUSS vom Datentyp 'bl' sein  - '<value-of select="@contextConductionInd"/>'</assert>
      <assert role="error"
              see="https://elga.art-decor.org/epims-html-20250116T123132/tmp-1.2.40.0.34.6.0.11.3.95-2020-04-24T132411.html"
              test="count(hl7:act[hl7:templateId[@root = '1.2.40.0.34.6.0.11.3.94']]) &gt;= 1">(epims_entry_OrganizerTaetigkeitsbereich): Element hl7:act[hl7:templateId[@root = '1.2.40.0.34.6.0.11.3.94']] ist mandatory [min 1x].</assert>
      <assert role="error"
              see="https://elga.art-decor.org/epims-html-20250116T123132/tmp-1.2.40.0.34.6.0.11.3.95-2020-04-24T132411.html"
              test="count(hl7:act[hl7:templateId[@root = '1.2.40.0.34.6.0.11.3.94']]) &lt;= 1">(epims_entry_OrganizerTaetigkeitsbereich): Element hl7:act[hl7:templateId[@root = '1.2.40.0.34.6.0.11.3.94']] kommt zu häufig vor [max 1x].</assert>
   </rule>
   <!--
Template derived rules for ID: 1.2.40.0.34.6.0.11.3.94
Context: *[hl7:organizer[hl7:templateId[@root = '1.2.40.0.34.6.0.11.3.95']]]/hl7:organizer[hl7:templateId[@root = '1.2.40.0.34.6.0.11.3.95']]/hl7:component[hl7:act[hl7:templateId[@root = '1.2.40.0.34.6.0.11.3.94']]]/hl7:act[hl7:templateId[@root = '1.2.40.0.34.6.0.11.3.94']]
Item: (epims_entry_ActTaetigkeitsbereich)
-->

   <rule fpi="RULC-1"
         context="*[hl7:organizer[hl7:templateId[@root = '1.2.40.0.34.6.0.11.3.95']]]/hl7:organizer[hl7:templateId[@root = '1.2.40.0.34.6.0.11.3.95']]/hl7:component[hl7:act[hl7:templateId[@root = '1.2.40.0.34.6.0.11.3.94']]]/hl7:act[hl7:templateId[@root = '1.2.40.0.34.6.0.11.3.94']]"
         id="d292147e54-false-d292182e0">
      <assert role="error"
              see="https://elga.art-decor.org/epims-html-20250116T123132/tmp-1.2.40.0.34.6.0.11.3.94-2020-04-24T092425.html"
              test="string(@moodCode) = ('EVN')">(epims_entry_ActTaetigkeitsbereich): Der Wert von moodCode MUSS 'EVN' sein. Gefunden: "<value-of select="@moodCode"/>"</assert>
      <assert role="error"
              see="https://elga.art-decor.org/epims-html-20250116T123132/tmp-1.2.40.0.34.6.0.11.3.94-2020-04-24T092425.html"
              test="string(@classCode) = ('INFRM')">(epims_entry_ActTaetigkeitsbereich): Der Wert von classCode MUSS 'INFRM' sein. Gefunden: "<value-of select="@classCode"/>"</assert>
      <assert role="error"
              see="https://elga.art-decor.org/epims-html-20250116T123132/tmp-1.2.40.0.34.6.0.11.3.94-2020-04-24T092425.html"
              test="count(hl7:templateId[@root = '1.2.40.0.34.6.0.11.3.94']) &gt;= 1">(epims_entry_ActTaetigkeitsbereich): Element hl7:templateId[@root = '1.2.40.0.34.6.0.11.3.94'] ist mandatory [min 1x].</assert>
      <assert role="error"
              see="https://elga.art-decor.org/epims-html-20250116T123132/tmp-1.2.40.0.34.6.0.11.3.94-2020-04-24T092425.html"
              test="count(hl7:templateId[@root = '1.2.40.0.34.6.0.11.3.94']) &lt;= 1">(epims_entry_ActTaetigkeitsbereich): Element hl7:templateId[@root = '1.2.40.0.34.6.0.11.3.94'] kommt zu häufig vor [max 1x].</assert>
      <assert role="error"
              see="https://elga.art-decor.org/epims-html-20250116T123132/tmp-1.2.40.0.34.6.0.11.3.94-2020-04-24T092425.html"
              test="count(hl7:code[concat(@code, @codeSystem) = doc('include/voc-1.2.40.0.34.6.0.10.21-DYNAMIC.xml')//valueSet[1]/conceptList/concept/concat(@code, @codeSystem)]) &gt;= 1">(epims_entry_ActTaetigkeitsbereich): Element hl7:code[concat(@code, @codeSystem) = doc('include/voc-1.2.40.0.34.6.0.10.21-DYNAMIC.xml')//valueSet[1]/conceptList/concept/concat(@code, @codeSystem)] ist mandatory [min 1x].</assert>
      <assert role="error"
              see="https://elga.art-decor.org/epims-html-20250116T123132/tmp-1.2.40.0.34.6.0.11.3.94-2020-04-24T092425.html"
              test="count(hl7:code[concat(@code, @codeSystem) = doc('include/voc-1.2.40.0.34.6.0.10.21-DYNAMIC.xml')//valueSet[1]/conceptList/concept/concat(@code, @codeSystem)]) &lt;= 1">(epims_entry_ActTaetigkeitsbereich): Element hl7:code[concat(@code, @codeSystem) = doc('include/voc-1.2.40.0.34.6.0.10.21-DYNAMIC.xml')//valueSet[1]/conceptList/concept/concat(@code, @codeSystem)] kommt zu häufig vor [max 1x].</assert>
      <assert role="error"
              see="https://elga.art-decor.org/epims-html-20250116T123132/tmp-1.2.40.0.34.6.0.11.3.94-2020-04-24T092425.html"
              test="count(hl7:effectiveTime) &lt;= 1">(epims_entry_ActTaetigkeitsbereich): Element hl7:effectiveTime kommt zu häufig vor [max 1x].</assert>
   </rule>
   <!--
Template derived rules for ID: 1.2.40.0.34.6.0.11.3.94
Context: *[hl7:organizer[hl7:templateId[@root = '1.2.40.0.34.6.0.11.3.95']]]/hl7:organizer[hl7:templateId[@root = '1.2.40.0.34.6.0.11.3.95']]/hl7:component[hl7:act[hl7:templateId[@root = '1.2.40.0.34.6.0.11.3.94']]]/hl7:act[hl7:templateId[@root = '1.2.40.0.34.6.0.11.3.94']]/hl7:templateId[@root = '1.2.40.0.34.6.0.11.3.94']
Item: (epims_entry_ActTaetigkeitsbereich)
-->

   <rule fpi="RULC-1"
         context="*[hl7:organizer[hl7:templateId[@root = '1.2.40.0.34.6.0.11.3.95']]]/hl7:organizer[hl7:templateId[@root = '1.2.40.0.34.6.0.11.3.95']]/hl7:component[hl7:act[hl7:templateId[@root = '1.2.40.0.34.6.0.11.3.94']]]/hl7:act[hl7:templateId[@root = '1.2.40.0.34.6.0.11.3.94']]/hl7:templateId[@root = '1.2.40.0.34.6.0.11.3.94']"
         id="d292147e60-false-d292225e0">
      <extends rule="II"/>
      <assert role="error"
              see="https://elga.art-decor.org/epims-html-20250116T123132/tmp-1.2.40.0.34.6.0.11.3.94-2020-04-24T092425.html"
              test="empty(@xsi:type) or resolve-QName(@xsi:type, .) = QName('urn:hl7-org:v3', 'II')">(epims_entry_ActTaetigkeitsbereich): Wenn eine @xsi:type Instruktion anwesend ist MUSS diese den Wert "{urn:hl7-org:v3}:II" haben. Gefunden "{<value-of select="namespace-uri-from-QName(resolve-QName(@xsi:type,.))"/>}:<value-of select="local-name-from-QName(resolve-QName(@xsi:type,.))"/>"</assert>
      <assert role="error"
              see="https://elga.art-decor.org/epims-html-20250116T123132/tmp-1.2.40.0.34.6.0.11.3.94-2020-04-24T092425.html"
              test="string(@root) = ('1.2.40.0.34.6.0.11.3.94')">(epims_entry_ActTaetigkeitsbereich): Der Wert von root MUSS '1.2.40.0.34.6.0.11.3.94' sein. Gefunden: "<value-of select="@root"/>"</assert>
   </rule>
   <!--
Template derived rules for ID: 1.2.40.0.34.6.0.11.3.94
Context: *[hl7:organizer[hl7:templateId[@root = '1.2.40.0.34.6.0.11.3.95']]]/hl7:organizer[hl7:templateId[@root = '1.2.40.0.34.6.0.11.3.95']]/hl7:component[hl7:act[hl7:templateId[@root = '1.2.40.0.34.6.0.11.3.94']]]/hl7:act[hl7:templateId[@root = '1.2.40.0.34.6.0.11.3.94']]/hl7:code[concat(@code, @codeSystem) = doc('include/voc-1.2.40.0.34.6.0.10.21-DYNAMIC.xml')//valueSet[1]/conceptList/concept/concat(@code, @codeSystem)]
Item: (epims_entry_ActTaetigkeitsbereich)
-->

   <rule fpi="RULC-1"
         context="*[hl7:organizer[hl7:templateId[@root = '1.2.40.0.34.6.0.11.3.95']]]/hl7:organizer[hl7:templateId[@root = '1.2.40.0.34.6.0.11.3.95']]/hl7:component[hl7:act[hl7:templateId[@root = '1.2.40.0.34.6.0.11.3.94']]]/hl7:act[hl7:templateId[@root = '1.2.40.0.34.6.0.11.3.94']]/hl7:code[concat(@code, @codeSystem) = doc('include/voc-1.2.40.0.34.6.0.10.21-DYNAMIC.xml')//valueSet[1]/conceptList/concept/concat(@code, @codeSystem)]"
         id="d292147e65-false-d292242e0">
      <extends rule="CD"/>
      <assert role="error"
              see="https://elga.art-decor.org/epims-html-20250116T123132/tmp-1.2.40.0.34.6.0.11.3.94-2020-04-24T092425.html"
              test="empty(@xsi:type) or resolve-QName(@xsi:type, .) = QName('urn:hl7-org:v3', 'CD')">(epims_entry_ActTaetigkeitsbereich): Wenn eine @xsi:type Instruktion anwesend ist MUSS diese den Wert "{urn:hl7-org:v3}:CD" haben. Gefunden "{<value-of select="namespace-uri-from-QName(resolve-QName(@xsi:type,.))"/>}:<value-of select="local-name-from-QName(resolve-QName(@xsi:type,.))"/>"</assert>
      <let name="theCode" value="@code"/>
      <let name="theCodeSystem" value="@codeSystem"/>
      <assert role="error"
              see="https://elga.art-decor.org/epims-html-20250116T123132/tmp-1.2.40.0.34.6.0.11.3.94-2020-04-24T092425.html"
              test="@nullFlavor or exists(doc('include/voc-1.2.40.0.34.6.0.10.21-DYNAMIC.xml')//valueSet[1][conceptList/concept[@code = $theCode][@codeSystem = $theCodeSystem]])">(epims_entry_ActTaetigkeitsbereich): Der Elementinhalt MUSS einer von '1.2.40.0.34.6.0.10.21 EMS Tätigkeitsbereich VS (DYNAMIC)' sein.</assert>
   </rule>
   <!--
Template derived rules for ID: 1.2.40.0.34.6.0.11.3.94
Context: *[hl7:organizer[hl7:templateId[@root = '1.2.40.0.34.6.0.11.3.95']]]/hl7:organizer[hl7:templateId[@root = '1.2.40.0.34.6.0.11.3.95']]/hl7:component[hl7:act[hl7:templateId[@root = '1.2.40.0.34.6.0.11.3.94']]]/hl7:act[hl7:templateId[@root = '1.2.40.0.34.6.0.11.3.94']]/hl7:effectiveTime
Item: (epims_entry_ActTaetigkeitsbereich)
-->

   <rule fpi="RULC-1"
         context="*[hl7:organizer[hl7:templateId[@root = '1.2.40.0.34.6.0.11.3.95']]]/hl7:organizer[hl7:templateId[@root = '1.2.40.0.34.6.0.11.3.95']]/hl7:component[hl7:act[hl7:templateId[@root = '1.2.40.0.34.6.0.11.3.94']]]/hl7:act[hl7:templateId[@root = '1.2.40.0.34.6.0.11.3.94']]/hl7:effectiveTime"
         id="d292147e70-false-d292262e0">
      <extends rule="IVL_TS"/>
      <assert role="error"
              see="https://elga.art-decor.org/epims-html-20250116T123132/tmp-1.2.40.0.34.6.0.11.3.94-2020-04-24T092425.html"
              test="empty(@xsi:type) or resolve-QName(@xsi:type, .) = QName('urn:hl7-org:v3', 'IVL_TS')">(epims_entry_ActTaetigkeitsbereich): Wenn eine @xsi:type Instruktion anwesend ist MUSS diese den Wert "{urn:hl7-org:v3}:IVL_TS" haben. Gefunden "{<value-of select="namespace-uri-from-QName(resolve-QName(@xsi:type,.))"/>}:<value-of select="local-name-from-QName(resolve-QName(@xsi:type,.))"/>"</assert>
   </rule>
</pattern>
