<?xml version="1.0" encoding="UTF-8"?>
<!--
Template derived pattern
===========================================
ID: 1.2.40.0.34.6.0.11.3.24
Name: Vitalparameter Entry
Description: A vital signs observation entry is a simple observation that uses a specific vocabulary. The effectiveTime element shall be present to indicate when the measurement was taken; it may be omitted, if the vital Signs Organizer carries an effectiveTime element.
-->
<pattern xmlns="http://purl.oclc.org/dsdl/schematron"
         id="template-1.2.40.0.34.6.0.11.3.24-2021-02-19T130055-closed">
   <title>Vitalparameter Entry</title>

   <!-- Checking undefined contents for template/element @isClosed="true". Match context that we did not already match -->
   <rule fpi="RUL-QQQ"
         context="*[hl7:observation[hl7:templateId[@root = '1.2.40.0.34.6.0.11.3.24'] and hl7:templateId[@root = '2.16.840.1.113883.10.20.1.31'] and hl7:templateId[@root = '1.3.6.1.4.1.19376.1.5.3.1.4.13'] and hl7:templateId[@root = '1.3.6.1.4.1.19376.1.5.3.1.4.13.2']]]/*[not(@xsi:nil = 'true')][not(self::hl7:observation[hl7:templateId[@root = '1.2.40.0.34.6.0.11.3.24'] and hl7:templateId[@root = '2.16.840.1.113883.10.20.1.31'] and hl7:templateId[@root = '1.3.6.1.4.1.19376.1.5.3.1.4.13'] and hl7:templateId[@root = '1.3.6.1.4.1.19376.1.5.3.1.4.13.2']])]"
         id="d42e59236-true-d5285929e0">
      <assert role="error"
              see="http://elga.art-decor.org/elgaambbef-html-20230118T144941/tmp-1.2.40.0.34.6.0.11.3.24-2021-02-19T130055.html"
              test="not(.)">(atcdabbr_entry_VitalparameterEntry)/d42e59236-true-d5285929e0: '<value-of select="name(..)"/>' ist als geschlossen definiert und dieses Element '<name/>' ist nicht erlaubt oder nicht mit diesem Inhalt erlaubt. Dies kann templateId, code oder id betreffen. Erwartet:  hl7:observation[hl7:templateId[@root = '1.2.40.0.34.6.0.11.3.24'] and hl7:templateId[@root = '2.16.840.1.113883.10.20.1.31'] and hl7:templateId[@root = '1.3.6.1.4.1.19376.1.5.3.1.4.13'] and hl7:templateId[@root = '1.3.6.1.4.1.19376.1.5.3.1.4.13.2']] (rule-reference: d42e59236-true-d5285929e0)</assert>
   </rule>

   <!-- Checking undefined contents for template/element @isClosed="true". Match context that we did not already match -->
   <rule fpi="RUL-QQQ"
         context="*[hl7:observation[hl7:templateId[@root = '1.2.40.0.34.6.0.11.3.24'] and hl7:templateId[@root = '2.16.840.1.113883.10.20.1.31'] and hl7:templateId[@root = '1.3.6.1.4.1.19376.1.5.3.1.4.13'] and hl7:templateId[@root = '1.3.6.1.4.1.19376.1.5.3.1.4.13.2']]]/hl7:observation[hl7:templateId[@root = '1.2.40.0.34.6.0.11.3.24'] and hl7:templateId[@root = '2.16.840.1.113883.10.20.1.31'] and hl7:templateId[@root = '1.3.6.1.4.1.19376.1.5.3.1.4.13'] and hl7:templateId[@root = '1.3.6.1.4.1.19376.1.5.3.1.4.13.2']]/*[not(@xsi:nil = 'true')][not(self::hl7:templateId[@root = '1.2.40.0.34.6.0.11.3.24'] | self::hl7:templateId[@root = '2.16.840.1.113883.10.20.1.31'] | self::hl7:templateId[@root = '1.3.6.1.4.1.19376.1.5.3.1.4.13'] | self::hl7:templateId[@root = '1.3.6.1.4.1.19376.1.5.3.1.4.13.2'] | self::hl7:id[not(@nullFlavor)] | self::hl7:code[concat(@code, @codeSystem) = doc('include/voc-1.2.40.0.34.10.34-DYNAMIC.xml')//valueSet[1]/conceptList/concept/concat(@code, @codeSystem)] | self::hl7:text[not(@nullFlavor)] | self::hl7:statusCode[@code = 'completed'] | self::hl7:effectiveTime[@value] | self::hl7:effectiveTime[@nullFlavor='UNK'] | self::hl7:effectiveTime | self::hl7:value[not(@nullFlavor)] | self::hl7:value[@nullFlavor='NA'] | self::hl7:performer[hl7:templateId[@root = '1.2.40.0.34.6.0.11.9.17']] | self::hl7:author[hl7:assignedAuthor] | self::hl7:informant | self::hl7:participant[@typeCode][hl7:participantRole])]"
         id="d42e59359-true-d5286474e0">
      <assert role="error"
              see="http://elga.art-decor.org/elgaambbef-html-20230118T144941/tmp-1.2.40.0.34.6.0.11.3.24-2021-02-19T130055.html"
              test="not(.)">(atcdabbr_entry_VitalparameterEntry)/d42e59359-true-d5286474e0: '<value-of select="name(..)"/>' ist als geschlossen definiert und dieses Element '<name/>' ist nicht erlaubt oder nicht mit diesem Inhalt erlaubt. Dies kann templateId, code oder id betreffen. Erwartet:  hl7:templateId[@root = '1.2.40.0.34.6.0.11.3.24'] | hl7:templateId[@root = '2.16.840.1.113883.10.20.1.31'] | hl7:templateId[@root = '1.3.6.1.4.1.19376.1.5.3.1.4.13'] | hl7:templateId[@root = '1.3.6.1.4.1.19376.1.5.3.1.4.13.2'] | hl7:id[not(@nullFlavor)] | hl7:code[concat(@code, @codeSystem) = doc('include/voc-1.2.40.0.34.10.34-DYNAMIC.xml')//valueSet[1]/conceptList/concept/concat(@code, @codeSystem)] | hl7:text[not(@nullFlavor)] | hl7:statusCode[@code = 'completed'] | hl7:effectiveTime[@value] | hl7:effectiveTime[@nullFlavor='UNK'] | hl7:effectiveTime | hl7:value[not(@nullFlavor)] | hl7:value[@nullFlavor='NA'] | hl7:performer[hl7:templateId[@root = '1.2.40.0.34.6.0.11.9.17']] | hl7:author[hl7:assignedAuthor] | hl7:informant | hl7:participant[@typeCode][hl7:participantRole] (rule-reference: d42e59359-true-d5286474e0)</assert>
   </rule>

   <!-- Checking undefined contents for template/element @isClosed="true". Match context that we did not already match -->
   <rule fpi="RUL-QQQ"
         context="*[hl7:observation[hl7:templateId[@root = '1.2.40.0.34.6.0.11.3.24'] and hl7:templateId[@root = '2.16.840.1.113883.10.20.1.31'] and hl7:templateId[@root = '1.3.6.1.4.1.19376.1.5.3.1.4.13'] and hl7:templateId[@root = '1.3.6.1.4.1.19376.1.5.3.1.4.13.2']]]/hl7:observation[hl7:templateId[@root = '1.2.40.0.34.6.0.11.3.24'] and hl7:templateId[@root = '2.16.840.1.113883.10.20.1.31'] and hl7:templateId[@root = '1.3.6.1.4.1.19376.1.5.3.1.4.13'] and hl7:templateId[@root = '1.3.6.1.4.1.19376.1.5.3.1.4.13.2']]/hl7:code[concat(@code, @codeSystem) = doc('include/voc-1.2.40.0.34.10.34-DYNAMIC.xml')//valueSet[1]/conceptList/concept/concat(@code, @codeSystem)]/*[not(@xsi:nil = 'true')][not(self::hl7:originalText[not(@nullFlavor)] | self::hl7:translation | self::ips:designation)]"
         id="d42e59412-true-d5286530e0">
      <assert role="error"
              see="http://elga.art-decor.org/elgaambbef-html-20230118T144941/tmp-1.2.40.0.34.6.0.11.3.24-2021-02-19T130055.html"
              test="not(.)">(atcdabbr_entry_VitalparameterEntry)/d42e59412-true-d5286530e0: '<value-of select="name(..)"/>' ist als geschlossen definiert und dieses Element '<name/>' ist nicht erlaubt oder nicht mit diesem Inhalt erlaubt. Dies kann templateId, code oder id betreffen. Erwartet:  hl7:originalText[not(@nullFlavor)] | hl7:translation | ips:designation (rule-reference: d42e59412-true-d5286530e0)</assert>
   </rule>

   <!-- Checking undefined contents for template/element @isClosed="true". Match context that we did not already match -->
   <rule fpi="RUL-QQQ"
         context="*[hl7:observation[hl7:templateId[@root = '1.2.40.0.34.6.0.11.3.24'] and hl7:templateId[@root = '2.16.840.1.113883.10.20.1.31'] and hl7:templateId[@root = '1.3.6.1.4.1.19376.1.5.3.1.4.13'] and hl7:templateId[@root = '1.3.6.1.4.1.19376.1.5.3.1.4.13.2']]]/hl7:observation[hl7:templateId[@root = '1.2.40.0.34.6.0.11.3.24'] and hl7:templateId[@root = '2.16.840.1.113883.10.20.1.31'] and hl7:templateId[@root = '1.3.6.1.4.1.19376.1.5.3.1.4.13'] and hl7:templateId[@root = '1.3.6.1.4.1.19376.1.5.3.1.4.13.2']]/hl7:code[concat(@code, @codeSystem) = doc('include/voc-1.2.40.0.34.10.34-DYNAMIC.xml')//valueSet[1]/conceptList/concept/concat(@code, @codeSystem)]/hl7:originalText[not(@nullFlavor)]/*[not(@xsi:nil = 'true')][not(self::hl7:reference[not(@nullFlavor)])]"
         id="d42e59430-true-d5286544e0">
      <assert role="error"
              see="http://elga.art-decor.org/elgaambbef-html-20230118T144941/tmp-1.2.40.0.34.6.0.11.3.24-2021-02-19T130055.html"
              test="not(.)">(atcdabbr_entry_VitalparameterEntry)/d42e59430-true-d5286544e0: '<value-of select="name(..)"/>' ist als geschlossen definiert und dieses Element '<name/>' ist nicht erlaubt oder nicht mit diesem Inhalt erlaubt. Dies kann templateId, code oder id betreffen. Erwartet:  hl7:reference[not(@nullFlavor)] (rule-reference: d42e59430-true-d5286544e0)</assert>
   </rule>

   <!-- Checking undefined contents for template/element @isClosed="true". Match context that we did not already match -->
   <rule fpi="RUL-QQQ"
         context="*[hl7:observation[hl7:templateId[@root = '1.2.40.0.34.6.0.11.3.24'] and hl7:templateId[@root = '2.16.840.1.113883.10.20.1.31'] and hl7:templateId[@root = '1.3.6.1.4.1.19376.1.5.3.1.4.13'] and hl7:templateId[@root = '1.3.6.1.4.1.19376.1.5.3.1.4.13.2']]]/hl7:observation[hl7:templateId[@root = '1.2.40.0.34.6.0.11.3.24'] and hl7:templateId[@root = '2.16.840.1.113883.10.20.1.31'] and hl7:templateId[@root = '1.3.6.1.4.1.19376.1.5.3.1.4.13'] and hl7:templateId[@root = '1.3.6.1.4.1.19376.1.5.3.1.4.13.2']]/hl7:text[not(@nullFlavor)]/*[not(@xsi:nil = 'true')][not(self::hl7:reference[not(@nullFlavor)])]"
         id="d42e59469-true-d5286573e0">
      <assert role="error"
              see="http://elga.art-decor.org/elgaambbef-html-20230118T144941/tmp-1.2.40.0.34.6.0.11.3.24-2021-02-19T130055.html"
              test="not(.)">(atcdabbr_entry_VitalparameterEntry)/d42e59469-true-d5286573e0: '<value-of select="name(..)"/>' ist als geschlossen definiert und dieses Element '<name/>' ist nicht erlaubt oder nicht mit diesem Inhalt erlaubt. Dies kann templateId, code oder id betreffen. Erwartet:  hl7:reference[not(@nullFlavor)] (rule-reference: d42e59469-true-d5286573e0)</assert>
   </rule>

   <!-- Checking undefined contents for template/element @isClosed="true". Match context that we did not already match -->
   <rule fpi="RUL-QQQ"
         context="*[hl7:observation[hl7:templateId[@root = '1.2.40.0.34.6.0.11.3.24'] and hl7:templateId[@root = '2.16.840.1.113883.10.20.1.31'] and hl7:templateId[@root = '1.3.6.1.4.1.19376.1.5.3.1.4.13'] and hl7:templateId[@root = '1.3.6.1.4.1.19376.1.5.3.1.4.13.2']]]/hl7:observation[hl7:templateId[@root = '1.2.40.0.34.6.0.11.3.24'] and hl7:templateId[@root = '2.16.840.1.113883.10.20.1.31'] and hl7:templateId[@root = '1.3.6.1.4.1.19376.1.5.3.1.4.13'] and hl7:templateId[@root = '1.3.6.1.4.1.19376.1.5.3.1.4.13.2']]/hl7:effectiveTime/*[not(@xsi:nil = 'true')][not(self::hl7:low[@value] | self::hl7:low[@nullFlavor='UNK'] | self::hl7:high[@value] | self::hl7:high[@nullFlavor='UNK'])]"
         id="d42e59527-true-d5286605e0">
      <assert role="error"
              see="http://elga.art-decor.org/elgaambbef-html-20230118T144941/tmp-1.2.40.0.34.6.0.11.3.24-2021-02-19T130055.html"
              test="not(.)">(atcdabbr_entry_VitalparameterEntry)/d42e59527-true-d5286605e0: '<value-of select="name(..)"/>' ist als geschlossen definiert und dieses Element '<name/>' ist nicht erlaubt oder nicht mit diesem Inhalt erlaubt. Dies kann templateId, code oder id betreffen. Erwartet:  hl7:low[@value] | hl7:low[@nullFlavor='UNK'] | hl7:high[@value] | hl7:high[@nullFlavor='UNK'] (rule-reference: d42e59527-true-d5286605e0)</assert>
   </rule>

   <!-- Checking undefined contents for template/element @isClosed="true". Match context that we did not already match -->
   <rule fpi="RUL-QQQ"
         context="*[hl7:observation[hl7:templateId[@root = '1.2.40.0.34.6.0.11.3.24'] and hl7:templateId[@root = '2.16.840.1.113883.10.20.1.31'] and hl7:templateId[@root = '1.3.6.1.4.1.19376.1.5.3.1.4.13'] and hl7:templateId[@root = '1.3.6.1.4.1.19376.1.5.3.1.4.13.2']]]/hl7:observation[hl7:templateId[@root = '1.2.40.0.34.6.0.11.3.24'] and hl7:templateId[@root = '2.16.840.1.113883.10.20.1.31'] and hl7:templateId[@root = '1.3.6.1.4.1.19376.1.5.3.1.4.13'] and hl7:templateId[@root = '1.3.6.1.4.1.19376.1.5.3.1.4.13.2']]/hl7:performer[hl7:templateId[@root = '1.2.40.0.34.6.0.11.9.17']]/*[not(@xsi:nil = 'true')][not(self::hl7:templateId[@root = '1.2.40.0.34.6.0.11.9.17'] | self::hl7:time | self::hl7:assignedEntity[not(@nullFlavor)])]"
         id="d42e59616-true-d5286777e0">
      <assert role="error"
              see="http://elga.art-decor.org/elgaambbef-html-20230118T144941/tmp-1.2.40.0.34.6.0.11.3.24-2021-02-19T130055.html"
              test="not(.)">(atcdabbr_entry_VitalparameterEntry)/d42e59616-true-d5286777e0: '<value-of select="name(..)"/>' ist als geschlossen definiert und dieses Element '<name/>' ist nicht erlaubt oder nicht mit diesem Inhalt erlaubt. Dies kann templateId, code oder id betreffen. Erwartet:  hl7:templateId[@root = '1.2.40.0.34.6.0.11.9.17'] | hl7:time | hl7:assignedEntity[not(@nullFlavor)] (rule-reference: d42e59616-true-d5286777e0)</assert>
   </rule>

   <!-- Checking undefined contents for template/element @isClosed="true". Match context that we did not already match -->
   <rule fpi="RUL-QQQ"
         context="*[hl7:observation[hl7:templateId[@root = '1.2.40.0.34.6.0.11.3.24'] and hl7:templateId[@root = '2.16.840.1.113883.10.20.1.31'] and hl7:templateId[@root = '1.3.6.1.4.1.19376.1.5.3.1.4.13'] and hl7:templateId[@root = '1.3.6.1.4.1.19376.1.5.3.1.4.13.2']]]/hl7:observation[hl7:templateId[@root = '1.2.40.0.34.6.0.11.3.24'] and hl7:templateId[@root = '2.16.840.1.113883.10.20.1.31'] and hl7:templateId[@root = '1.3.6.1.4.1.19376.1.5.3.1.4.13'] and hl7:templateId[@root = '1.3.6.1.4.1.19376.1.5.3.1.4.13.2']]/hl7:performer[hl7:templateId[@root = '1.2.40.0.34.6.0.11.9.17']]/hl7:assignedEntity[not(@nullFlavor)]/*[not(@xsi:nil = 'true')][not(self::hl7:id[not(@nullFlavor)] | self::hl7:id[@nullFlavor='NI'] | self::hl7:id[@nullFlavor='UNK'] | self::hl7:code | self::hl7:addr | self::hl7:telecom | self::hl7:assignedPerson | self::hl7:assignedPerson | self::hl7:representedOrganization)]"
         id="d5286638e14-true-d5286883e0">
      <assert role="error"
              see="http://elga.art-decor.org/elgaambbef-html-20230118T144941/tmp-1.2.40.0.34.6.0.11.3.24-2021-02-19T130055.html"
              test="not(.)">(atcdabbr_entry_VitalparameterEntry)/d5286638e14-true-d5286883e0: '<value-of select="name(..)"/>' ist als geschlossen definiert und dieses Element '<name/>' ist nicht erlaubt oder nicht mit diesem Inhalt erlaubt. Dies kann templateId, code oder id betreffen. Erwartet:  hl7:id[not(@nullFlavor)] | hl7:id[@nullFlavor='NI'] | hl7:id[@nullFlavor='UNK'] | hl7:code | hl7:addr | hl7:telecom | hl7:assignedPerson | hl7:assignedPerson | hl7:representedOrganization (rule-reference: d5286638e14-true-d5286883e0)</assert>
   </rule>

   <!-- Checking undefined contents for template/element @isClosed="true". Match context that we did not already match -->
   <rule fpi="RUL-QQQ"
         context="*[hl7:observation[hl7:templateId[@root = '1.2.40.0.34.6.0.11.3.24'] and hl7:templateId[@root = '2.16.840.1.113883.10.20.1.31'] and hl7:templateId[@root = '1.3.6.1.4.1.19376.1.5.3.1.4.13'] and hl7:templateId[@root = '1.3.6.1.4.1.19376.1.5.3.1.4.13.2']]]/hl7:observation[hl7:templateId[@root = '1.2.40.0.34.6.0.11.3.24'] and hl7:templateId[@root = '2.16.840.1.113883.10.20.1.31'] and hl7:templateId[@root = '1.3.6.1.4.1.19376.1.5.3.1.4.13'] and hl7:templateId[@root = '1.3.6.1.4.1.19376.1.5.3.1.4.13.2']]/hl7:performer[hl7:templateId[@root = '1.2.40.0.34.6.0.11.9.17']]/hl7:assignedEntity[not(@nullFlavor)]/hl7:addr/*[not(@xsi:nil = 'true')][not(self::hl7:streetAddressLine | self::hl7:streetName | self::hl7:houseNumber | self::hl7:postalCode | self::hl7:city | self::hl7:state | self::hl7:country | self::hl7:additionalLocator)]"
         id="d5286887e101-true-d5286956e0">
      <assert role="error"
              see="http://elga.art-decor.org/elgaambbef-html-20230118T144941/tmp-1.2.40.0.34.6.0.11.3.24-2021-02-19T130055.html"
              test="not(.)">(atcdabbr_entry_VitalparameterEntry)/d5286887e101-true-d5286956e0: '<value-of select="name(..)"/>' ist als geschlossen definiert und dieses Element '<name/>' ist nicht erlaubt oder nicht mit diesem Inhalt erlaubt. Dies kann templateId, code oder id betreffen. Erwartet:  hl7:streetAddressLine | hl7:streetName | hl7:houseNumber | hl7:postalCode | hl7:city | hl7:state | hl7:country | hl7:additionalLocator (rule-reference: d5286887e101-true-d5286956e0)</assert>
   </rule>

   <!-- Checking undefined contents for template/element @isClosed="true". Match context that we did not already match -->
   <rule fpi="RUL-QQQ"
         context="*[hl7:observation[hl7:templateId[@root = '1.2.40.0.34.6.0.11.3.24'] and hl7:templateId[@root = '2.16.840.1.113883.10.20.1.31'] and hl7:templateId[@root = '1.3.6.1.4.1.19376.1.5.3.1.4.13'] and hl7:templateId[@root = '1.3.6.1.4.1.19376.1.5.3.1.4.13.2']]]/hl7:observation[hl7:templateId[@root = '1.2.40.0.34.6.0.11.3.24'] and hl7:templateId[@root = '2.16.840.1.113883.10.20.1.31'] and hl7:templateId[@root = '1.3.6.1.4.1.19376.1.5.3.1.4.13'] and hl7:templateId[@root = '1.3.6.1.4.1.19376.1.5.3.1.4.13.2']]/hl7:performer[hl7:templateId[@root = '1.2.40.0.34.6.0.11.9.17']]/hl7:assignedEntity[not(@nullFlavor)]/hl7:assignedPerson/*[not(@xsi:nil = 'true')][not(self::hl7:name[not(@nullFlavor)])]"
         id="d5286887e174-true-d5287032e0">
      <assert role="error"
              see="http://elga.art-decor.org/elgaambbef-html-20230118T144941/tmp-1.2.40.0.34.6.0.11.9.16-2021-05-26T140421.html"
              test="not(.)">( atcdabbr_other_AssignedEntityBody)/d5286887e174-true-d5287032e0: '<value-of select="name(..)"/>' ist als geschlossen definiert und dieses Element '<name/>' ist nicht erlaubt oder nicht mit diesem Inhalt erlaubt. Dies kann templateId, code oder id betreffen. Erwartet:  hl7:name[not(@nullFlavor)] (rule-reference: d5286887e174-true-d5287032e0)</assert>
   </rule>

   <!-- Checking undefined contents for template/element @isClosed="true". Match context that we did not already match -->
   <rule fpi="RUL-QQQ"
         context="*[hl7:observation[hl7:templateId[@root = '1.2.40.0.34.6.0.11.3.24'] and hl7:templateId[@root = '2.16.840.1.113883.10.20.1.31'] and hl7:templateId[@root = '1.3.6.1.4.1.19376.1.5.3.1.4.13'] and hl7:templateId[@root = '1.3.6.1.4.1.19376.1.5.3.1.4.13.2']]]/hl7:observation[hl7:templateId[@root = '1.2.40.0.34.6.0.11.3.24'] and hl7:templateId[@root = '2.16.840.1.113883.10.20.1.31'] and hl7:templateId[@root = '1.3.6.1.4.1.19376.1.5.3.1.4.13'] and hl7:templateId[@root = '1.3.6.1.4.1.19376.1.5.3.1.4.13.2']]/hl7:performer[hl7:templateId[@root = '1.2.40.0.34.6.0.11.9.17']]/hl7:assignedEntity[not(@nullFlavor)]/hl7:assignedPerson/*[not(@xsi:nil = 'true')][not(self::hl7:name[not(@nullFlavor)])]"
         id="d5286887e186-true-d5287054e0">
      <assert role="error"
              see="http://elga.art-decor.org/elgaambbef-html-20230118T144941/tmp-1.2.40.0.34.6.0.11.9.16-2021-05-26T140421.html"
              test="not(.)">( atcdabbr_other_AssignedEntityBody)/d5286887e186-true-d5287054e0: '<value-of select="name(..)"/>' ist als geschlossen definiert und dieses Element '<name/>' ist nicht erlaubt oder nicht mit diesem Inhalt erlaubt. Dies kann templateId, code oder id betreffen. Erwartet:  hl7:name[not(@nullFlavor)] (rule-reference: d5286887e186-true-d5287054e0)</assert>
   </rule>

   <!-- Checking undefined contents for template/element @isClosed="true". Match context that we did not already match -->
   <rule fpi="RUL-QQQ"
         context="*[hl7:observation[hl7:templateId[@root = '1.2.40.0.34.6.0.11.3.24'] and hl7:templateId[@root = '2.16.840.1.113883.10.20.1.31'] and hl7:templateId[@root = '1.3.6.1.4.1.19376.1.5.3.1.4.13'] and hl7:templateId[@root = '1.3.6.1.4.1.19376.1.5.3.1.4.13.2']]]/hl7:observation[hl7:templateId[@root = '1.2.40.0.34.6.0.11.3.24'] and hl7:templateId[@root = '2.16.840.1.113883.10.20.1.31'] and hl7:templateId[@root = '1.3.6.1.4.1.19376.1.5.3.1.4.13'] and hl7:templateId[@root = '1.3.6.1.4.1.19376.1.5.3.1.4.13.2']]/hl7:performer[hl7:templateId[@root = '1.2.40.0.34.6.0.11.9.17']]/hl7:assignedEntity[not(@nullFlavor)]/hl7:assignedPerson/hl7:name[not(@nullFlavor)]/*[not(@xsi:nil = 'true')][not(self::hl7:prefix | self::hl7:family[not(@nullFlavor)] | self::hl7:given[not(@nullFlavor)] | self::hl7:suffix)]"
         id="d5287042e12-true-d5287083e0">
      <assert role="error"
              see="http://elga.art-decor.org/elgaambbef-html-20230118T144941/tmp-1.2.40.0.34.6.0.11.9.16-2021-05-26T140421.html"
              test="not(.)">( atcdabbr_other_AssignedEntityBody)/d5287042e12-true-d5287083e0: '<value-of select="name(..)"/>' ist als geschlossen definiert und dieses Element '<name/>' ist nicht erlaubt oder nicht mit diesem Inhalt erlaubt. Dies kann templateId, code oder id betreffen. Erwartet:  hl7:prefix | hl7:family[not(@nullFlavor)] | hl7:given[not(@nullFlavor)] | hl7:suffix (rule-reference: d5287042e12-true-d5287083e0)</assert>
   </rule>

   <!-- Checking undefined contents for template/element @isClosed="true". Match context that we did not already match -->
   <rule fpi="RUL-QQQ"
         context="*[hl7:observation[hl7:templateId[@root = '1.2.40.0.34.6.0.11.3.24'] and hl7:templateId[@root = '2.16.840.1.113883.10.20.1.31'] and hl7:templateId[@root = '1.3.6.1.4.1.19376.1.5.3.1.4.13'] and hl7:templateId[@root = '1.3.6.1.4.1.19376.1.5.3.1.4.13.2']]]/hl7:observation[hl7:templateId[@root = '1.2.40.0.34.6.0.11.3.24'] and hl7:templateId[@root = '2.16.840.1.113883.10.20.1.31'] and hl7:templateId[@root = '1.3.6.1.4.1.19376.1.5.3.1.4.13'] and hl7:templateId[@root = '1.3.6.1.4.1.19376.1.5.3.1.4.13.2']]/hl7:performer[hl7:templateId[@root = '1.2.40.0.34.6.0.11.9.17']]/hl7:assignedEntity[not(@nullFlavor)]/hl7:representedOrganization/*[not(@xsi:nil = 'true')][not(self::hl7:id[not(@nullFlavor)] | self::hl7:name[not(@nullFlavor)] | self::hl7:telecom[not(@nullFlavor)] | self::hl7:addr[not(@nullFlavor)])]"
         id="d5286887e198-true-d5287134e0">
      <assert role="error"
              see="http://elga.art-decor.org/elgaambbef-html-20230118T144941/tmp-1.2.40.0.34.6.0.11.3.24-2021-02-19T130055.html"
              test="not(.)">(atcdabbr_entry_VitalparameterEntry)/d5286887e198-true-d5287134e0: '<value-of select="name(..)"/>' ist als geschlossen definiert und dieses Element '<name/>' ist nicht erlaubt oder nicht mit diesem Inhalt erlaubt. Dies kann templateId, code oder id betreffen. Erwartet:  hl7:id[not(@nullFlavor)] | hl7:name[not(@nullFlavor)] | hl7:telecom[not(@nullFlavor)] | hl7:addr[not(@nullFlavor)] (rule-reference: d5286887e198-true-d5287134e0)</assert>
   </rule>

   <!-- Checking undefined contents for template/element @isClosed="true". Match context that we did not already match -->
   <rule fpi="RUL-QQQ"
         context="*[hl7:observation[hl7:templateId[@root = '1.2.40.0.34.6.0.11.3.24'] and hl7:templateId[@root = '2.16.840.1.113883.10.20.1.31'] and hl7:templateId[@root = '1.3.6.1.4.1.19376.1.5.3.1.4.13'] and hl7:templateId[@root = '1.3.6.1.4.1.19376.1.5.3.1.4.13.2']]]/hl7:observation[hl7:templateId[@root = '1.2.40.0.34.6.0.11.3.24'] and hl7:templateId[@root = '2.16.840.1.113883.10.20.1.31'] and hl7:templateId[@root = '1.3.6.1.4.1.19376.1.5.3.1.4.13'] and hl7:templateId[@root = '1.3.6.1.4.1.19376.1.5.3.1.4.13.2']]/hl7:performer[hl7:templateId[@root = '1.2.40.0.34.6.0.11.9.17']]/hl7:assignedEntity[not(@nullFlavor)]/hl7:representedOrganization/hl7:addr[not(@nullFlavor)]/*[not(@xsi:nil = 'true')][not(self::hl7:streetAddressLine | self::hl7:streetName | self::hl7:houseNumber | self::hl7:postalCode | self::hl7:city | self::hl7:state | self::hl7:country | self::hl7:additionalLocator)]"
         id="d5287108e58-true-d5287195e0">
      <assert role="error"
              see="http://elga.art-decor.org/elgaambbef-html-20230118T144941/tmp-1.2.40.0.34.6.0.11.3.24-2021-02-19T130055.html"
              test="not(.)">(atcdabbr_entry_VitalparameterEntry)/d5287108e58-true-d5287195e0: '<value-of select="name(..)"/>' ist als geschlossen definiert und dieses Element '<name/>' ist nicht erlaubt oder nicht mit diesem Inhalt erlaubt. Dies kann templateId, code oder id betreffen. Erwartet:  hl7:streetAddressLine | hl7:streetName | hl7:houseNumber | hl7:postalCode | hl7:city | hl7:state | hl7:country | hl7:additionalLocator (rule-reference: d5287108e58-true-d5287195e0)</assert>
   </rule>

   <!-- Checking undefined contents for template/element @isClosed="true". Match context that we did not already match -->
   <rule fpi="RUL-QQQ"
         context="*[hl7:observation[hl7:templateId[@root = '1.2.40.0.34.6.0.11.3.24'] and hl7:templateId[@root = '2.16.840.1.113883.10.20.1.31'] and hl7:templateId[@root = '1.3.6.1.4.1.19376.1.5.3.1.4.13'] and hl7:templateId[@root = '1.3.6.1.4.1.19376.1.5.3.1.4.13.2']]]/hl7:observation[hl7:templateId[@root = '1.2.40.0.34.6.0.11.3.24'] and hl7:templateId[@root = '2.16.840.1.113883.10.20.1.31'] and hl7:templateId[@root = '1.3.6.1.4.1.19376.1.5.3.1.4.13'] and hl7:templateId[@root = '1.3.6.1.4.1.19376.1.5.3.1.4.13.2']]/hl7:author[hl7:assignedAuthor]/*[not(@xsi:nil = 'true')][not(self::hl7:functionCode | self::hl7:time[not(@nullFlavor)] | self::hl7:time[@nullFlavor='UNK'] | self::hl7:assignedAuthor)]"
         id="d42e59618-true-d5287362e0">
      <assert role="error"
              see="http://elga.art-decor.org/elgaambbef-html-20230118T144941/tmp-1.2.40.0.34.6.0.11.3.24-2021-02-19T130055.html"
              test="not(.)">(atcdabbr_entry_VitalparameterEntry)/d42e59618-true-d5287362e0: '<value-of select="name(..)"/>' ist als geschlossen definiert und dieses Element '<name/>' ist nicht erlaubt oder nicht mit diesem Inhalt erlaubt. Dies kann templateId, code oder id betreffen. Erwartet:  hl7:functionCode | hl7:time[not(@nullFlavor)] | hl7:time[@nullFlavor='UNK'] | hl7:assignedAuthor (rule-reference: d42e59618-true-d5287362e0)</assert>
   </rule>

   <!-- Checking undefined contents for template/element @isClosed="true". Match context that we did not already match -->
   <rule fpi="RUL-QQQ"
         context="*[hl7:observation[hl7:templateId[@root = '1.2.40.0.34.6.0.11.3.24'] and hl7:templateId[@root = '2.16.840.1.113883.10.20.1.31'] and hl7:templateId[@root = '1.3.6.1.4.1.19376.1.5.3.1.4.13'] and hl7:templateId[@root = '1.3.6.1.4.1.19376.1.5.3.1.4.13.2']]]/hl7:observation[hl7:templateId[@root = '1.2.40.0.34.6.0.11.3.24'] and hl7:templateId[@root = '2.16.840.1.113883.10.20.1.31'] and hl7:templateId[@root = '1.3.6.1.4.1.19376.1.5.3.1.4.13'] and hl7:templateId[@root = '1.3.6.1.4.1.19376.1.5.3.1.4.13.2']]/hl7:author[hl7:assignedAuthor]/hl7:assignedAuthor/*[not(@xsi:nil = 'true')][not(self::hl7:id[not(@nullFlavor)] | self::hl7:id[@nullFlavor='UNK'] | self::hl7:code[not(@nullFlavor)] | self::hl7:addr[not(@nullFlavor)] | self::hl7:telecom[not(@nullFlavor)] | self::hl7:assignedPerson | self::hl7:assignedAuthoringDevice | self::hl7:representedOrganization)]"
         id="d5287240e48-true-d5287470e0">
      <assert role="error"
              see="http://elga.art-decor.org/elgaambbef-html-20230118T144941/tmp-1.2.40.0.34.6.0.11.3.24-2021-02-19T130055.html"
              test="not(.)">(atcdabbr_entry_VitalparameterEntry)/d5287240e48-true-d5287470e0: '<value-of select="name(..)"/>' ist als geschlossen definiert und dieses Element '<name/>' ist nicht erlaubt oder nicht mit diesem Inhalt erlaubt. Dies kann templateId, code oder id betreffen. Erwartet:  hl7:id[not(@nullFlavor)] | hl7:id[@nullFlavor='UNK'] | hl7:code[not(@nullFlavor)] | hl7:addr[not(@nullFlavor)] | hl7:telecom[not(@nullFlavor)] | hl7:assignedPerson | hl7:assignedAuthoringDevice | hl7:representedOrganization (rule-reference: d5287240e48-true-d5287470e0)</assert>
   </rule>

   <!-- Checking undefined contents for template/element @isClosed="true". Match context that we did not already match -->
   <rule fpi="RUL-QQQ"
         context="*[hl7:observation[hl7:templateId[@root = '1.2.40.0.34.6.0.11.3.24'] and hl7:templateId[@root = '2.16.840.1.113883.10.20.1.31'] and hl7:templateId[@root = '1.3.6.1.4.1.19376.1.5.3.1.4.13'] and hl7:templateId[@root = '1.3.6.1.4.1.19376.1.5.3.1.4.13.2']]]/hl7:observation[hl7:templateId[@root = '1.2.40.0.34.6.0.11.3.24'] and hl7:templateId[@root = '2.16.840.1.113883.10.20.1.31'] and hl7:templateId[@root = '1.3.6.1.4.1.19376.1.5.3.1.4.13'] and hl7:templateId[@root = '1.3.6.1.4.1.19376.1.5.3.1.4.13.2']]/hl7:author[hl7:assignedAuthor]/hl7:assignedAuthor/hl7:addr[not(@nullFlavor)]/*[not(@xsi:nil = 'true')][not(self::hl7:streetAddressLine | self::hl7:streetName | self::hl7:houseNumber | self::hl7:postalCode[not(@nullFlavor)] | self::hl7:city[not(@nullFlavor)] | self::hl7:state | self::hl7:country[not(@nullFlavor)] | self::hl7:additionalLocator)]"
         id="d5287240e67-true-d5287529e0">
      <assert role="error"
              see="http://elga.art-decor.org/elgaambbef-html-20230118T144941/tmp-1.2.40.0.34.6.0.11.3.24-2021-02-19T130055.html"
              test="not(.)">(atcdabbr_entry_VitalparameterEntry)/d5287240e67-true-d5287529e0: '<value-of select="name(..)"/>' ist als geschlossen definiert und dieses Element '<name/>' ist nicht erlaubt oder nicht mit diesem Inhalt erlaubt. Dies kann templateId, code oder id betreffen. Erwartet:  hl7:streetAddressLine | hl7:streetName | hl7:houseNumber | hl7:postalCode[not(@nullFlavor)] | hl7:city[not(@nullFlavor)] | hl7:state | hl7:country[not(@nullFlavor)] | hl7:additionalLocator (rule-reference: d5287240e67-true-d5287529e0)</assert>
   </rule>

   <!-- Checking undefined contents for template/element @isClosed="true". Match context that we did not already match -->
   <rule fpi="RUL-QQQ"
         context="*[hl7:observation[hl7:templateId[@root = '1.2.40.0.34.6.0.11.3.24'] and hl7:templateId[@root = '2.16.840.1.113883.10.20.1.31'] and hl7:templateId[@root = '1.3.6.1.4.1.19376.1.5.3.1.4.13'] and hl7:templateId[@root = '1.3.6.1.4.1.19376.1.5.3.1.4.13.2']]]/hl7:observation[hl7:templateId[@root = '1.2.40.0.34.6.0.11.3.24'] and hl7:templateId[@root = '2.16.840.1.113883.10.20.1.31'] and hl7:templateId[@root = '1.3.6.1.4.1.19376.1.5.3.1.4.13'] and hl7:templateId[@root = '1.3.6.1.4.1.19376.1.5.3.1.4.13.2']]/hl7:author[hl7:assignedAuthor]/hl7:assignedAuthor/hl7:assignedPerson/*[not(@xsi:nil = 'true')][not(self::hl7:name[not(@nullFlavor)] | self::hl7:name[@nullFlavor='UNK'] | self::hl7:name[@nullFlavor='MSK'])]"
         id="d5287240e110-true-d5287586e0">
      <assert role="error"
              see="http://elga.art-decor.org/elgaambbef-html-20230118T144941/tmp-1.2.40.0.34.6.0.11.3.24-2021-02-19T130055.html"
              test="not(.)">(atcdabbr_entry_VitalparameterEntry)/d5287240e110-true-d5287586e0: '<value-of select="name(..)"/>' ist als geschlossen definiert und dieses Element '<name/>' ist nicht erlaubt oder nicht mit diesem Inhalt erlaubt. Dies kann templateId, code oder id betreffen. Erwartet:  hl7:name[not(@nullFlavor)] | hl7:name[@nullFlavor='UNK'] | hl7:name[@nullFlavor='MSK'] (rule-reference: d5287240e110-true-d5287586e0)</assert>
   </rule>

   <!-- Checking undefined contents for template/element @isClosed="true". Match context that we did not already match -->
   <rule fpi="RUL-QQQ"
         context="*[hl7:observation[hl7:templateId[@root = '1.2.40.0.34.6.0.11.3.24'] and hl7:templateId[@root = '2.16.840.1.113883.10.20.1.31'] and hl7:templateId[@root = '1.3.6.1.4.1.19376.1.5.3.1.4.13'] and hl7:templateId[@root = '1.3.6.1.4.1.19376.1.5.3.1.4.13.2']]]/hl7:observation[hl7:templateId[@root = '1.2.40.0.34.6.0.11.3.24'] and hl7:templateId[@root = '2.16.840.1.113883.10.20.1.31'] and hl7:templateId[@root = '1.3.6.1.4.1.19376.1.5.3.1.4.13'] and hl7:templateId[@root = '1.3.6.1.4.1.19376.1.5.3.1.4.13.2']]/hl7:author[hl7:assignedAuthor]/hl7:assignedAuthor/hl7:assignedPerson/hl7:name[not(@nullFlavor)]/*[not(@xsi:nil = 'true')][not(self::hl7:prefix | self::hl7:family[not(@nullFlavor)] | self::hl7:given[not(@nullFlavor)] | self::hl7:suffix)]"
         id="d5287590e91-true-d5287620e0">
      <assert role="error"
              see="http://elga.art-decor.org/elgaambbef-html-20230118T144941/tmp-1.2.40.0.34.6.0.11.9.6-2021-02-19T133649.html"
              test="not(.)">(atcdabbr_other_PersonNameCompilationG2)/d5287590e91-true-d5287620e0: '<value-of select="name(..)"/>' ist als geschlossen definiert und dieses Element '<name/>' ist nicht erlaubt oder nicht mit diesem Inhalt erlaubt. Dies kann templateId, code oder id betreffen. Erwartet:  hl7:prefix | hl7:family[not(@nullFlavor)] | hl7:given[not(@nullFlavor)] | hl7:suffix (rule-reference: d5287590e91-true-d5287620e0)</assert>
   </rule>

   <!-- Checking undefined contents for template/element @isClosed="true". Match context that we did not already match -->
   <rule fpi="RUL-QQQ"
         context="*[hl7:observation[hl7:templateId[@root = '1.2.40.0.34.6.0.11.3.24'] and hl7:templateId[@root = '2.16.840.1.113883.10.20.1.31'] and hl7:templateId[@root = '1.3.6.1.4.1.19376.1.5.3.1.4.13'] and hl7:templateId[@root = '1.3.6.1.4.1.19376.1.5.3.1.4.13.2']]]/hl7:observation[hl7:templateId[@root = '1.2.40.0.34.6.0.11.3.24'] and hl7:templateId[@root = '2.16.840.1.113883.10.20.1.31'] and hl7:templateId[@root = '1.3.6.1.4.1.19376.1.5.3.1.4.13'] and hl7:templateId[@root = '1.3.6.1.4.1.19376.1.5.3.1.4.13.2']]/hl7:author[hl7:assignedAuthor]/hl7:assignedAuthor/hl7:assignedAuthoringDevice/*[not(@xsi:nil = 'true')][not(self::hl7:manufacturerModelName[not(@nullFlavor)] | self::hl7:softwareName[not(@nullFlavor)])]"
         id="d5287240e133-true-d5287668e0">
      <assert role="error"
              see="http://elga.art-decor.org/elgaambbef-html-20230118T144941/tmp-1.2.40.0.34.6.0.11.3.24-2021-02-19T130055.html"
              test="not(.)">(atcdabbr_entry_VitalparameterEntry)/d5287240e133-true-d5287668e0: '<value-of select="name(..)"/>' ist als geschlossen definiert und dieses Element '<name/>' ist nicht erlaubt oder nicht mit diesem Inhalt erlaubt. Dies kann templateId, code oder id betreffen. Erwartet:  hl7:manufacturerModelName[not(@nullFlavor)] | hl7:softwareName[not(@nullFlavor)] (rule-reference: d5287240e133-true-d5287668e0)</assert>
   </rule>

   <!-- Checking undefined contents for template/element @isClosed="true". Match context that we did not already match -->
   <rule fpi="RUL-QQQ"
         context="*[hl7:observation[hl7:templateId[@root = '1.2.40.0.34.6.0.11.3.24'] and hl7:templateId[@root = '2.16.840.1.113883.10.20.1.31'] and hl7:templateId[@root = '1.3.6.1.4.1.19376.1.5.3.1.4.13'] and hl7:templateId[@root = '1.3.6.1.4.1.19376.1.5.3.1.4.13.2']]]/hl7:observation[hl7:templateId[@root = '1.2.40.0.34.6.0.11.3.24'] and hl7:templateId[@root = '2.16.840.1.113883.10.20.1.31'] and hl7:templateId[@root = '1.3.6.1.4.1.19376.1.5.3.1.4.13'] and hl7:templateId[@root = '1.3.6.1.4.1.19376.1.5.3.1.4.13.2']]/hl7:author[hl7:assignedAuthor]/hl7:assignedAuthor/hl7:representedOrganization/*[not(@xsi:nil = 'true')][not(self::hl7:id[not(@nullFlavor)] | self::hl7:name[not(@nullFlavor)] | self::hl7:telecom[not(@nullFlavor)] | self::hl7:addr[not(@nullFlavor)])]"
         id="d5287240e149-true-d5287713e0">
      <assert role="error"
              see="http://elga.art-decor.org/elgaambbef-html-20230118T144941/tmp-1.2.40.0.34.6.0.11.3.24-2021-02-19T130055.html"
              test="not(.)">(atcdabbr_entry_VitalparameterEntry)/d5287240e149-true-d5287713e0: '<value-of select="name(..)"/>' ist als geschlossen definiert und dieses Element '<name/>' ist nicht erlaubt oder nicht mit diesem Inhalt erlaubt. Dies kann templateId, code oder id betreffen. Erwartet:  hl7:id[not(@nullFlavor)] | hl7:name[not(@nullFlavor)] | hl7:telecom[not(@nullFlavor)] | hl7:addr[not(@nullFlavor)] (rule-reference: d5287240e149-true-d5287713e0)</assert>
   </rule>

   <!-- Checking undefined contents for template/element @isClosed="true". Match context that we did not already match -->
   <rule fpi="RUL-QQQ"
         context="*[hl7:observation[hl7:templateId[@root = '1.2.40.0.34.6.0.11.3.24'] and hl7:templateId[@root = '2.16.840.1.113883.10.20.1.31'] and hl7:templateId[@root = '1.3.6.1.4.1.19376.1.5.3.1.4.13'] and hl7:templateId[@root = '1.3.6.1.4.1.19376.1.5.3.1.4.13.2']]]/hl7:observation[hl7:templateId[@root = '1.2.40.0.34.6.0.11.3.24'] and hl7:templateId[@root = '2.16.840.1.113883.10.20.1.31'] and hl7:templateId[@root = '1.3.6.1.4.1.19376.1.5.3.1.4.13'] and hl7:templateId[@root = '1.3.6.1.4.1.19376.1.5.3.1.4.13.2']]/hl7:author[hl7:assignedAuthor]/hl7:assignedAuthor/hl7:representedOrganization/hl7:addr[not(@nullFlavor)]/*[not(@xsi:nil = 'true')][not(self::hl7:streetAddressLine | self::hl7:streetName | self::hl7:houseNumber | self::hl7:postalCode[not(@nullFlavor)] | self::hl7:city[not(@nullFlavor)] | self::hl7:state | self::hl7:country[not(@nullFlavor)] | self::hl7:additionalLocator)]"
         id="d5287683e66-true-d5287776e0">
      <assert role="error"
              see="http://elga.art-decor.org/elgaambbef-html-20230118T144941/tmp-1.2.40.0.34.6.0.11.3.24-2021-02-19T130055.html"
              test="not(.)">(atcdabbr_entry_VitalparameterEntry)/d5287683e66-true-d5287776e0: '<value-of select="name(..)"/>' ist als geschlossen definiert und dieses Element '<name/>' ist nicht erlaubt oder nicht mit diesem Inhalt erlaubt. Dies kann templateId, code oder id betreffen. Erwartet:  hl7:streetAddressLine | hl7:streetName | hl7:houseNumber | hl7:postalCode[not(@nullFlavor)] | hl7:city[not(@nullFlavor)] | hl7:state | hl7:country[not(@nullFlavor)] | hl7:additionalLocator (rule-reference: d5287683e66-true-d5287776e0)</assert>
   </rule>

   <!-- Checking undefined contents for template/element @isClosed="true". Match context that we did not already match -->
   <rule fpi="RUL-QQQ"
         context="*[hl7:observation[hl7:templateId[@root = '1.2.40.0.34.6.0.11.3.24'] and hl7:templateId[@root = '2.16.840.1.113883.10.20.1.31'] and hl7:templateId[@root = '1.3.6.1.4.1.19376.1.5.3.1.4.13'] and hl7:templateId[@root = '1.3.6.1.4.1.19376.1.5.3.1.4.13.2']]]/hl7:observation[hl7:templateId[@root = '1.2.40.0.34.6.0.11.3.24'] and hl7:templateId[@root = '2.16.840.1.113883.10.20.1.31'] and hl7:templateId[@root = '1.3.6.1.4.1.19376.1.5.3.1.4.13'] and hl7:templateId[@root = '1.3.6.1.4.1.19376.1.5.3.1.4.13.2']]/hl7:informant/*[not(@xsi:nil = 'true')][not(self::hl7:assignedEntity | self::hl7:relatedEntity[@classCode = 'PRS'])]"
         id="d42e59630-true-d5287944e0">
      <assert role="error"
              see="http://elga.art-decor.org/elgaambbef-html-20230118T144941/tmp-1.2.40.0.34.6.0.11.3.24-2021-02-19T130055.html"
              test="not(.)">(atcdabbr_entry_VitalparameterEntry)/d42e59630-true-d5287944e0: '<value-of select="name(..)"/>' ist als geschlossen definiert und dieses Element '<name/>' ist nicht erlaubt oder nicht mit diesem Inhalt erlaubt. Dies kann templateId, code oder id betreffen. Erwartet:  hl7:assignedEntity | hl7:relatedEntity[@classCode = 'PRS'] (rule-reference: d42e59630-true-d5287944e0)</assert>
   </rule>

   <!-- Checking undefined contents for template/element @isClosed="true". Match context that we did not already match -->
   <rule fpi="RUL-QQQ"
         context="*[hl7:observation[hl7:templateId[@root = '1.2.40.0.34.6.0.11.3.24'] and hl7:templateId[@root = '2.16.840.1.113883.10.20.1.31'] and hl7:templateId[@root = '1.3.6.1.4.1.19376.1.5.3.1.4.13'] and hl7:templateId[@root = '1.3.6.1.4.1.19376.1.5.3.1.4.13.2']]]/hl7:observation[hl7:templateId[@root = '1.2.40.0.34.6.0.11.3.24'] and hl7:templateId[@root = '2.16.840.1.113883.10.20.1.31'] and hl7:templateId[@root = '1.3.6.1.4.1.19376.1.5.3.1.4.13'] and hl7:templateId[@root = '1.3.6.1.4.1.19376.1.5.3.1.4.13.2']]/hl7:informant/hl7:assignedEntity/*[not(@xsi:nil = 'true')][not(self::hl7:id[not(@nullFlavor)] | self::hl7:id[@nullFlavor='NI'] | self::hl7:id[@nullFlavor='UNK'] | self::hl7:code | self::hl7:addr | self::hl7:telecom | self::hl7:assignedPerson | self::hl7:assignedPerson | self::hl7:representedOrganization)]"
         id="d5287821e5-true-d5288076e0">
      <assert role="error"
              see="http://elga.art-decor.org/elgaambbef-html-20230118T144941/tmp-1.2.40.0.34.6.0.11.3.24-2021-02-19T130055.html"
              test="not(.)">(atcdabbr_entry_VitalparameterEntry)/d5287821e5-true-d5288076e0: '<value-of select="name(..)"/>' ist als geschlossen definiert und dieses Element '<name/>' ist nicht erlaubt oder nicht mit diesem Inhalt erlaubt. Dies kann templateId, code oder id betreffen. Erwartet:  hl7:id[not(@nullFlavor)] | hl7:id[@nullFlavor='NI'] | hl7:id[@nullFlavor='UNK'] | hl7:code | hl7:addr | hl7:telecom | hl7:assignedPerson | hl7:assignedPerson | hl7:representedOrganization (rule-reference: d5287821e5-true-d5288076e0)</assert>
   </rule>

   <!-- Checking undefined contents for template/element @isClosed="true". Match context that we did not already match -->
   <rule fpi="RUL-QQQ"
         context="*[hl7:observation[hl7:templateId[@root = '1.2.40.0.34.6.0.11.3.24'] and hl7:templateId[@root = '2.16.840.1.113883.10.20.1.31'] and hl7:templateId[@root = '1.3.6.1.4.1.19376.1.5.3.1.4.13'] and hl7:templateId[@root = '1.3.6.1.4.1.19376.1.5.3.1.4.13.2']]]/hl7:observation[hl7:templateId[@root = '1.2.40.0.34.6.0.11.3.24'] and hl7:templateId[@root = '2.16.840.1.113883.10.20.1.31'] and hl7:templateId[@root = '1.3.6.1.4.1.19376.1.5.3.1.4.13'] and hl7:templateId[@root = '1.3.6.1.4.1.19376.1.5.3.1.4.13.2']]/hl7:informant/hl7:assignedEntity/hl7:addr/*[not(@xsi:nil = 'true')][not(self::hl7:streetAddressLine | self::hl7:streetName | self::hl7:houseNumber | self::hl7:postalCode | self::hl7:city | self::hl7:state | self::hl7:country | self::hl7:additionalLocator)]"
         id="d5287949e50-true-d5288142e0">
      <assert role="error"
              see="http://elga.art-decor.org/elgaambbef-html-20230118T144941/tmp-1.2.40.0.34.6.0.11.3.24-2021-02-19T130055.html"
              test="not(.)">(atcdabbr_entry_VitalparameterEntry)/d5287949e50-true-d5288142e0: '<value-of select="name(..)"/>' ist als geschlossen definiert und dieses Element '<name/>' ist nicht erlaubt oder nicht mit diesem Inhalt erlaubt. Dies kann templateId, code oder id betreffen. Erwartet:  hl7:streetAddressLine | hl7:streetName | hl7:houseNumber | hl7:postalCode | hl7:city | hl7:state | hl7:country | hl7:additionalLocator (rule-reference: d5287949e50-true-d5288142e0)</assert>
   </rule>

   <!-- Checking undefined contents for template/element @isClosed="true". Match context that we did not already match -->
   <rule fpi="RUL-QQQ"
         context="*[hl7:observation[hl7:templateId[@root = '1.2.40.0.34.6.0.11.3.24'] and hl7:templateId[@root = '2.16.840.1.113883.10.20.1.31'] and hl7:templateId[@root = '1.3.6.1.4.1.19376.1.5.3.1.4.13'] and hl7:templateId[@root = '1.3.6.1.4.1.19376.1.5.3.1.4.13.2']]]/hl7:observation[hl7:templateId[@root = '1.2.40.0.34.6.0.11.3.24'] and hl7:templateId[@root = '2.16.840.1.113883.10.20.1.31'] and hl7:templateId[@root = '1.3.6.1.4.1.19376.1.5.3.1.4.13'] and hl7:templateId[@root = '1.3.6.1.4.1.19376.1.5.3.1.4.13.2']]/hl7:informant/hl7:assignedEntity/hl7:assignedPerson/*[not(@xsi:nil = 'true')][not(self::hl7:name[not(@nullFlavor)])]"
         id="d5287949e120-true-d5288204e0">
      <assert role="error"
              see="http://elga.art-decor.org/elgaambbef-html-20230118T144941/tmp-1.2.40.0.34.6.0.11.3.24-2021-02-19T130055.html"
              test="not(.)">(atcdabbr_entry_VitalparameterEntry)/d5287949e120-true-d5288204e0: '<value-of select="name(..)"/>' ist als geschlossen definiert und dieses Element '<name/>' ist nicht erlaubt oder nicht mit diesem Inhalt erlaubt. Dies kann templateId, code oder id betreffen. Erwartet:  hl7:name[not(@nullFlavor)] (rule-reference: d5287949e120-true-d5288204e0)</assert>
   </rule>

   <!-- Checking undefined contents for template/element @isClosed="true". Match context that we did not already match -->
   <rule fpi="RUL-QQQ"
         context="*[hl7:observation[hl7:templateId[@root = '1.2.40.0.34.6.0.11.3.24'] and hl7:templateId[@root = '2.16.840.1.113883.10.20.1.31'] and hl7:templateId[@root = '1.3.6.1.4.1.19376.1.5.3.1.4.13'] and hl7:templateId[@root = '1.3.6.1.4.1.19376.1.5.3.1.4.13.2']]]/hl7:observation[hl7:templateId[@root = '1.2.40.0.34.6.0.11.3.24'] and hl7:templateId[@root = '2.16.840.1.113883.10.20.1.31'] and hl7:templateId[@root = '1.3.6.1.4.1.19376.1.5.3.1.4.13'] and hl7:templateId[@root = '1.3.6.1.4.1.19376.1.5.3.1.4.13.2']]/hl7:informant/hl7:assignedEntity/hl7:assignedPerson/*[not(@xsi:nil = 'true')][not(self::hl7:name[not(@nullFlavor)])]"
         id="d5287949e132-true-d5288226e0">
      <assert role="error"
              see="http://elga.art-decor.org/elgaambbef-html-20230118T144941/tmp-1.2.40.0.34.6.0.11.3.24-2021-02-19T130055.html"
              test="not(.)">(atcdabbr_entry_VitalparameterEntry)/d5287949e132-true-d5288226e0: '<value-of select="name(..)"/>' ist als geschlossen definiert und dieses Element '<name/>' ist nicht erlaubt oder nicht mit diesem Inhalt erlaubt. Dies kann templateId, code oder id betreffen. Erwartet:  hl7:name[not(@nullFlavor)] (rule-reference: d5287949e132-true-d5288226e0)</assert>
   </rule>

   <!-- Checking undefined contents for template/element @isClosed="true". Match context that we did not already match -->
   <rule fpi="RUL-QQQ"
         context="*[hl7:observation[hl7:templateId[@root = '1.2.40.0.34.6.0.11.3.24'] and hl7:templateId[@root = '2.16.840.1.113883.10.20.1.31'] and hl7:templateId[@root = '1.3.6.1.4.1.19376.1.5.3.1.4.13'] and hl7:templateId[@root = '1.3.6.1.4.1.19376.1.5.3.1.4.13.2']]]/hl7:observation[hl7:templateId[@root = '1.2.40.0.34.6.0.11.3.24'] and hl7:templateId[@root = '2.16.840.1.113883.10.20.1.31'] and hl7:templateId[@root = '1.3.6.1.4.1.19376.1.5.3.1.4.13'] and hl7:templateId[@root = '1.3.6.1.4.1.19376.1.5.3.1.4.13.2']]/hl7:informant/hl7:assignedEntity/hl7:assignedPerson/hl7:name[not(@nullFlavor)]/*[not(@xsi:nil = 'true')][not(self::hl7:prefix | self::hl7:family[not(@nullFlavor)] | self::hl7:given[not(@nullFlavor)] | self::hl7:suffix)]"
         id="d5288214e12-true-d5288255e0">
      <assert role="error"
              see="http://elga.art-decor.org/elgaambbef-html-20230118T144941/tmp-1.2.40.0.34.6.0.11.3.24-2021-02-19T130055.html"
              test="not(.)">(atcdabbr_entry_VitalparameterEntry)/d5288214e12-true-d5288255e0: '<value-of select="name(..)"/>' ist als geschlossen definiert und dieses Element '<name/>' ist nicht erlaubt oder nicht mit diesem Inhalt erlaubt. Dies kann templateId, code oder id betreffen. Erwartet:  hl7:prefix | hl7:family[not(@nullFlavor)] | hl7:given[not(@nullFlavor)] | hl7:suffix (rule-reference: d5288214e12-true-d5288255e0)</assert>
   </rule>

   <!-- Checking undefined contents for template/element @isClosed="true". Match context that we did not already match -->
   <rule fpi="RUL-QQQ"
         context="*[hl7:observation[hl7:templateId[@root = '1.2.40.0.34.6.0.11.3.24'] and hl7:templateId[@root = '2.16.840.1.113883.10.20.1.31'] and hl7:templateId[@root = '1.3.6.1.4.1.19376.1.5.3.1.4.13'] and hl7:templateId[@root = '1.3.6.1.4.1.19376.1.5.3.1.4.13.2']]]/hl7:observation[hl7:templateId[@root = '1.2.40.0.34.6.0.11.3.24'] and hl7:templateId[@root = '2.16.840.1.113883.10.20.1.31'] and hl7:templateId[@root = '1.3.6.1.4.1.19376.1.5.3.1.4.13'] and hl7:templateId[@root = '1.3.6.1.4.1.19376.1.5.3.1.4.13.2']]/hl7:informant/hl7:assignedEntity/hl7:representedOrganization/*[not(@xsi:nil = 'true')][not(self::hl7:id[not(@nullFlavor)] | self::hl7:name[not(@nullFlavor)] | self::hl7:telecom[not(@nullFlavor)] | self::hl7:addr[not(@nullFlavor)])]"
         id="d5287949e143-true-d5288306e0">
      <assert role="error"
              see="http://elga.art-decor.org/elgaambbef-html-20230118T144941/tmp-1.2.40.0.34.6.0.11.3.24-2021-02-19T130055.html"
              test="not(.)">(atcdabbr_entry_VitalparameterEntry)/d5287949e143-true-d5288306e0: '<value-of select="name(..)"/>' ist als geschlossen definiert und dieses Element '<name/>' ist nicht erlaubt oder nicht mit diesem Inhalt erlaubt. Dies kann templateId, code oder id betreffen. Erwartet:  hl7:id[not(@nullFlavor)] | hl7:name[not(@nullFlavor)] | hl7:telecom[not(@nullFlavor)] | hl7:addr[not(@nullFlavor)] (rule-reference: d5287949e143-true-d5288306e0)</assert>
   </rule>

   <!-- Checking undefined contents for template/element @isClosed="true". Match context that we did not already match -->
   <rule fpi="RUL-QQQ"
         context="*[hl7:observation[hl7:templateId[@root = '1.2.40.0.34.6.0.11.3.24'] and hl7:templateId[@root = '2.16.840.1.113883.10.20.1.31'] and hl7:templateId[@root = '1.3.6.1.4.1.19376.1.5.3.1.4.13'] and hl7:templateId[@root = '1.3.6.1.4.1.19376.1.5.3.1.4.13.2']]]/hl7:observation[hl7:templateId[@root = '1.2.40.0.34.6.0.11.3.24'] and hl7:templateId[@root = '2.16.840.1.113883.10.20.1.31'] and hl7:templateId[@root = '1.3.6.1.4.1.19376.1.5.3.1.4.13'] and hl7:templateId[@root = '1.3.6.1.4.1.19376.1.5.3.1.4.13.2']]/hl7:informant/hl7:assignedEntity/hl7:representedOrganization/hl7:addr[not(@nullFlavor)]/*[not(@xsi:nil = 'true')][not(self::hl7:streetAddressLine | self::hl7:streetName | self::hl7:houseNumber | self::hl7:postalCode | self::hl7:city | self::hl7:state | self::hl7:country | self::hl7:additionalLocator)]"
         id="d5288280e58-true-d5288367e0">
      <assert role="error"
              see="http://elga.art-decor.org/elgaambbef-html-20230118T144941/tmp-1.2.40.0.34.6.0.11.3.24-2021-02-19T130055.html"
              test="not(.)">(atcdabbr_entry_VitalparameterEntry)/d5288280e58-true-d5288367e0: '<value-of select="name(..)"/>' ist als geschlossen definiert und dieses Element '<name/>' ist nicht erlaubt oder nicht mit diesem Inhalt erlaubt. Dies kann templateId, code oder id betreffen. Erwartet:  hl7:streetAddressLine | hl7:streetName | hl7:houseNumber | hl7:postalCode | hl7:city | hl7:state | hl7:country | hl7:additionalLocator (rule-reference: d5288280e58-true-d5288367e0)</assert>
   </rule>

   <!-- Checking undefined contents for template/element @isClosed="true". Match context that we did not already match -->
   <rule fpi="RUL-QQQ"
         context="*[hl7:observation[hl7:templateId[@root = '1.2.40.0.34.6.0.11.3.24'] and hl7:templateId[@root = '2.16.840.1.113883.10.20.1.31'] and hl7:templateId[@root = '1.3.6.1.4.1.19376.1.5.3.1.4.13'] and hl7:templateId[@root = '1.3.6.1.4.1.19376.1.5.3.1.4.13.2']]]/hl7:observation[hl7:templateId[@root = '1.2.40.0.34.6.0.11.3.24'] and hl7:templateId[@root = '2.16.840.1.113883.10.20.1.31'] and hl7:templateId[@root = '1.3.6.1.4.1.19376.1.5.3.1.4.13'] and hl7:templateId[@root = '1.3.6.1.4.1.19376.1.5.3.1.4.13.2']]/hl7:informant/hl7:relatedEntity[@classCode = 'PRS']/*[not(@xsi:nil = 'true')][not(self::hl7:code[not(@nullFlavor)] | self::hl7:addr[not(@nullFlavor)] | self::hl7:telecom[not(@nullFlavor)] | self::hl7:relatedPerson)]"
         id="d5287821e7-true-d5288444e0">
      <assert role="error"
              see="http://elga.art-decor.org/elgaambbef-html-20230118T144941/tmp-1.2.40.0.34.6.0.11.3.24-2021-02-19T130055.html"
              test="not(.)">(atcdabbr_entry_VitalparameterEntry)/d5287821e7-true-d5288444e0: '<value-of select="name(..)"/>' ist als geschlossen definiert und dieses Element '<name/>' ist nicht erlaubt oder nicht mit diesem Inhalt erlaubt. Dies kann templateId, code oder id betreffen. Erwartet:  hl7:code[not(@nullFlavor)] | hl7:addr[not(@nullFlavor)] | hl7:telecom[not(@nullFlavor)] | hl7:relatedPerson (rule-reference: d5287821e7-true-d5288444e0)</assert>
   </rule>

   <!-- Checking undefined contents for template/element @isClosed="true". Match context that we did not already match -->
   <rule fpi="RUL-QQQ"
         context="*[hl7:observation[hl7:templateId[@root = '1.2.40.0.34.6.0.11.3.24'] and hl7:templateId[@root = '2.16.840.1.113883.10.20.1.31'] and hl7:templateId[@root = '1.3.6.1.4.1.19376.1.5.3.1.4.13'] and hl7:templateId[@root = '1.3.6.1.4.1.19376.1.5.3.1.4.13.2']]]/hl7:observation[hl7:templateId[@root = '1.2.40.0.34.6.0.11.3.24'] and hl7:templateId[@root = '2.16.840.1.113883.10.20.1.31'] and hl7:templateId[@root = '1.3.6.1.4.1.19376.1.5.3.1.4.13'] and hl7:templateId[@root = '1.3.6.1.4.1.19376.1.5.3.1.4.13.2']]/hl7:informant/hl7:relatedEntity[@classCode = 'PRS']/hl7:addr[not(@nullFlavor)]/*[not(@xsi:nil = 'true')][not(self::hl7:streetAddressLine | self::hl7:streetName | self::hl7:houseNumber | self::hl7:postalCode | self::hl7:city | self::hl7:state | self::hl7:country | self::hl7:additionalLocator)]"
         id="d5287821e16-true-d5288497e0">
      <assert role="error"
              see="http://elga.art-decor.org/elgaambbef-html-20230118T144941/tmp-1.2.40.0.34.6.0.11.3.24-2021-02-19T130055.html"
              test="not(.)">(atcdabbr_entry_VitalparameterEntry)/d5287821e16-true-d5288497e0: '<value-of select="name(..)"/>' ist als geschlossen definiert und dieses Element '<name/>' ist nicht erlaubt oder nicht mit diesem Inhalt erlaubt. Dies kann templateId, code oder id betreffen. Erwartet:  hl7:streetAddressLine | hl7:streetName | hl7:houseNumber | hl7:postalCode | hl7:city | hl7:state | hl7:country | hl7:additionalLocator (rule-reference: d5287821e16-true-d5288497e0)</assert>
   </rule>

   <!-- Checking undefined contents for template/element @isClosed="true". Match context that we did not already match -->
   <rule fpi="RUL-QQQ"
         context="*[hl7:observation[hl7:templateId[@root = '1.2.40.0.34.6.0.11.3.24'] and hl7:templateId[@root = '2.16.840.1.113883.10.20.1.31'] and hl7:templateId[@root = '1.3.6.1.4.1.19376.1.5.3.1.4.13'] and hl7:templateId[@root = '1.3.6.1.4.1.19376.1.5.3.1.4.13.2']]]/hl7:observation[hl7:templateId[@root = '1.2.40.0.34.6.0.11.3.24'] and hl7:templateId[@root = '2.16.840.1.113883.10.20.1.31'] and hl7:templateId[@root = '1.3.6.1.4.1.19376.1.5.3.1.4.13'] and hl7:templateId[@root = '1.3.6.1.4.1.19376.1.5.3.1.4.13.2']]/hl7:informant/hl7:relatedEntity[@classCode = 'PRS']/hl7:relatedPerson/*[not(@xsi:nil = 'true')][not(self::hl7:name[not(@nullFlavor)] | self::hl7:name[@nullFlavor='UNK'] | self::hl7:name[@nullFlavor='MSK'])]"
         id="d5287821e20-true-d5288552e0">
      <assert role="error"
              see="http://elga.art-decor.org/elgaambbef-html-20230118T144941/tmp-1.2.40.0.34.6.0.11.3.24-2021-02-19T130055.html"
              test="not(.)">(atcdabbr_entry_VitalparameterEntry)/d5287821e20-true-d5288552e0: '<value-of select="name(..)"/>' ist als geschlossen definiert und dieses Element '<name/>' ist nicht erlaubt oder nicht mit diesem Inhalt erlaubt. Dies kann templateId, code oder id betreffen. Erwartet:  hl7:name[not(@nullFlavor)] | hl7:name[@nullFlavor='UNK'] | hl7:name[@nullFlavor='MSK'] (rule-reference: d5287821e20-true-d5288552e0)</assert>
   </rule>

   <!-- Checking undefined contents for template/element @isClosed="true". Match context that we did not already match -->
   <rule fpi="RUL-QQQ"
         context="*[hl7:observation[hl7:templateId[@root = '1.2.40.0.34.6.0.11.3.24'] and hl7:templateId[@root = '2.16.840.1.113883.10.20.1.31'] and hl7:templateId[@root = '1.3.6.1.4.1.19376.1.5.3.1.4.13'] and hl7:templateId[@root = '1.3.6.1.4.1.19376.1.5.3.1.4.13.2']]]/hl7:observation[hl7:templateId[@root = '1.2.40.0.34.6.0.11.3.24'] and hl7:templateId[@root = '2.16.840.1.113883.10.20.1.31'] and hl7:templateId[@root = '1.3.6.1.4.1.19376.1.5.3.1.4.13'] and hl7:templateId[@root = '1.3.6.1.4.1.19376.1.5.3.1.4.13.2']]/hl7:informant/hl7:relatedEntity[@classCode = 'PRS']/hl7:relatedPerson/hl7:name[not(@nullFlavor)]/*[not(@xsi:nil = 'true')][not(self::hl7:prefix | self::hl7:family[not(@nullFlavor)] | self::hl7:given[not(@nullFlavor)] | self::hl7:suffix)]"
         id="d5288545e11-true-d5288579e0">
      <assert role="error"
              see="http://elga.art-decor.org/elgaambbef-html-20230118T144941/tmp-1.2.40.0.34.6.0.11.3.24-2021-02-19T130055.html"
              test="not(.)">(atcdabbr_entry_VitalparameterEntry)/d5288545e11-true-d5288579e0: '<value-of select="name(..)"/>' ist als geschlossen definiert und dieses Element '<name/>' ist nicht erlaubt oder nicht mit diesem Inhalt erlaubt. Dies kann templateId, code oder id betreffen. Erwartet:  hl7:prefix | hl7:family[not(@nullFlavor)] | hl7:given[not(@nullFlavor)] | hl7:suffix (rule-reference: d5288545e11-true-d5288579e0)</assert>
   </rule>

   <!-- Checking undefined contents for template/element @isClosed="true". Match context that we did not already match -->
   <rule fpi="RUL-QQQ"
         context="*[hl7:observation[hl7:templateId[@root = '1.2.40.0.34.6.0.11.3.24'] and hl7:templateId[@root = '2.16.840.1.113883.10.20.1.31'] and hl7:templateId[@root = '1.3.6.1.4.1.19376.1.5.3.1.4.13'] and hl7:templateId[@root = '1.3.6.1.4.1.19376.1.5.3.1.4.13.2']]]/hl7:observation[hl7:templateId[@root = '1.2.40.0.34.6.0.11.3.24'] and hl7:templateId[@root = '2.16.840.1.113883.10.20.1.31'] and hl7:templateId[@root = '1.3.6.1.4.1.19376.1.5.3.1.4.13'] and hl7:templateId[@root = '1.3.6.1.4.1.19376.1.5.3.1.4.13.2']]/hl7:participant[@typeCode][hl7:participantRole]/*[not(@xsi:nil = 'true')][not(self::hl7:time | self::hl7:awarenessCode[concat(@code, @codeSystem) = doc('include/voc-2.16.840.1.113883.1.11.10310-DYNAMIC.xml')//valueSet[1]/conceptList/concept/concat(@code, @codeSystem) or @nullFlavor] | self::hl7:participantRole)]"
         id="d42e59632-true-d5288707e0">
      <assert role="error"
              see="http://elga.art-decor.org/elgaambbef-html-20230118T144941/tmp-1.2.40.0.34.6.0.11.3.24-2021-02-19T130055.html"
              test="not(.)">(atcdabbr_entry_VitalparameterEntry)/d42e59632-true-d5288707e0: '<value-of select="name(..)"/>' ist als geschlossen definiert und dieses Element '<name/>' ist nicht erlaubt oder nicht mit diesem Inhalt erlaubt. Dies kann templateId, code oder id betreffen. Erwartet:  hl7:time | hl7:awarenessCode[concat(@code, @codeSystem) = doc('include/voc-2.16.840.1.113883.1.11.10310-DYNAMIC.xml')//valueSet[1]/conceptList/concept/concat(@code, @codeSystem) or @nullFlavor] | hl7:participantRole (rule-reference: d42e59632-true-d5288707e0)</assert>
   </rule>

   <!-- Checking undefined contents for template/element @isClosed="true". Match context that we did not already match -->
   <rule fpi="RUL-QQQ"
         context="*[hl7:observation[hl7:templateId[@root = '1.2.40.0.34.6.0.11.3.24'] and hl7:templateId[@root = '2.16.840.1.113883.10.20.1.31'] and hl7:templateId[@root = '1.3.6.1.4.1.19376.1.5.3.1.4.13'] and hl7:templateId[@root = '1.3.6.1.4.1.19376.1.5.3.1.4.13.2']]]/hl7:observation[hl7:templateId[@root = '1.2.40.0.34.6.0.11.3.24'] and hl7:templateId[@root = '2.16.840.1.113883.10.20.1.31'] and hl7:templateId[@root = '1.3.6.1.4.1.19376.1.5.3.1.4.13'] and hl7:templateId[@root = '1.3.6.1.4.1.19376.1.5.3.1.4.13.2']]/hl7:participant[@typeCode][hl7:participantRole]/hl7:participantRole/*[not(@xsi:nil = 'true')][not(self::hl7:id | self::hl7:code | self::hl7:addr | self::hl7:telecom | self::hl7:playingDevice | self::hl7:playingEntity | self::hl7:scopingEntity)]"
         id="d5288610e11-true-d5288815e0">
      <assert role="error"
              see="http://elga.art-decor.org/elgaambbef-html-20230118T144941/tmp-1.2.40.0.34.6.0.11.3.24-2021-02-19T130055.html"
              test="not(.)">(atcdabbr_entry_VitalparameterEntry)/d5288610e11-true-d5288815e0: '<value-of select="name(..)"/>' ist als geschlossen definiert und dieses Element '<name/>' ist nicht erlaubt oder nicht mit diesem Inhalt erlaubt. Dies kann templateId, code oder id betreffen. Erwartet:  hl7:id | hl7:code | hl7:addr | hl7:telecom | hl7:playingDevice | hl7:playingEntity | hl7:scopingEntity (rule-reference: d5288610e11-true-d5288815e0)</assert>
   </rule>

   <!-- Checking undefined contents for template/element @isClosed="true". Match context that we did not already match -->
   <rule fpi="RUL-QQQ"
         context="*[hl7:observation[hl7:templateId[@root = '1.2.40.0.34.6.0.11.3.24'] and hl7:templateId[@root = '2.16.840.1.113883.10.20.1.31'] and hl7:templateId[@root = '1.3.6.1.4.1.19376.1.5.3.1.4.13'] and hl7:templateId[@root = '1.3.6.1.4.1.19376.1.5.3.1.4.13.2']]]/hl7:observation[hl7:templateId[@root = '1.2.40.0.34.6.0.11.3.24'] and hl7:templateId[@root = '2.16.840.1.113883.10.20.1.31'] and hl7:templateId[@root = '1.3.6.1.4.1.19376.1.5.3.1.4.13'] and hl7:templateId[@root = '1.3.6.1.4.1.19376.1.5.3.1.4.13.2']]/hl7:participant[@typeCode][hl7:participantRole]/hl7:participantRole/hl7:addr/*[not(@xsi:nil = 'true')][not(self::hl7:streetAddressLine | self::hl7:streetName | self::hl7:houseNumber | self::hl7:postalCode[not(@nullFlavor)] | self::hl7:city[not(@nullFlavor)] | self::hl7:state | self::hl7:country[not(@nullFlavor)] | self::hl7:additionalLocator)]"
         id="d5288610e22-true-d5288877e0">
      <assert role="error"
              see="http://elga.art-decor.org/elgaambbef-html-20230118T144941/tmp-1.2.40.0.34.6.0.11.3.24-2021-02-19T130055.html"
              test="not(.)">(atcdabbr_entry_VitalparameterEntry)/d5288610e22-true-d5288877e0: '<value-of select="name(..)"/>' ist als geschlossen definiert und dieses Element '<name/>' ist nicht erlaubt oder nicht mit diesem Inhalt erlaubt. Dies kann templateId, code oder id betreffen. Erwartet:  hl7:streetAddressLine | hl7:streetName | hl7:houseNumber | hl7:postalCode[not(@nullFlavor)] | hl7:city[not(@nullFlavor)] | hl7:state | hl7:country[not(@nullFlavor)] | hl7:additionalLocator (rule-reference: d5288610e22-true-d5288877e0)</assert>
   </rule>

   <!-- Checking undefined contents for template/element @isClosed="true". Match context that we did not already match -->
   <rule fpi="RUL-QQQ"
         context="*[hl7:observation[hl7:templateId[@root = '1.2.40.0.34.6.0.11.3.24'] and hl7:templateId[@root = '2.16.840.1.113883.10.20.1.31'] and hl7:templateId[@root = '1.3.6.1.4.1.19376.1.5.3.1.4.13'] and hl7:templateId[@root = '1.3.6.1.4.1.19376.1.5.3.1.4.13.2']]]/hl7:observation[hl7:templateId[@root = '1.2.40.0.34.6.0.11.3.24'] and hl7:templateId[@root = '2.16.840.1.113883.10.20.1.31'] and hl7:templateId[@root = '1.3.6.1.4.1.19376.1.5.3.1.4.13'] and hl7:templateId[@root = '1.3.6.1.4.1.19376.1.5.3.1.4.13.2']]/hl7:participant[@typeCode][hl7:participantRole]/hl7:participantRole/hl7:playingDevice/*[not(@xsi:nil = 'true')][not(self::hl7:code[@codeSystem = doc('include/voc-2.16.840.1.113883.1.11.16040-DYNAMIC.xml')//valueSet[1]/completeCodeSystem/@codeSystem or concat(@code, @codeSystem) = doc('include/voc-2.16.840.1.113883.1.11.16040-DYNAMIC.xml')//valueSet[1]/conceptList/concept/concat(@code, @codeSystem) or @nullFlavor] | self::hl7:manufacturerModelName | self::hl7:softwareName)]"
         id="d5288610e78-true-d5288955e0">
      <assert role="error"
              see="http://elga.art-decor.org/elgaambbef-html-20230118T144941/tmp-1.2.40.0.34.6.0.11.3.24-2021-02-19T130055.html"
              test="not(.)">(atcdabbr_entry_VitalparameterEntry)/d5288610e78-true-d5288955e0: '<value-of select="name(..)"/>' ist als geschlossen definiert und dieses Element '<name/>' ist nicht erlaubt oder nicht mit diesem Inhalt erlaubt. Dies kann templateId, code oder id betreffen. Erwartet:  hl7:code[@codeSystem = doc('include/voc-2.16.840.1.113883.1.11.16040-DYNAMIC.xml')//valueSet[1]/completeCodeSystem/@codeSystem or concat(@code, @codeSystem) = doc('include/voc-2.16.840.1.113883.1.11.16040-DYNAMIC.xml')//valueSet[1]/conceptList/concept/concat(@code, @codeSystem) or @nullFlavor] | hl7:manufacturerModelName | hl7:softwareName (rule-reference: d5288610e78-true-d5288955e0)</assert>
   </rule>

   <!-- Checking undefined contents for template/element @isClosed="true". Match context that we did not already match -->
   <rule fpi="RUL-QQQ"
         context="*[hl7:observation[hl7:templateId[@root = '1.2.40.0.34.6.0.11.3.24'] and hl7:templateId[@root = '2.16.840.1.113883.10.20.1.31'] and hl7:templateId[@root = '1.3.6.1.4.1.19376.1.5.3.1.4.13'] and hl7:templateId[@root = '1.3.6.1.4.1.19376.1.5.3.1.4.13.2']]]/hl7:observation[hl7:templateId[@root = '1.2.40.0.34.6.0.11.3.24'] and hl7:templateId[@root = '2.16.840.1.113883.10.20.1.31'] and hl7:templateId[@root = '1.3.6.1.4.1.19376.1.5.3.1.4.13'] and hl7:templateId[@root = '1.3.6.1.4.1.19376.1.5.3.1.4.13.2']]/hl7:participant[@typeCode][hl7:participantRole]/hl7:participantRole/hl7:playingEntity/*[not(@xsi:nil = 'true')][not(self::hl7:code[@codeSystem = doc('include/voc-2.16.840.1.113883.1.11.16040-DYNAMIC.xml')//valueSet[1]/completeCodeSystem/@codeSystem or concat(@code, @codeSystem) = doc('include/voc-2.16.840.1.113883.1.11.16040-DYNAMIC.xml')//valueSet[1]/conceptList/concept/concat(@code, @codeSystem) or @nullFlavor] | self::hl7:quantity | self::hl7:name | self::sdtc:birthTime | self::hl7:desc)]"
         id="d5288610e80-true-d5289016e0">
      <assert role="error"
              see="http://elga.art-decor.org/elgaambbef-html-20230118T144941/tmp-1.2.40.0.34.6.0.11.3.24-2021-02-19T130055.html"
              test="not(.)">(atcdabbr_entry_VitalparameterEntry)/d5288610e80-true-d5289016e0: '<value-of select="name(..)"/>' ist als geschlossen definiert und dieses Element '<name/>' ist nicht erlaubt oder nicht mit diesem Inhalt erlaubt. Dies kann templateId, code oder id betreffen. Erwartet:  hl7:code[@codeSystem = doc('include/voc-2.16.840.1.113883.1.11.16040-DYNAMIC.xml')//valueSet[1]/completeCodeSystem/@codeSystem or concat(@code, @codeSystem) = doc('include/voc-2.16.840.1.113883.1.11.16040-DYNAMIC.xml')//valueSet[1]/conceptList/concept/concat(@code, @codeSystem) or @nullFlavor] | hl7:quantity | hl7:name | sdtc:birthTime | hl7:desc (rule-reference: d5288610e80-true-d5289016e0)</assert>
   </rule>

   <!-- Checking undefined contents for template/element @isClosed="true". Match context that we did not already match -->
   <rule fpi="RUL-QQQ"
         context="*[hl7:observation[hl7:templateId[@root = '1.2.40.0.34.6.0.11.3.24'] and hl7:templateId[@root = '2.16.840.1.113883.10.20.1.31'] and hl7:templateId[@root = '1.3.6.1.4.1.19376.1.5.3.1.4.13'] and hl7:templateId[@root = '1.3.6.1.4.1.19376.1.5.3.1.4.13.2']]]/hl7:observation[hl7:templateId[@root = '1.2.40.0.34.6.0.11.3.24'] and hl7:templateId[@root = '2.16.840.1.113883.10.20.1.31'] and hl7:templateId[@root = '1.3.6.1.4.1.19376.1.5.3.1.4.13'] and hl7:templateId[@root = '1.3.6.1.4.1.19376.1.5.3.1.4.13.2']]/hl7:participant[@typeCode][hl7:participantRole]/hl7:participantRole/hl7:scopingEntity/*[not(@xsi:nil = 'true')][not(self::hl7:id | self::hl7:code[@codeSystem = doc('include/voc-2.16.840.1.113883.1.11.16040-DYNAMIC.xml')//valueSet[1]/completeCodeSystem/@codeSystem or concat(@code, @codeSystem) = doc('include/voc-2.16.840.1.113883.1.11.16040-DYNAMIC.xml')//valueSet[1]/conceptList/concept/concat(@code, @codeSystem) or @nullFlavor] | self::hl7:desc)]"
         id="d5288610e83-true-d5289074e0">
      <assert role="error"
              see="http://elga.art-decor.org/elgaambbef-html-20230118T144941/tmp-1.2.40.0.34.6.0.11.3.24-2021-02-19T130055.html"
              test="not(.)">(atcdabbr_entry_VitalparameterEntry)/d5288610e83-true-d5289074e0: '<value-of select="name(..)"/>' ist als geschlossen definiert und dieses Element '<name/>' ist nicht erlaubt oder nicht mit diesem Inhalt erlaubt. Dies kann templateId, code oder id betreffen. Erwartet:  hl7:id | hl7:code[@codeSystem = doc('include/voc-2.16.840.1.113883.1.11.16040-DYNAMIC.xml')//valueSet[1]/completeCodeSystem/@codeSystem or concat(@code, @codeSystem) = doc('include/voc-2.16.840.1.113883.1.11.16040-DYNAMIC.xml')//valueSet[1]/conceptList/concept/concat(@code, @codeSystem) or @nullFlavor] | hl7:desc (rule-reference: d5288610e83-true-d5289074e0)</assert>
   </rule>
</pattern>
