<?xml version="1.0" encoding="UTF-8"?>
<!--
Template derived pattern
===========================================
ID: 1.2.40.0.34.6.0.11.3.99
Name: EMS Problem Entry
Description: Dieses Element enthält Angaben zur klinischen Manifestation für die Arztmeldung ins EMS
-->
<pattern xmlns="http://purl.oclc.org/dsdl/schematron"
         id="template-1.2.40.0.34.6.0.11.3.99-2020-05-12T163717">
   <title>EMS Problem Entry</title>
   <!--
Template derived rules for ID: 1.2.40.0.34.6.0.11.3.99
Context: *[hl7:observation[hl7:templateId[@root = '1.2.40.0.34.6.0.11.3.99'] and hl7:templateId[@root = '1.2.40.0.34.6.0.11.3.6'] and hl7:templateId[@root = '2.16.840.1.113883.10.20.1.28'] and hl7:templateId[@root = '1.3.6.1.4.1.19376.1.5.3.1.4.5']]]
Item: (epims_entry_Problem)
-->

   <!--
Template derived rules for ID: 1.2.40.0.34.6.0.11.3.99
Context: *[hl7:observation[hl7:templateId[@root = '1.2.40.0.34.6.0.11.3.99'] and hl7:templateId[@root = '1.2.40.0.34.6.0.11.3.6'] and hl7:templateId[@root = '2.16.840.1.113883.10.20.1.28'] and hl7:templateId[@root = '1.3.6.1.4.1.19376.1.5.3.1.4.5']]]/hl7:observation[hl7:templateId[@root = '1.2.40.0.34.6.0.11.3.99'] and hl7:templateId[@root = '1.2.40.0.34.6.0.11.3.6'] and hl7:templateId[@root = '2.16.840.1.113883.10.20.1.28'] and hl7:templateId[@root = '1.3.6.1.4.1.19376.1.5.3.1.4.5']]
Item: (epims_entry_Problem)
-->

   <rule fpi="RULC-1"
         context="*[hl7:observation[hl7:templateId[@root = '1.2.40.0.34.6.0.11.3.99'] and hl7:templateId[@root = '1.2.40.0.34.6.0.11.3.6'] and hl7:templateId[@root = '2.16.840.1.113883.10.20.1.28'] and hl7:templateId[@root = '1.3.6.1.4.1.19376.1.5.3.1.4.5']]]/hl7:observation[hl7:templateId[@root = '1.2.40.0.34.6.0.11.3.99'] and hl7:templateId[@root = '1.2.40.0.34.6.0.11.3.6'] and hl7:templateId[@root = '2.16.840.1.113883.10.20.1.28'] and hl7:templateId[@root = '1.3.6.1.4.1.19376.1.5.3.1.4.5']]"
         id="d42e23778-false-d298596e0">
      <assert role="error"
              see="https://elga.art-decor.org/epims-html-20250116T123132/tmp-1.2.40.0.34.6.0.11.3.99-2020-05-12T163717.html"
              test="string(@classCode) = ('OBS')">(epims_entry_Problem): Der Wert von classCode MUSS 'OBS' sein. Gefunden: "<value-of select="@classCode"/>"</assert>
      <assert role="error"
              see="https://elga.art-decor.org/epims-html-20250116T123132/tmp-1.2.40.0.34.6.0.11.3.99-2020-05-12T163717.html"
              test="string(@moodCode) = ('EVN')">(epims_entry_Problem): Der Wert von moodCode MUSS 'EVN' sein. Gefunden: "<value-of select="@moodCode"/>"</assert>
      <assert role="error"
              see="https://elga.art-decor.org/epims-html-20250116T123132/tmp-1.2.40.0.34.6.0.11.3.99-2020-05-12T163717.html"
              test="@negationInd">(epims_entry_Problem): Attribut @negationInd MUSS vorkommen.</assert>
      <assert role="error"
              see="https://elga.art-decor.org/epims-html-20250116T123132/tmp-1.2.40.0.34.6.0.11.3.99-2020-05-12T163717.html"
              test="not(@negationInd) or string(@negationInd)=('true','false')">(epims_entry_Problem): Attribute @negationInd MUSS vom Datentyp 'bl' sein  - '<value-of select="@negationInd"/>'</assert>
      <assert role="error"
              see="https://elga.art-decor.org/epims-html-20250116T123132/tmp-1.2.40.0.34.6.0.11.3.99-2020-05-12T163717.html"
              test="count(hl7:templateId[@root = '1.2.40.0.34.6.0.11.3.99']) &gt;= 1">(epims_entry_Problem): Element hl7:templateId[@root = '1.2.40.0.34.6.0.11.3.99'] ist mandatory [min 1x].</assert>
      <assert role="error"
              see="https://elga.art-decor.org/epims-html-20250116T123132/tmp-1.2.40.0.34.6.0.11.3.99-2020-05-12T163717.html"
              test="count(hl7:templateId[@root = '1.2.40.0.34.6.0.11.3.99']) &lt;= 1">(epims_entry_Problem): Element hl7:templateId[@root = '1.2.40.0.34.6.0.11.3.99'] kommt zu häufig vor [max 1x].</assert>
      <assert role="error"
              see="https://elga.art-decor.org/epims-html-20250116T123132/tmp-1.2.40.0.34.6.0.11.3.99-2020-05-12T163717.html"
              test="count(hl7:templateId[@root = '1.2.40.0.34.6.0.11.3.6']) &gt;= 1">(epims_entry_Problem): Element hl7:templateId[@root = '1.2.40.0.34.6.0.11.3.6'] ist mandatory [min 1x].</assert>
      <assert role="error"
              see="https://elga.art-decor.org/epims-html-20250116T123132/tmp-1.2.40.0.34.6.0.11.3.99-2020-05-12T163717.html"
              test="count(hl7:templateId[@root = '1.2.40.0.34.6.0.11.3.6']) &lt;= 1">(epims_entry_Problem): Element hl7:templateId[@root = '1.2.40.0.34.6.0.11.3.6'] kommt zu häufig vor [max 1x].</assert>
      <assert role="error"
              see="https://elga.art-decor.org/epims-html-20250116T123132/tmp-1.2.40.0.34.6.0.11.3.99-2020-05-12T163717.html"
              test="count(hl7:templateId[@root = '2.16.840.1.113883.10.20.1.28']) &gt;= 1">(epims_entry_Problem): Element hl7:templateId[@root = '2.16.840.1.113883.10.20.1.28'] ist mandatory [min 1x].</assert>
      <assert role="error"
              see="https://elga.art-decor.org/epims-html-20250116T123132/tmp-1.2.40.0.34.6.0.11.3.99-2020-05-12T163717.html"
              test="count(hl7:templateId[@root = '2.16.840.1.113883.10.20.1.28']) &lt;= 1">(epims_entry_Problem): Element hl7:templateId[@root = '2.16.840.1.113883.10.20.1.28'] kommt zu häufig vor [max 1x].</assert>
      <assert role="error"
              see="https://elga.art-decor.org/epims-html-20250116T123132/tmp-1.2.40.0.34.6.0.11.3.99-2020-05-12T163717.html"
              test="count(hl7:templateId[@root = '1.3.6.1.4.1.19376.1.5.3.1.4.5']) &gt;= 1">(epims_entry_Problem): Element hl7:templateId[@root = '1.3.6.1.4.1.19376.1.5.3.1.4.5'] ist mandatory [min 1x].</assert>
      <assert role="error"
              see="https://elga.art-decor.org/epims-html-20250116T123132/tmp-1.2.40.0.34.6.0.11.3.99-2020-05-12T163717.html"
              test="count(hl7:templateId[@root = '1.3.6.1.4.1.19376.1.5.3.1.4.5']) &lt;= 1">(epims_entry_Problem): Element hl7:templateId[@root = '1.3.6.1.4.1.19376.1.5.3.1.4.5'] kommt zu häufig vor [max 1x].</assert>
      <assert role="error"
              see="https://elga.art-decor.org/epims-html-20250116T123132/tmp-1.2.40.0.34.6.0.11.3.99-2020-05-12T163717.html"
              test="count(hl7:id) &gt;= 1">(epims_entry_Problem): Element hl7:id ist required [min 1x].</assert>
      <assert role="error"
              see="https://elga.art-decor.org/epims-html-20250116T123132/tmp-1.2.40.0.34.6.0.11.3.99-2020-05-12T163717.html"
              test="count(hl7:id) &lt;= 1">(epims_entry_Problem): Element hl7:id kommt zu häufig vor [max 1x].</assert>
      <assert role="error"
              see="https://elga.art-decor.org/epims-html-20250116T123132/tmp-1.2.40.0.34.6.0.11.3.99-2020-05-12T163717.html"
              test="count(hl7:code[(@code = '404684003' and @codeSystem = '2.16.840.1.113883.6.96')]) &gt;= 1">(epims_entry_Problem): Element hl7:code[(@code = '404684003' and @codeSystem = '2.16.840.1.113883.6.96')] ist mandatory [min 1x].</assert>
      <assert role="error"
              see="https://elga.art-decor.org/epims-html-20250116T123132/tmp-1.2.40.0.34.6.0.11.3.99-2020-05-12T163717.html"
              test="count(hl7:code[(@code = '404684003' and @codeSystem = '2.16.840.1.113883.6.96')]) &lt;= 1">(epims_entry_Problem): Element hl7:code[(@code = '404684003' and @codeSystem = '2.16.840.1.113883.6.96')] kommt zu häufig vor [max 1x].</assert>
      <assert role="error"
              see="https://elga.art-decor.org/epims-html-20250116T123132/tmp-1.2.40.0.34.6.0.11.3.99-2020-05-12T163717.html"
              test="count(hl7:text) &gt;= 1">(epims_entry_Problem): Element hl7:text ist required [min 1x].</assert>
      <assert role="error"
              see="https://elga.art-decor.org/epims-html-20250116T123132/tmp-1.2.40.0.34.6.0.11.3.99-2020-05-12T163717.html"
              test="count(hl7:text) &lt;= 1">(epims_entry_Problem): Element hl7:text kommt zu häufig vor [max 1x].</assert>
      <assert role="error"
              see="https://elga.art-decor.org/epims-html-20250116T123132/tmp-1.2.40.0.34.6.0.11.3.99-2020-05-12T163717.html"
              test="count(hl7:statusCode[@code = 'completed']) &gt;= 1">(epims_entry_Problem): Element hl7:statusCode[@code = 'completed'] ist mandatory [min 1x].</assert>
      <assert role="error"
              see="https://elga.art-decor.org/epims-html-20250116T123132/tmp-1.2.40.0.34.6.0.11.3.99-2020-05-12T163717.html"
              test="count(hl7:statusCode[@code = 'completed']) &lt;= 1">(epims_entry_Problem): Element hl7:statusCode[@code = 'completed'] kommt zu häufig vor [max 1x].</assert>
      <assert role="error"
              see="https://elga.art-decor.org/epims-html-20250116T123132/tmp-1.2.40.0.34.6.0.11.3.99-2020-05-12T163717.html"
              test="count(hl7:effectiveTime) &gt;= 1">(epims_entry_Problem): Element hl7:effectiveTime ist required [min 1x].</assert>
      <assert role="error"
              see="https://elga.art-decor.org/epims-html-20250116T123132/tmp-1.2.40.0.34.6.0.11.3.99-2020-05-12T163717.html"
              test="count(hl7:effectiveTime) &lt;= 1">(epims_entry_Problem): Element hl7:effectiveTime kommt zu häufig vor [max 1x].</assert>
      <assert role="error"
              see="https://elga.art-decor.org/epims-html-20250116T123132/tmp-1.2.40.0.34.6.0.11.3.99-2020-05-12T163717.html"
              test="count(hl7:value[concat(@code, @codeSystem) = doc('include/voc-1.2.40.0.34.6.0.10.25-DYNAMIC.xml')//valueSet[1]/conceptList/concept/concat(@code, @codeSystem)]) &gt;= 1">(epims_entry_Problem): Element hl7:value[concat(@code, @codeSystem) = doc('include/voc-1.2.40.0.34.6.0.10.25-DYNAMIC.xml')//valueSet[1]/conceptList/concept/concat(@code, @codeSystem)] ist mandatory [min 1x].</assert>
      <assert role="error"
              see="https://elga.art-decor.org/epims-html-20250116T123132/tmp-1.2.40.0.34.6.0.11.3.99-2020-05-12T163717.html"
              test="count(hl7:value[concat(@code, @codeSystem) = doc('include/voc-1.2.40.0.34.6.0.10.25-DYNAMIC.xml')//valueSet[1]/conceptList/concept/concat(@code, @codeSystem)]) &lt;= 1">(epims_entry_Problem): Element hl7:value[concat(@code, @codeSystem) = doc('include/voc-1.2.40.0.34.6.0.10.25-DYNAMIC.xml')//valueSet[1]/conceptList/concept/concat(@code, @codeSystem)] kommt zu häufig vor [max 1x].</assert>
   </rule>
   <!--
Template derived rules for ID: 1.2.40.0.34.6.0.11.3.99
Context: *[hl7:observation[hl7:templateId[@root = '1.2.40.0.34.6.0.11.3.99'] and hl7:templateId[@root = '1.2.40.0.34.6.0.11.3.6'] and hl7:templateId[@root = '2.16.840.1.113883.10.20.1.28'] and hl7:templateId[@root = '1.3.6.1.4.1.19376.1.5.3.1.4.5']]]/hl7:observation[hl7:templateId[@root = '1.2.40.0.34.6.0.11.3.99'] and hl7:templateId[@root = '1.2.40.0.34.6.0.11.3.6'] and hl7:templateId[@root = '2.16.840.1.113883.10.20.1.28'] and hl7:templateId[@root = '1.3.6.1.4.1.19376.1.5.3.1.4.5']]/hl7:templateId[@root = '1.2.40.0.34.6.0.11.3.99']
Item: (epims_entry_Problem)
-->

   <rule fpi="RULC-1"
         context="*[hl7:observation[hl7:templateId[@root = '1.2.40.0.34.6.0.11.3.99'] and hl7:templateId[@root = '1.2.40.0.34.6.0.11.3.6'] and hl7:templateId[@root = '2.16.840.1.113883.10.20.1.28'] and hl7:templateId[@root = '1.3.6.1.4.1.19376.1.5.3.1.4.5']]]/hl7:observation[hl7:templateId[@root = '1.2.40.0.34.6.0.11.3.99'] and hl7:templateId[@root = '1.2.40.0.34.6.0.11.3.6'] and hl7:templateId[@root = '2.16.840.1.113883.10.20.1.28'] and hl7:templateId[@root = '1.3.6.1.4.1.19376.1.5.3.1.4.5']]/hl7:templateId[@root = '1.2.40.0.34.6.0.11.3.99']"
         id="d42e23800-false-d298713e0">
      <extends rule="II"/>
      <assert role="error"
              see="https://elga.art-decor.org/epims-html-20250116T123132/tmp-1.2.40.0.34.6.0.11.3.99-2020-05-12T163717.html"
              test="empty(@xsi:type) or resolve-QName(@xsi:type, .) = QName('urn:hl7-org:v3', 'II')">(epims_entry_Problem): Wenn eine @xsi:type Instruktion anwesend ist MUSS diese den Wert "{urn:hl7-org:v3}:II" haben. Gefunden "{<value-of select="namespace-uri-from-QName(resolve-QName(@xsi:type,.))"/>}:<value-of select="local-name-from-QName(resolve-QName(@xsi:type,.))"/>"</assert>
      <assert role="error"
              see="https://elga.art-decor.org/epims-html-20250116T123132/tmp-1.2.40.0.34.6.0.11.3.99-2020-05-12T163717.html"
              test="string(@root) = ('1.2.40.0.34.6.0.11.3.99')">(epims_entry_Problem): Der Wert von root MUSS '1.2.40.0.34.6.0.11.3.99' sein. Gefunden: "<value-of select="@root"/>"</assert>
   </rule>
   <!--
Template derived rules for ID: 1.2.40.0.34.6.0.11.3.99
Context: *[hl7:observation[hl7:templateId[@root = '1.2.40.0.34.6.0.11.3.99'] and hl7:templateId[@root = '1.2.40.0.34.6.0.11.3.6'] and hl7:templateId[@root = '2.16.840.1.113883.10.20.1.28'] and hl7:templateId[@root = '1.3.6.1.4.1.19376.1.5.3.1.4.5']]]/hl7:observation[hl7:templateId[@root = '1.2.40.0.34.6.0.11.3.99'] and hl7:templateId[@root = '1.2.40.0.34.6.0.11.3.6'] and hl7:templateId[@root = '2.16.840.1.113883.10.20.1.28'] and hl7:templateId[@root = '1.3.6.1.4.1.19376.1.5.3.1.4.5']]/hl7:templateId[@root = '1.2.40.0.34.6.0.11.3.6']
Item: (epims_entry_Problem)
-->

   <rule fpi="RULC-1"
         context="*[hl7:observation[hl7:templateId[@root = '1.2.40.0.34.6.0.11.3.99'] and hl7:templateId[@root = '1.2.40.0.34.6.0.11.3.6'] and hl7:templateId[@root = '2.16.840.1.113883.10.20.1.28'] and hl7:templateId[@root = '1.3.6.1.4.1.19376.1.5.3.1.4.5']]]/hl7:observation[hl7:templateId[@root = '1.2.40.0.34.6.0.11.3.99'] and hl7:templateId[@root = '1.2.40.0.34.6.0.11.3.6'] and hl7:templateId[@root = '2.16.840.1.113883.10.20.1.28'] and hl7:templateId[@root = '1.3.6.1.4.1.19376.1.5.3.1.4.5']]/hl7:templateId[@root = '1.2.40.0.34.6.0.11.3.6']"
         id="d42e23806-false-d298728e0">
      <extends rule="II"/>
      <assert role="error"
              see="https://elga.art-decor.org/epims-html-20250116T123132/tmp-1.2.40.0.34.6.0.11.3.99-2020-05-12T163717.html"
              test="empty(@xsi:type) or resolve-QName(@xsi:type, .) = QName('urn:hl7-org:v3', 'II')">(epims_entry_Problem): Wenn eine @xsi:type Instruktion anwesend ist MUSS diese den Wert "{urn:hl7-org:v3}:II" haben. Gefunden "{<value-of select="namespace-uri-from-QName(resolve-QName(@xsi:type,.))"/>}:<value-of select="local-name-from-QName(resolve-QName(@xsi:type,.))"/>"</assert>
      <assert role="error"
              see="https://elga.art-decor.org/epims-html-20250116T123132/tmp-1.2.40.0.34.6.0.11.3.99-2020-05-12T163717.html"
              test="string(@root) = ('1.2.40.0.34.6.0.11.3.6')">(epims_entry_Problem): Der Wert von root MUSS '1.2.40.0.34.6.0.11.3.6' sein. Gefunden: "<value-of select="@root"/>"</assert>
   </rule>
   <!--
Template derived rules for ID: 1.2.40.0.34.6.0.11.3.99
Context: *[hl7:observation[hl7:templateId[@root = '1.2.40.0.34.6.0.11.3.99'] and hl7:templateId[@root = '1.2.40.0.34.6.0.11.3.6'] and hl7:templateId[@root = '2.16.840.1.113883.10.20.1.28'] and hl7:templateId[@root = '1.3.6.1.4.1.19376.1.5.3.1.4.5']]]/hl7:observation[hl7:templateId[@root = '1.2.40.0.34.6.0.11.3.99'] and hl7:templateId[@root = '1.2.40.0.34.6.0.11.3.6'] and hl7:templateId[@root = '2.16.840.1.113883.10.20.1.28'] and hl7:templateId[@root = '1.3.6.1.4.1.19376.1.5.3.1.4.5']]/hl7:templateId[@root = '2.16.840.1.113883.10.20.1.28']
Item: (epims_entry_Problem)
-->

   <rule fpi="RULC-1"
         context="*[hl7:observation[hl7:templateId[@root = '1.2.40.0.34.6.0.11.3.99'] and hl7:templateId[@root = '1.2.40.0.34.6.0.11.3.6'] and hl7:templateId[@root = '2.16.840.1.113883.10.20.1.28'] and hl7:templateId[@root = '1.3.6.1.4.1.19376.1.5.3.1.4.5']]]/hl7:observation[hl7:templateId[@root = '1.2.40.0.34.6.0.11.3.99'] and hl7:templateId[@root = '1.2.40.0.34.6.0.11.3.6'] and hl7:templateId[@root = '2.16.840.1.113883.10.20.1.28'] and hl7:templateId[@root = '1.3.6.1.4.1.19376.1.5.3.1.4.5']]/hl7:templateId[@root = '2.16.840.1.113883.10.20.1.28']"
         id="d42e23814-false-d298743e0">
      <extends rule="II"/>
      <assert role="error"
              see="https://elga.art-decor.org/epims-html-20250116T123132/tmp-1.2.40.0.34.6.0.11.3.99-2020-05-12T163717.html"
              test="empty(@xsi:type) or resolve-QName(@xsi:type, .) = QName('urn:hl7-org:v3', 'II')">(epims_entry_Problem): Wenn eine @xsi:type Instruktion anwesend ist MUSS diese den Wert "{urn:hl7-org:v3}:II" haben. Gefunden "{<value-of select="namespace-uri-from-QName(resolve-QName(@xsi:type,.))"/>}:<value-of select="local-name-from-QName(resolve-QName(@xsi:type,.))"/>"</assert>
      <assert role="error"
              see="https://elga.art-decor.org/epims-html-20250116T123132/tmp-1.2.40.0.34.6.0.11.3.99-2020-05-12T163717.html"
              test="string(@root) = ('2.16.840.1.113883.10.20.1.28')">(epims_entry_Problem): Der Wert von root MUSS '2.16.840.1.113883.10.20.1.28' sein. Gefunden: "<value-of select="@root"/>"</assert>
   </rule>
   <!--
Template derived rules for ID: 1.2.40.0.34.6.0.11.3.99
Context: *[hl7:observation[hl7:templateId[@root = '1.2.40.0.34.6.0.11.3.99'] and hl7:templateId[@root = '1.2.40.0.34.6.0.11.3.6'] and hl7:templateId[@root = '2.16.840.1.113883.10.20.1.28'] and hl7:templateId[@root = '1.3.6.1.4.1.19376.1.5.3.1.4.5']]]/hl7:observation[hl7:templateId[@root = '1.2.40.0.34.6.0.11.3.99'] and hl7:templateId[@root = '1.2.40.0.34.6.0.11.3.6'] and hl7:templateId[@root = '2.16.840.1.113883.10.20.1.28'] and hl7:templateId[@root = '1.3.6.1.4.1.19376.1.5.3.1.4.5']]/hl7:templateId[@root = '1.3.6.1.4.1.19376.1.5.3.1.4.5']
Item: (epims_entry_Problem)
-->

   <rule fpi="RULC-1"
         context="*[hl7:observation[hl7:templateId[@root = '1.2.40.0.34.6.0.11.3.99'] and hl7:templateId[@root = '1.2.40.0.34.6.0.11.3.6'] and hl7:templateId[@root = '2.16.840.1.113883.10.20.1.28'] and hl7:templateId[@root = '1.3.6.1.4.1.19376.1.5.3.1.4.5']]]/hl7:observation[hl7:templateId[@root = '1.2.40.0.34.6.0.11.3.99'] and hl7:templateId[@root = '1.2.40.0.34.6.0.11.3.6'] and hl7:templateId[@root = '2.16.840.1.113883.10.20.1.28'] and hl7:templateId[@root = '1.3.6.1.4.1.19376.1.5.3.1.4.5']]/hl7:templateId[@root = '1.3.6.1.4.1.19376.1.5.3.1.4.5']"
         id="d42e23822-false-d298758e0">
      <extends rule="II"/>
      <assert role="error"
              see="https://elga.art-decor.org/epims-html-20250116T123132/tmp-1.2.40.0.34.6.0.11.3.99-2020-05-12T163717.html"
              test="empty(@xsi:type) or resolve-QName(@xsi:type, .) = QName('urn:hl7-org:v3', 'II')">(epims_entry_Problem): Wenn eine @xsi:type Instruktion anwesend ist MUSS diese den Wert "{urn:hl7-org:v3}:II" haben. Gefunden "{<value-of select="namespace-uri-from-QName(resolve-QName(@xsi:type,.))"/>}:<value-of select="local-name-from-QName(resolve-QName(@xsi:type,.))"/>"</assert>
      <assert role="error"
              see="https://elga.art-decor.org/epims-html-20250116T123132/tmp-1.2.40.0.34.6.0.11.3.99-2020-05-12T163717.html"
              test="string(@root) = ('1.3.6.1.4.1.19376.1.5.3.1.4.5')">(epims_entry_Problem): Der Wert von root MUSS '1.3.6.1.4.1.19376.1.5.3.1.4.5' sein. Gefunden: "<value-of select="@root"/>"</assert>
   </rule>
   <!--
Template derived rules for ID: 1.2.40.0.34.6.0.11.3.99
Context: *[hl7:observation[hl7:templateId[@root = '1.2.40.0.34.6.0.11.3.99'] and hl7:templateId[@root = '1.2.40.0.34.6.0.11.3.6'] and hl7:templateId[@root = '2.16.840.1.113883.10.20.1.28'] and hl7:templateId[@root = '1.3.6.1.4.1.19376.1.5.3.1.4.5']]]/hl7:observation[hl7:templateId[@root = '1.2.40.0.34.6.0.11.3.99'] and hl7:templateId[@root = '1.2.40.0.34.6.0.11.3.6'] and hl7:templateId[@root = '2.16.840.1.113883.10.20.1.28'] and hl7:templateId[@root = '1.3.6.1.4.1.19376.1.5.3.1.4.5']]/hl7:id
Item: (epims_entry_Problem)
-->

   <rule fpi="RULC-1"
         context="*[hl7:observation[hl7:templateId[@root = '1.2.40.0.34.6.0.11.3.99'] and hl7:templateId[@root = '1.2.40.0.34.6.0.11.3.6'] and hl7:templateId[@root = '2.16.840.1.113883.10.20.1.28'] and hl7:templateId[@root = '1.3.6.1.4.1.19376.1.5.3.1.4.5']]]/hl7:observation[hl7:templateId[@root = '1.2.40.0.34.6.0.11.3.99'] and hl7:templateId[@root = '1.2.40.0.34.6.0.11.3.6'] and hl7:templateId[@root = '2.16.840.1.113883.10.20.1.28'] and hl7:templateId[@root = '1.3.6.1.4.1.19376.1.5.3.1.4.5']]/hl7:id"
         id="d42e23830-false-d298772e0">
      <extends rule="II"/>
      <assert role="error"
              see="https://elga.art-decor.org/epims-html-20250116T123132/tmp-1.2.40.0.34.6.0.11.3.99-2020-05-12T163717.html"
              test="empty(@xsi:type) or resolve-QName(@xsi:type, .) = QName('urn:hl7-org:v3', 'II')">(epims_entry_Problem): Wenn eine @xsi:type Instruktion anwesend ist MUSS diese den Wert "{urn:hl7-org:v3}:II" haben. Gefunden "{<value-of select="namespace-uri-from-QName(resolve-QName(@xsi:type,.))"/>}:<value-of select="local-name-from-QName(resolve-QName(@xsi:type,.))"/>"</assert>
   </rule>
   <!--
Template derived rules for ID: 1.2.40.0.34.6.0.11.3.99
Context: *[hl7:observation[hl7:templateId[@root = '1.2.40.0.34.6.0.11.3.99'] and hl7:templateId[@root = '1.2.40.0.34.6.0.11.3.6'] and hl7:templateId[@root = '2.16.840.1.113883.10.20.1.28'] and hl7:templateId[@root = '1.3.6.1.4.1.19376.1.5.3.1.4.5']]]/hl7:observation[hl7:templateId[@root = '1.2.40.0.34.6.0.11.3.99'] and hl7:templateId[@root = '1.2.40.0.34.6.0.11.3.6'] and hl7:templateId[@root = '2.16.840.1.113883.10.20.1.28'] and hl7:templateId[@root = '1.3.6.1.4.1.19376.1.5.3.1.4.5']]/hl7:code[(@code = '404684003' and @codeSystem = '2.16.840.1.113883.6.96')]
Item: (epims_entry_Problem)
-->

   <rule fpi="RULC-1"
         context="*[hl7:observation[hl7:templateId[@root = '1.2.40.0.34.6.0.11.3.99'] and hl7:templateId[@root = '1.2.40.0.34.6.0.11.3.6'] and hl7:templateId[@root = '2.16.840.1.113883.10.20.1.28'] and hl7:templateId[@root = '1.3.6.1.4.1.19376.1.5.3.1.4.5']]]/hl7:observation[hl7:templateId[@root = '1.2.40.0.34.6.0.11.3.99'] and hl7:templateId[@root = '1.2.40.0.34.6.0.11.3.6'] and hl7:templateId[@root = '2.16.840.1.113883.10.20.1.28'] and hl7:templateId[@root = '1.3.6.1.4.1.19376.1.5.3.1.4.5']]/hl7:code[(@code = '404684003' and @codeSystem = '2.16.840.1.113883.6.96')]"
         id="d42e23841-false-d298783e0">
      <extends rule="CE"/>
      <assert role="error"
              see="https://elga.art-decor.org/epims-html-20250116T123132/tmp-1.2.40.0.34.6.0.11.3.99-2020-05-12T163717.html"
              test="empty(@xsi:type) or resolve-QName(@xsi:type, .) = QName('urn:hl7-org:v3', 'CE')">(epims_entry_Problem): Wenn eine @xsi:type Instruktion anwesend ist MUSS diese den Wert "{urn:hl7-org:v3}:CE" haben. Gefunden "{<value-of select="namespace-uri-from-QName(resolve-QName(@xsi:type,.))"/>}:<value-of select="local-name-from-QName(resolve-QName(@xsi:type,.))"/>"</assert>
      <assert role="error"
              see="https://elga.art-decor.org/epims-html-20250116T123132/tmp-1.2.40.0.34.6.0.11.3.99-2020-05-12T163717.html"
              test="@nullFlavor or (@code='404684003' and @codeSystem='2.16.840.1.113883.6.96' and @displayName='Clinical finding (finding)' and @codeSystemName='SNOMED CT')">(epims_entry_Problem): Der Elementinhalt MUSS einer von 'code '404684003' codeSystem '2.16.840.1.113883.6.96' displayName='Clinical finding (finding)' codeSystemName='SNOMED CT'' sein.</assert>
   </rule>
   <!--
Template derived rules for ID: 1.2.40.0.34.6.0.11.9.1
Context: *[hl7:observation[hl7:templateId[@root = '1.2.40.0.34.6.0.11.3.99'] and hl7:templateId[@root = '1.2.40.0.34.6.0.11.3.6'] and hl7:templateId[@root = '2.16.840.1.113883.10.20.1.28'] and hl7:templateId[@root = '1.3.6.1.4.1.19376.1.5.3.1.4.5']]]/hl7:observation[hl7:templateId[@root = '1.2.40.0.34.6.0.11.3.99'] and hl7:templateId[@root = '1.2.40.0.34.6.0.11.3.6'] and hl7:templateId[@root = '2.16.840.1.113883.10.20.1.28'] and hl7:templateId[@root = '1.3.6.1.4.1.19376.1.5.3.1.4.5']]/hl7:text
Item: (atcdabrr_other_NarrativeTextReference)
-->

   <rule fpi="RULC-1"
         context="*[hl7:observation[hl7:templateId[@root = '1.2.40.0.34.6.0.11.3.99'] and hl7:templateId[@root = '1.2.40.0.34.6.0.11.3.6'] and hl7:templateId[@root = '2.16.840.1.113883.10.20.1.28'] and hl7:templateId[@root = '1.3.6.1.4.1.19376.1.5.3.1.4.5']]]/hl7:observation[hl7:templateId[@root = '1.2.40.0.34.6.0.11.3.99'] and hl7:templateId[@root = '1.2.40.0.34.6.0.11.3.6'] and hl7:templateId[@root = '2.16.840.1.113883.10.20.1.28'] and hl7:templateId[@root = '1.3.6.1.4.1.19376.1.5.3.1.4.5']]/hl7:text"
         id="d298784e67-false-d298800e0">
      <extends rule="ED"/>
      <assert role="error"
              see="https://elga.art-decor.org/epims-html-20250116T123132/tmp-1.2.40.0.34.6.0.11.9.1-2021-05-06T093820.html"
              test="empty(@xsi:type) or resolve-QName(@xsi:type, .) = QName('urn:hl7-org:v3', 'ED')">(atcdabrr_other_NarrativeTextReference): Wenn eine @xsi:type Instruktion anwesend ist MUSS diese den Wert "{urn:hl7-org:v3}:ED" haben. Gefunden "{<value-of select="namespace-uri-from-QName(resolve-QName(@xsi:type,.))"/>}:<value-of select="local-name-from-QName(resolve-QName(@xsi:type,.))"/>"</assert>
      <assert role="error"
              see="https://elga.art-decor.org/epims-html-20250116T123132/tmp-1.2.40.0.34.6.0.11.9.1-2021-05-06T093820.html"
              test="count(hl7:reference[not(@nullFlavor)]) &gt;= 1">(atcdabrr_other_NarrativeTextReference): Element hl7:reference[not(@nullFlavor)] ist mandatory [min 1x].</assert>
      <assert role="error"
              see="https://elga.art-decor.org/epims-html-20250116T123132/tmp-1.2.40.0.34.6.0.11.9.1-2021-05-06T093820.html"
              test="count(hl7:reference[not(@nullFlavor)]) &lt;= 1">(atcdabrr_other_NarrativeTextReference): Element hl7:reference[not(@nullFlavor)] kommt zu häufig vor [max 1x].</assert>
   </rule>
   <!--
Template derived rules for ID: 1.2.40.0.34.6.0.11.9.1
Context: *[hl7:observation[hl7:templateId[@root = '1.2.40.0.34.6.0.11.3.99'] and hl7:templateId[@root = '1.2.40.0.34.6.0.11.3.6'] and hl7:templateId[@root = '2.16.840.1.113883.10.20.1.28'] and hl7:templateId[@root = '1.3.6.1.4.1.19376.1.5.3.1.4.5']]]/hl7:observation[hl7:templateId[@root = '1.2.40.0.34.6.0.11.3.99'] and hl7:templateId[@root = '1.2.40.0.34.6.0.11.3.6'] and hl7:templateId[@root = '2.16.840.1.113883.10.20.1.28'] and hl7:templateId[@root = '1.3.6.1.4.1.19376.1.5.3.1.4.5']]/hl7:text/hl7:reference[not(@nullFlavor)]
Item: (atcdabrr_other_NarrativeTextReference)
-->

   <rule fpi="RULC-1"
         context="*[hl7:observation[hl7:templateId[@root = '1.2.40.0.34.6.0.11.3.99'] and hl7:templateId[@root = '1.2.40.0.34.6.0.11.3.6'] and hl7:templateId[@root = '2.16.840.1.113883.10.20.1.28'] and hl7:templateId[@root = '1.3.6.1.4.1.19376.1.5.3.1.4.5']]]/hl7:observation[hl7:templateId[@root = '1.2.40.0.34.6.0.11.3.99'] and hl7:templateId[@root = '1.2.40.0.34.6.0.11.3.6'] and hl7:templateId[@root = '2.16.840.1.113883.10.20.1.28'] and hl7:templateId[@root = '1.3.6.1.4.1.19376.1.5.3.1.4.5']]/hl7:text/hl7:reference[not(@nullFlavor)]"
         id="d298784e69-false-d298819e0">
      <extends rule="TEL"/>
      <assert role="error"
              see="https://elga.art-decor.org/epims-html-20250116T123132/tmp-1.2.40.0.34.6.0.11.9.1-2021-05-06T093820.html"
              test="empty(@xsi:type) or resolve-QName(@xsi:type, .) = QName('urn:hl7-org:v3', 'TEL')">(atcdabrr_other_NarrativeTextReference): Wenn eine @xsi:type Instruktion anwesend ist MUSS diese den Wert "{urn:hl7-org:v3}:TEL" haben. Gefunden "{<value-of select="namespace-uri-from-QName(resolve-QName(@xsi:type,.))"/>}:<value-of select="local-name-from-QName(resolve-QName(@xsi:type,.))"/>"</assert>
      <assert role="error"
              see="https://elga.art-decor.org/epims-html-20250116T123132/tmp-1.2.40.0.34.6.0.11.9.1-2021-05-06T093820.html"
              test="@value">(atcdabrr_other_NarrativeTextReference): Attribut @value MUSS vorkommen.</assert>
      <assert role="error"
              see="https://elga.art-decor.org/epims-html-20250116T123132/tmp-1.2.40.0.34.6.0.11.9.1-2021-05-06T093820.html"
              test="starts-with(@value,'#') or starts-with(@value,'http')">(atcdabrr_other_NarrativeTextReference): The @value attribute content MUST conform to the format '#xxx', where xxx is the ID of the corresponding 'content'-element, or begin with the 'http' or 'https' url-scheme.</assert>
   </rule>
   <!--
Template derived rules for ID: 1.2.40.0.34.6.0.11.3.99
Context: *[hl7:observation[hl7:templateId[@root = '1.2.40.0.34.6.0.11.3.99'] and hl7:templateId[@root = '1.2.40.0.34.6.0.11.3.6'] and hl7:templateId[@root = '2.16.840.1.113883.10.20.1.28'] and hl7:templateId[@root = '1.3.6.1.4.1.19376.1.5.3.1.4.5']]]/hl7:observation[hl7:templateId[@root = '1.2.40.0.34.6.0.11.3.99'] and hl7:templateId[@root = '1.2.40.0.34.6.0.11.3.6'] and hl7:templateId[@root = '2.16.840.1.113883.10.20.1.28'] and hl7:templateId[@root = '1.3.6.1.4.1.19376.1.5.3.1.4.5']]/hl7:statusCode[@code = 'completed']
Item: (epims_entry_Problem)
-->

   <rule fpi="RULC-1"
         context="*[hl7:observation[hl7:templateId[@root = '1.2.40.0.34.6.0.11.3.99'] and hl7:templateId[@root = '1.2.40.0.34.6.0.11.3.6'] and hl7:templateId[@root = '2.16.840.1.113883.10.20.1.28'] and hl7:templateId[@root = '1.3.6.1.4.1.19376.1.5.3.1.4.5']]]/hl7:observation[hl7:templateId[@root = '1.2.40.0.34.6.0.11.3.99'] and hl7:templateId[@root = '1.2.40.0.34.6.0.11.3.6'] and hl7:templateId[@root = '2.16.840.1.113883.10.20.1.28'] and hl7:templateId[@root = '1.3.6.1.4.1.19376.1.5.3.1.4.5']]/hl7:statusCode[@code = 'completed']"
         id="d42e23849-false-d298834e0">
      <extends rule="CS"/>
      <assert role="error"
              see="https://elga.art-decor.org/epims-html-20250116T123132/tmp-1.2.40.0.34.6.0.11.3.99-2020-05-12T163717.html"
              test="empty(@xsi:type) or resolve-QName(@xsi:type, .) = QName('urn:hl7-org:v3', 'CS')">(epims_entry_Problem): Wenn eine @xsi:type Instruktion anwesend ist MUSS diese den Wert "{urn:hl7-org:v3}:CS" haben. Gefunden "{<value-of select="namespace-uri-from-QName(resolve-QName(@xsi:type,.))"/>}:<value-of select="local-name-from-QName(resolve-QName(@xsi:type,.))"/>"</assert>
      <assert role="error"
              see="https://elga.art-decor.org/epims-html-20250116T123132/tmp-1.2.40.0.34.6.0.11.3.99-2020-05-12T163717.html"
              test="@nullFlavor or (@code='completed')">(epims_entry_Problem): Der Elementinhalt MUSS einer von 'code 'completed'' sein.</assert>
   </rule>
   <!--
Template derived rules for ID: 1.2.40.0.34.6.0.11.3.99
Context: *[hl7:observation[hl7:templateId[@root = '1.2.40.0.34.6.0.11.3.99'] and hl7:templateId[@root = '1.2.40.0.34.6.0.11.3.6'] and hl7:templateId[@root = '2.16.840.1.113883.10.20.1.28'] and hl7:templateId[@root = '1.3.6.1.4.1.19376.1.5.3.1.4.5']]]/hl7:observation[hl7:templateId[@root = '1.2.40.0.34.6.0.11.3.99'] and hl7:templateId[@root = '1.2.40.0.34.6.0.11.3.6'] and hl7:templateId[@root = '2.16.840.1.113883.10.20.1.28'] and hl7:templateId[@root = '1.3.6.1.4.1.19376.1.5.3.1.4.5']]/hl7:effectiveTime
Item: (epims_entry_Problem)
-->

   <rule fpi="RULC-1"
         context="*[hl7:observation[hl7:templateId[@root = '1.2.40.0.34.6.0.11.3.99'] and hl7:templateId[@root = '1.2.40.0.34.6.0.11.3.6'] and hl7:templateId[@root = '2.16.840.1.113883.10.20.1.28'] and hl7:templateId[@root = '1.3.6.1.4.1.19376.1.5.3.1.4.5']]]/hl7:observation[hl7:templateId[@root = '1.2.40.0.34.6.0.11.3.99'] and hl7:templateId[@root = '1.2.40.0.34.6.0.11.3.6'] and hl7:templateId[@root = '2.16.840.1.113883.10.20.1.28'] and hl7:templateId[@root = '1.3.6.1.4.1.19376.1.5.3.1.4.5']]/hl7:effectiveTime"
         id="d42e23858-false-d298850e0">
      <extends rule="IVL_TS"/>
      <assert role="error"
              see="https://elga.art-decor.org/epims-html-20250116T123132/tmp-1.2.40.0.34.6.0.11.3.99-2020-05-12T163717.html"
              test="empty(@xsi:type) or resolve-QName(@xsi:type, .) = QName('urn:hl7-org:v3', 'IVL_TS')">(epims_entry_Problem): Wenn eine @xsi:type Instruktion anwesend ist MUSS diese den Wert "{urn:hl7-org:v3}:IVL_TS" haben. Gefunden "{<value-of select="namespace-uri-from-QName(resolve-QName(@xsi:type,.))"/>}:<value-of select="local-name-from-QName(resolve-QName(@xsi:type,.))"/>"</assert>
      <assert role="error"
              see="https://elga.art-decor.org/epims-html-20250116T123132/tmp-1.2.40.0.34.6.0.11.3.99-2020-05-12T163717.html"
              test="count(hl7:statusCode[@code='active'])=0 or count(hl7:effectiveTime/hl7:high)=0">(epims_entry_Problem): Ist das Element statusCode auf „active“ gesetzt, muss das high-Element des Zeitintervalls weggelassen werden.</assert>
      <assert role="error"
              see="https://elga.art-decor.org/epims-html-20250116T123132/tmp-1.2.40.0.34.6.0.11.3.99-2020-05-12T163717.html"
              test="count(hl7:low[not(@nullFlavor)]) &gt;= 1">(epims_entry_Problem): Element hl7:low[not(@nullFlavor)] ist mandatory [min 1x].</assert>
      <assert role="error"
              see="https://elga.art-decor.org/epims-html-20250116T123132/tmp-1.2.40.0.34.6.0.11.3.99-2020-05-12T163717.html"
              test="count(hl7:low[not(@nullFlavor)]) &lt;= 1">(epims_entry_Problem): Element hl7:low[not(@nullFlavor)] kommt zu häufig vor [max 1x].</assert>
      <assert role="error"
              see="https://elga.art-decor.org/epims-html-20250116T123132/tmp-1.2.40.0.34.6.0.11.3.99-2020-05-12T163717.html"
              test="count(hl7:high) &lt;= 1">(epims_entry_Problem): Element hl7:high kommt zu häufig vor [max 1x].</assert>
   </rule>
   <!--
Template derived rules for ID: 1.2.40.0.34.6.0.11.3.99
Context: *[hl7:observation[hl7:templateId[@root = '1.2.40.0.34.6.0.11.3.99'] and hl7:templateId[@root = '1.2.40.0.34.6.0.11.3.6'] and hl7:templateId[@root = '2.16.840.1.113883.10.20.1.28'] and hl7:templateId[@root = '1.3.6.1.4.1.19376.1.5.3.1.4.5']]]/hl7:observation[hl7:templateId[@root = '1.2.40.0.34.6.0.11.3.99'] and hl7:templateId[@root = '1.2.40.0.34.6.0.11.3.6'] and hl7:templateId[@root = '2.16.840.1.113883.10.20.1.28'] and hl7:templateId[@root = '1.3.6.1.4.1.19376.1.5.3.1.4.5']]/hl7:effectiveTime/hl7:low[not(@nullFlavor)]
Item: (epims_entry_Problem)
-->

   <rule fpi="RULC-1"
         context="*[hl7:observation[hl7:templateId[@root = '1.2.40.0.34.6.0.11.3.99'] and hl7:templateId[@root = '1.2.40.0.34.6.0.11.3.6'] and hl7:templateId[@root = '2.16.840.1.113883.10.20.1.28'] and hl7:templateId[@root = '1.3.6.1.4.1.19376.1.5.3.1.4.5']]]/hl7:observation[hl7:templateId[@root = '1.2.40.0.34.6.0.11.3.99'] and hl7:templateId[@root = '1.2.40.0.34.6.0.11.3.6'] and hl7:templateId[@root = '2.16.840.1.113883.10.20.1.28'] and hl7:templateId[@root = '1.3.6.1.4.1.19376.1.5.3.1.4.5']]/hl7:effectiveTime/hl7:low[not(@nullFlavor)]"
         id="d42e23866-false-d298875e0">
      <extends rule="TS.AT.TZ"/>
      <assert role="error"
              see="https://elga.art-decor.org/epims-html-20250116T123132/tmp-1.2.40.0.34.6.0.11.3.99-2020-05-12T163717.html"
              test="empty(@xsi:type) or resolve-QName(@xsi:type, .) = QName('urn:hl7-org:v3', 'TS')">(epims_entry_Problem): Wenn eine @xsi:type Instruktion anwesend ist MUSS diese den Wert "{urn:hl7-org:v3}:TS" haben. Gefunden "{<value-of select="namespace-uri-from-QName(resolve-QName(@xsi:type,.))"/>}:<value-of select="local-name-from-QName(resolve-QName(@xsi:type,.))"/>"</assert>
      <assert role="error"
              see="https://elga.art-decor.org/epims-html-20250116T123132/tmp-1.2.40.0.34.6.0.11.3.99-2020-05-12T163717.html"
              test="not(*)">(epims_entry_Problem): <value-of select="local-name()"/> with datatype TS.AT.TZ, SHOULD NOT have child elements.</assert>
   </rule>
   <!--
Template derived rules for ID: 1.2.40.0.34.6.0.11.3.99
Context: *[hl7:observation[hl7:templateId[@root = '1.2.40.0.34.6.0.11.3.99'] and hl7:templateId[@root = '1.2.40.0.34.6.0.11.3.6'] and hl7:templateId[@root = '2.16.840.1.113883.10.20.1.28'] and hl7:templateId[@root = '1.3.6.1.4.1.19376.1.5.3.1.4.5']]]/hl7:observation[hl7:templateId[@root = '1.2.40.0.34.6.0.11.3.99'] and hl7:templateId[@root = '1.2.40.0.34.6.0.11.3.6'] and hl7:templateId[@root = '2.16.840.1.113883.10.20.1.28'] and hl7:templateId[@root = '1.3.6.1.4.1.19376.1.5.3.1.4.5']]/hl7:effectiveTime/hl7:high
Item: (epims_entry_Problem)
-->

   <rule fpi="RULC-1"
         context="*[hl7:observation[hl7:templateId[@root = '1.2.40.0.34.6.0.11.3.99'] and hl7:templateId[@root = '1.2.40.0.34.6.0.11.3.6'] and hl7:templateId[@root = '2.16.840.1.113883.10.20.1.28'] and hl7:templateId[@root = '1.3.6.1.4.1.19376.1.5.3.1.4.5']]]/hl7:observation[hl7:templateId[@root = '1.2.40.0.34.6.0.11.3.99'] and hl7:templateId[@root = '1.2.40.0.34.6.0.11.3.6'] and hl7:templateId[@root = '2.16.840.1.113883.10.20.1.28'] and hl7:templateId[@root = '1.3.6.1.4.1.19376.1.5.3.1.4.5']]/hl7:effectiveTime/hl7:high"
         id="d42e23872-false-d298888e0">
      <extends rule="TS.AT.TZ"/>
      <assert role="error"
              see="https://elga.art-decor.org/epims-html-20250116T123132/tmp-1.2.40.0.34.6.0.11.3.99-2020-05-12T163717.html"
              test="empty(@xsi:type) or resolve-QName(@xsi:type, .) = QName('urn:hl7-org:v3', 'TS')">(epims_entry_Problem): Wenn eine @xsi:type Instruktion anwesend ist MUSS diese den Wert "{urn:hl7-org:v3}:TS" haben. Gefunden "{<value-of select="namespace-uri-from-QName(resolve-QName(@xsi:type,.))"/>}:<value-of select="local-name-from-QName(resolve-QName(@xsi:type,.))"/>"</assert>
      <assert role="error"
              see="https://elga.art-decor.org/epims-html-20250116T123132/tmp-1.2.40.0.34.6.0.11.3.99-2020-05-12T163717.html"
              test="not(*)">(epims_entry_Problem): <value-of select="local-name()"/> with datatype TS.AT.TZ, SHOULD NOT have child elements.</assert>
   </rule>
   <!--
Template derived rules for ID: 1.2.40.0.34.6.0.11.3.99
Context: *[hl7:observation[hl7:templateId[@root = '1.2.40.0.34.6.0.11.3.99'] and hl7:templateId[@root = '1.2.40.0.34.6.0.11.3.6'] and hl7:templateId[@root = '2.16.840.1.113883.10.20.1.28'] and hl7:templateId[@root = '1.3.6.1.4.1.19376.1.5.3.1.4.5']]]/hl7:observation[hl7:templateId[@root = '1.2.40.0.34.6.0.11.3.99'] and hl7:templateId[@root = '1.2.40.0.34.6.0.11.3.6'] and hl7:templateId[@root = '2.16.840.1.113883.10.20.1.28'] and hl7:templateId[@root = '1.3.6.1.4.1.19376.1.5.3.1.4.5']]/hl7:value[concat(@code, @codeSystem) = doc('include/voc-1.2.40.0.34.6.0.10.25-DYNAMIC.xml')//valueSet[1]/conceptList/concept/concat(@code, @codeSystem)]
Item: (epims_entry_Problem)
-->

   <rule fpi="RULC-1"
         context="*[hl7:observation[hl7:templateId[@root = '1.2.40.0.34.6.0.11.3.99'] and hl7:templateId[@root = '1.2.40.0.34.6.0.11.3.6'] and hl7:templateId[@root = '2.16.840.1.113883.10.20.1.28'] and hl7:templateId[@root = '1.3.6.1.4.1.19376.1.5.3.1.4.5']]]/hl7:observation[hl7:templateId[@root = '1.2.40.0.34.6.0.11.3.99'] and hl7:templateId[@root = '1.2.40.0.34.6.0.11.3.6'] and hl7:templateId[@root = '2.16.840.1.113883.10.20.1.28'] and hl7:templateId[@root = '1.3.6.1.4.1.19376.1.5.3.1.4.5']]/hl7:value[concat(@code, @codeSystem) = doc('include/voc-1.2.40.0.34.6.0.10.25-DYNAMIC.xml')//valueSet[1]/conceptList/concept/concat(@code, @codeSystem)]"
         id="d42e23882-false-d298904e0">
      <extends rule="CD"/>
      <assert role="error"
              see="https://elga.art-decor.org/epims-html-20250116T123132/tmp-1.2.40.0.34.6.0.11.3.99-2020-05-12T163717.html"
              test="empty(@xsi:type) or resolve-QName(@xsi:type, .) = QName('urn:hl7-org:v3', 'CD')">(epims_entry_Problem): Wenn eine @xsi:type Instruktion anwesend ist MUSS diese den Wert "{urn:hl7-org:v3}:CD" haben. Gefunden "{<value-of select="namespace-uri-from-QName(resolve-QName(@xsi:type,.))"/>}:<value-of select="local-name-from-QName(resolve-QName(@xsi:type,.))"/>"</assert>
      <let name="theCode" value="@code"/>
      <let name="theCodeSystem" value="@codeSystem"/>
      <assert role="error"
              see="https://elga.art-decor.org/epims-html-20250116T123132/tmp-1.2.40.0.34.6.0.11.3.99-2020-05-12T163717.html"
              test="@nullFlavor or exists(doc('include/voc-1.2.40.0.34.6.0.10.25-DYNAMIC.xml')//valueSet[1][conceptList/concept[@code = $theCode][@codeSystem = $theCodeSystem]])">(epims_entry_Problem): Der Elementinhalt MUSS einer von '1.2.40.0.34.6.0.10.25 EMS KlinischeManifestation VS (DYNAMIC)' sein.</assert>
   </rule>
</pattern>
