<?xml version="1.0" encoding="UTF-8"?>
<!--
Template derived pattern
===========================================
ID: 1.2.40.0.34.6.0.11.3.89
Name: Device Resolution Observation
Description: Die Device Resolution Observation kann mit einem oder mehreren Elementen in einem Device Information Organizer vorhanden sein. Die Auflösung einer Messung sagt aus wie klein der Unterschied zwischen zwei Messungen sein muss, um vom Gerät erkannt zu werden. Beispielsweise kann ein Thermometer eine Auflösung von 0,1 Grad Celsius haben. Die Auflösung wird hier
                angegeben in den Einheiten der Messgröße und weil ein Gerät mehr als nur eine Messgröße messen kann, können mehrere Device Accuracy Observation-Elemente existieren. Wenn das Gerät die Daten über die Auflösung oder die anderen Geräte-Details nicht zurückgibt, können diese, wenn gewünscht, auch manuell oder über andere Wege eingetragen werden.
-->
<pattern xmlns="http://purl.oclc.org/dsdl/schematron"
         id="template-1.2.40.0.34.6.0.11.3.89-2021-02-18T133037-closed">
   <title>Device Resolution Observation</title>

   <!-- Checking undefined contents for template/element @isClosed="true". Match context that we did not already match -->
   <rule fpi="RUL-QQQ"
         context="*[hl7:observation[hl7:templateId[@root = '1.2.40.0.34.6.0.11.3.89'] and hl7:templateId[@root = '2.16.840.1.113883.10.20.36.6'][@extension = '2015-08-17']]]/*[not(@xsi:nil = 'true')][not(self::hl7:observation[hl7:templateId[@root = '1.2.40.0.34.6.0.11.3.89'] and hl7:templateId[@root = '2.16.840.1.113883.10.20.36.6'][@extension = '2015-08-17']])]"
         id="d41e55964-true-d3612614e0">
      <assert role="error"
              see="http://elga.art-decor.org/elgatgd-html-20240709T111220/tmp-1.2.40.0.34.6.0.11.3.89-2021-02-18T133037.html"
              test="not(.)">(atcdabbr_entry_DeviceResolutionObservation)/d41e55964-true-d3612614e0: '<value-of select="name(..)"/>' ist als geschlossen definiert und dieses Element '<name/>' ist nicht erlaubt oder nicht mit diesem Inhalt erlaubt. Dies kann templateId, code oder id betreffen. Erwartet:  hl7:observation[hl7:templateId[@root = '1.2.40.0.34.6.0.11.3.89'] and hl7:templateId[@root = '2.16.840.1.113883.10.20.36.6'][@extension = '2015-08-17']] (rule-reference: d41e55964-true-d3612614e0)</assert>
   </rule>

   <!-- Checking undefined contents for template/element @isClosed="true". Match context that we did not already match -->
   <rule fpi="RUL-QQQ"
         context="*[hl7:observation[hl7:templateId[@root = '1.2.40.0.34.6.0.11.3.89'] and hl7:templateId[@root = '2.16.840.1.113883.10.20.36.6'][@extension = '2015-08-17']]]/hl7:observation[hl7:templateId[@root = '1.2.40.0.34.6.0.11.3.89'] and hl7:templateId[@root = '2.16.840.1.113883.10.20.36.6'][@extension = '2015-08-17']]/*[not(@xsi:nil = 'true')][not(self::hl7:templateId[@root = '1.2.40.0.34.6.0.11.3.89'] | self::hl7:templateId[@root = '2.16.840.1.113883.10.20.36.6'][@extension = '2015-08-17'] | self::hl7:code[(@code = '17441009' and @codeSystem = '2.16.840.1.113883.6.9')] | self::hl7:text[not(@nullFlavor)] | self::hl7:value[resolve-QName(@xsi:type, .) = QName('urn:hl7-org:v3', 'PQ')] | self::hl7:value[resolve-QName(@xsi:type, .) = QName('urn:hl7-org:v3', 'ST')])]"
         id="d41e56004-true-d3612655e0">
      <assert role="error"
              see="http://elga.art-decor.org/elgatgd-html-20240709T111220/tmp-1.2.40.0.34.6.0.11.3.89-2021-02-18T133037.html"
              test="not(.)">(atcdabbr_entry_DeviceResolutionObservation)/d41e56004-true-d3612655e0: '<value-of select="name(..)"/>' ist als geschlossen definiert und dieses Element '<name/>' ist nicht erlaubt oder nicht mit diesem Inhalt erlaubt. Dies kann templateId, code oder id betreffen. Erwartet:  hl7:templateId[@root = '1.2.40.0.34.6.0.11.3.89'] | hl7:templateId[@root = '2.16.840.1.113883.10.20.36.6'][@extension = '2015-08-17'] | hl7:code[(@code = '17441009' and @codeSystem = '2.16.840.1.113883.6.9')] | hl7:text[not(@nullFlavor)] | hl7:value[resolve-QName(@xsi:type, .) = QName('urn:hl7-org:v3', 'PQ')] | hl7:value[resolve-QName(@xsi:type, .) = QName('urn:hl7-org:v3', 'ST')] (rule-reference: d41e56004-true-d3612655e0)</assert>
   </rule>

   <!-- Checking undefined contents for template/element @isClosed="true". Match context that we did not already match -->
   <rule fpi="RUL-QQQ"
         context="*[hl7:observation[hl7:templateId[@root = '1.2.40.0.34.6.0.11.3.89'] and hl7:templateId[@root = '2.16.840.1.113883.10.20.36.6'][@extension = '2015-08-17']]]/hl7:observation[hl7:templateId[@root = '1.2.40.0.34.6.0.11.3.89'] and hl7:templateId[@root = '2.16.840.1.113883.10.20.36.6'][@extension = '2015-08-17']]/hl7:code[(@code = '17441009' and @codeSystem = '2.16.840.1.113883.6.9')]/*[not(@xsi:nil = 'true')][not(self::hl7:translation | self::ips:designation)]"
         id="d41e56030-true-d3612687e0">
      <assert role="error"
              see="http://elga.art-decor.org/elgatgd-html-20240709T111220/tmp-1.2.40.0.34.6.0.11.3.89-2021-02-18T133037.html"
              test="not(.)">(atcdabbr_entry_DeviceResolutionObservation)/d41e56030-true-d3612687e0: '<value-of select="name(..)"/>' ist als geschlossen definiert und dieses Element '<name/>' ist nicht erlaubt oder nicht mit diesem Inhalt erlaubt. Dies kann templateId, code oder id betreffen. Erwartet:  hl7:translation | ips:designation (rule-reference: d41e56030-true-d3612687e0)</assert>
   </rule>

   <!-- Checking undefined contents for template/element @isClosed="true". Match context that we did not already match -->
   <rule fpi="RUL-QQQ"
         context="*[hl7:observation[hl7:templateId[@root = '1.2.40.0.34.6.0.11.3.89'] and hl7:templateId[@root = '2.16.840.1.113883.10.20.36.6'][@extension = '2015-08-17']]]/hl7:observation[hl7:templateId[@root = '1.2.40.0.34.6.0.11.3.89'] and hl7:templateId[@root = '2.16.840.1.113883.10.20.36.6'][@extension = '2015-08-17']]/hl7:text[not(@nullFlavor)]/*[not(@xsi:nil = 'true')][not(self::hl7:reference[not(@nullFlavor)])]"
         id="d41e56065-true-d3612711e0">
      <assert role="error"
              see="http://elga.art-decor.org/elgatgd-html-20240709T111220/tmp-1.2.40.0.34.6.0.11.3.89-2021-02-18T133037.html"
              test="not(.)">(atcdabbr_entry_DeviceResolutionObservation)/d41e56065-true-d3612711e0: '<value-of select="name(..)"/>' ist als geschlossen definiert und dieses Element '<name/>' ist nicht erlaubt oder nicht mit diesem Inhalt erlaubt. Dies kann templateId, code oder id betreffen. Erwartet:  hl7:reference[not(@nullFlavor)] (rule-reference: d41e56065-true-d3612711e0)</assert>
   </rule>
</pattern>
