<?xml version="1.0" encoding="UTF-8"?>
<!--
Template derived pattern
===========================================
ID: 1.2.40.0.34.6.0.11.2.42
Name: Termine, Kontrollen, Wiederbestellungen
Description: 
-->
<pattern xmlns="http://purl.oclc.org/dsdl/schematron"
         id="template-1.2.40.0.34.6.0.11.2.42-2019-07-18T102350-closed">
   <title>Termine, Kontrollen, Wiederbestellungen</title>

   <!-- Checking undefined contents for template/element @isClosed="true". Match context that we did not already match -->
   <rule fpi="RUL-QQQ"
         context="*[hl7:section[hl7:templateId[@root = '1.2.40.0.34.6.0.11.2.42']]]/*[not(@xsi:nil = 'true')][not(self::hl7:section[hl7:templateId[@root = '1.2.40.0.34.6.0.11.2.42']])]"
         id="d42e20853-true-d1011193e0">
      <assert role="error"
              see="https://elga.art-decor.org/elgabgd-html-20250116T125424/tmp-1.2.40.0.34.6.0.11.2.42-2019-07-18T102350.html"
              test="not(.)">(elgagab_section_TermineKontrollenWiederbestellungen)/d42e20853-true-d1011193e0: '<value-of select="name(..)"/>' ist als geschlossen definiert und dieses Element '<name/>' ist nicht erlaubt oder nicht mit diesem Inhalt erlaubt. Dies kann templateId, code oder id betreffen. Erwartet:  hl7:section[hl7:templateId[@root = '1.2.40.0.34.6.0.11.2.42']] (rule-reference: d42e20853-true-d1011193e0)</assert>
   </rule>

   <!-- Checking undefined contents for template/element @isClosed="true". Match context that we did not already match -->
   <rule fpi="RUL-QQQ"
         context="*[hl7:section[hl7:templateId[@root = '1.2.40.0.34.6.0.11.2.42']]]/hl7:section[hl7:templateId[@root = '1.2.40.0.34.6.0.11.2.42']]/*[not(@xsi:nil = 'true')][not(self::hl7:templateId[@root = '1.2.40.0.34.6.0.11.2.42'] | self::hl7:id[not(@nullFlavor)] | self::hl7:code[(@code = '21979-0' and @codeSystem = '2.16.840.1.113883.6.1')] | self::hl7:title[not(@nullFlavor)] | self::hl7:text[not(@nullFlavor)] | self::hl7:author[hl7:assignedAuthor] | self::hl7:informant | self::hl7:component)]"
         id="d42e20890-true-d1011507e0">
      <assert role="error"
              see="https://elga.art-decor.org/elgabgd-html-20250116T125424/tmp-1.2.40.0.34.6.0.11.2.42-2019-07-18T102350.html"
              test="not(.)">(elgagab_section_TermineKontrollenWiederbestellungen)/d42e20890-true-d1011507e0: '<value-of select="name(..)"/>' ist als geschlossen definiert und dieses Element '<name/>' ist nicht erlaubt oder nicht mit diesem Inhalt erlaubt. Dies kann templateId, code oder id betreffen. Erwartet:  hl7:templateId[@root = '1.2.40.0.34.6.0.11.2.42'] | hl7:id[not(@nullFlavor)] | hl7:code[(@code = '21979-0' and @codeSystem = '2.16.840.1.113883.6.1')] | hl7:title[not(@nullFlavor)] | hl7:text[not(@nullFlavor)] | hl7:author[hl7:assignedAuthor] | hl7:informant | hl7:component (rule-reference: d42e20890-true-d1011507e0)</assert>
   </rule>

   <!-- Checking undefined contents for template/element @isClosed="true". Match context that we did not already match -->
   <rule fpi="RUL-QQQ"
         context="*[hl7:section[hl7:templateId[@root = '1.2.40.0.34.6.0.11.2.42']]]/hl7:section[hl7:templateId[@root = '1.2.40.0.34.6.0.11.2.42']]/hl7:author[hl7:assignedAuthor]/*[not(@xsi:nil = 'true')][not(self::hl7:functionCode | self::hl7:time[not(@nullFlavor)] | self::hl7:time[@nullFlavor='UNK'] | self::hl7:assignedAuthor)]"
         id="d42e20921-true-d1011659e0">
      <assert role="error"
              see="https://elga.art-decor.org/elgabgd-html-20250116T125424/tmp-1.2.40.0.34.6.0.11.2.42-2019-07-18T102350.html"
              test="not(.)">(elgagab_section_TermineKontrollenWiederbestellungen)/d42e20921-true-d1011659e0: '<value-of select="name(..)"/>' ist als geschlossen definiert und dieses Element '<name/>' ist nicht erlaubt oder nicht mit diesem Inhalt erlaubt. Dies kann templateId, code oder id betreffen. Erwartet:  hl7:functionCode | hl7:time[not(@nullFlavor)] | hl7:time[@nullFlavor='UNK'] | hl7:assignedAuthor (rule-reference: d42e20921-true-d1011659e0)</assert>
   </rule>

   <!-- Checking undefined contents for template/element @isClosed="true". Match context that we did not already match -->
   <rule fpi="RUL-QQQ"
         context="*[hl7:section[hl7:templateId[@root = '1.2.40.0.34.6.0.11.2.42']]]/hl7:section[hl7:templateId[@root = '1.2.40.0.34.6.0.11.2.42']]/hl7:author[hl7:assignedAuthor]/hl7:assignedAuthor/*[not(@xsi:nil = 'true')][not(self::hl7:id[not(@nullFlavor)] | self::hl7:id[@nullFlavor='UNK'] | self::hl7:code[not(@nullFlavor)] | self::hl7:addr[not(@nullFlavor)] | self::hl7:telecom[not(@nullFlavor)] | self::hl7:assignedPerson | self::hl7:assignedAuthoringDevice | self::hl7:representedOrganization)]"
         id="d1011537e45-true-d1011767e0">
      <assert role="error"
              see="https://elga.art-decor.org/elgabgd-html-20250116T125424/tmp-1.2.40.0.34.6.0.11.2.42-2019-07-18T102350.html"
              test="not(.)">(elgagab_section_TermineKontrollenWiederbestellungen)/d1011537e45-true-d1011767e0: '<value-of select="name(..)"/>' ist als geschlossen definiert und dieses Element '<name/>' ist nicht erlaubt oder nicht mit diesem Inhalt erlaubt. Dies kann templateId, code oder id betreffen. Erwartet:  hl7:id[not(@nullFlavor)] | hl7:id[@nullFlavor='UNK'] | hl7:code[not(@nullFlavor)] | hl7:addr[not(@nullFlavor)] | hl7:telecom[not(@nullFlavor)] | hl7:assignedPerson | hl7:assignedAuthoringDevice | hl7:representedOrganization (rule-reference: d1011537e45-true-d1011767e0)</assert>
   </rule>

   <!-- Checking undefined contents for template/element @isClosed="true". Match context that we did not already match -->
   <rule fpi="RUL-QQQ"
         context="*[hl7:section[hl7:templateId[@root = '1.2.40.0.34.6.0.11.2.42']]]/hl7:section[hl7:templateId[@root = '1.2.40.0.34.6.0.11.2.42']]/hl7:author[hl7:assignedAuthor]/hl7:assignedAuthor/hl7:addr[not(@nullFlavor)]/*[not(@xsi:nil = 'true')][not(self::hl7:streetAddressLine | self::hl7:streetName | self::hl7:houseNumber | self::hl7:postalCode[not(@nullFlavor)] | self::hl7:city[not(@nullFlavor)] | self::hl7:state | self::hl7:country[not(@nullFlavor)] | self::hl7:additionalLocator)]"
         id="d1011537e64-true-d1011826e0">
      <assert role="error"
              see="https://elga.art-decor.org/elgabgd-html-20250116T125424/tmp-1.2.40.0.34.6.0.11.2.42-2019-07-18T102350.html"
              test="not(.)">(elgagab_section_TermineKontrollenWiederbestellungen)/d1011537e64-true-d1011826e0: '<value-of select="name(..)"/>' ist als geschlossen definiert und dieses Element '<name/>' ist nicht erlaubt oder nicht mit diesem Inhalt erlaubt. Dies kann templateId, code oder id betreffen. Erwartet:  hl7:streetAddressLine | hl7:streetName | hl7:houseNumber | hl7:postalCode[not(@nullFlavor)] | hl7:city[not(@nullFlavor)] | hl7:state | hl7:country[not(@nullFlavor)] | hl7:additionalLocator (rule-reference: d1011537e64-true-d1011826e0)</assert>
   </rule>

   <!-- Checking undefined contents for template/element @isClosed="true". Match context that we did not already match -->
   <rule fpi="RUL-QQQ"
         context="*[hl7:section[hl7:templateId[@root = '1.2.40.0.34.6.0.11.2.42']]]/hl7:section[hl7:templateId[@root = '1.2.40.0.34.6.0.11.2.42']]/hl7:author[hl7:assignedAuthor]/hl7:assignedAuthor/hl7:assignedPerson/*[not(@xsi:nil = 'true')][not(self::hl7:name[not(@nullFlavor)] | self::hl7:name[@nullFlavor='UNK'] | self::hl7:name[@nullFlavor='MSK'])]"
         id="d1011537e110-true-d1011883e0">
      <assert role="error"
              see="https://elga.art-decor.org/elgabgd-html-20250116T125424/tmp-1.2.40.0.34.6.0.11.2.42-2019-07-18T102350.html"
              test="not(.)">(elgagab_section_TermineKontrollenWiederbestellungen)/d1011537e110-true-d1011883e0: '<value-of select="name(..)"/>' ist als geschlossen definiert und dieses Element '<name/>' ist nicht erlaubt oder nicht mit diesem Inhalt erlaubt. Dies kann templateId, code oder id betreffen. Erwartet:  hl7:name[not(@nullFlavor)] | hl7:name[@nullFlavor='UNK'] | hl7:name[@nullFlavor='MSK'] (rule-reference: d1011537e110-true-d1011883e0)</assert>
   </rule>

   <!-- Checking undefined contents for template/element @isClosed="true". Match context that we did not already match -->
   <rule fpi="RUL-QQQ"
         context="*[hl7:section[hl7:templateId[@root = '1.2.40.0.34.6.0.11.2.42']]]/hl7:section[hl7:templateId[@root = '1.2.40.0.34.6.0.11.2.42']]/hl7:author[hl7:assignedAuthor]/hl7:assignedAuthor/hl7:assignedPerson/hl7:name[not(@nullFlavor)]/*[not(@xsi:nil = 'true')][not(self::hl7:prefix | self::hl7:family[not(@nullFlavor)] | self::hl7:given[not(@nullFlavor)] | self::hl7:suffix)]"
         id="d1011887e92-true-d1011917e0">
      <assert role="error"
              see="https://elga.art-decor.org/elgabgd-html-20250116T125424/tmp-1.2.40.0.34.6.0.11.9.6-2023-03-31T111555.html"
              test="not(.)">(atcdabbr_other_PersonNameCompilationG2)/d1011887e92-true-d1011917e0: '<value-of select="name(..)"/>' ist als geschlossen definiert und dieses Element '<name/>' ist nicht erlaubt oder nicht mit diesem Inhalt erlaubt. Dies kann templateId, code oder id betreffen. Erwartet:  hl7:prefix | hl7:family[not(@nullFlavor)] | hl7:given[not(@nullFlavor)] | hl7:suffix (rule-reference: d1011887e92-true-d1011917e0)</assert>
   </rule>

   <!-- Checking undefined contents for template/element @isClosed="true". Match context that we did not already match -->
   <rule fpi="RUL-QQQ"
         context="*[hl7:section[hl7:templateId[@root = '1.2.40.0.34.6.0.11.2.42']]]/hl7:section[hl7:templateId[@root = '1.2.40.0.34.6.0.11.2.42']]/hl7:author[hl7:assignedAuthor]/hl7:assignedAuthor/hl7:assignedAuthoringDevice/*[not(@xsi:nil = 'true')][not(self::hl7:manufacturerModelName[not(@nullFlavor)] | self::hl7:softwareName[not(@nullFlavor)])]"
         id="d1011537e133-true-d1011965e0">
      <assert role="error"
              see="https://elga.art-decor.org/elgabgd-html-20250116T125424/tmp-1.2.40.0.34.6.0.11.2.42-2019-07-18T102350.html"
              test="not(.)">(elgagab_section_TermineKontrollenWiederbestellungen)/d1011537e133-true-d1011965e0: '<value-of select="name(..)"/>' ist als geschlossen definiert und dieses Element '<name/>' ist nicht erlaubt oder nicht mit diesem Inhalt erlaubt. Dies kann templateId, code oder id betreffen. Erwartet:  hl7:manufacturerModelName[not(@nullFlavor)] | hl7:softwareName[not(@nullFlavor)] (rule-reference: d1011537e133-true-d1011965e0)</assert>
   </rule>

   <!-- Checking undefined contents for template/element @isClosed="true". Match context that we did not already match -->
   <rule fpi="RUL-QQQ"
         context="*[hl7:section[hl7:templateId[@root = '1.2.40.0.34.6.0.11.2.42']]]/hl7:section[hl7:templateId[@root = '1.2.40.0.34.6.0.11.2.42']]/hl7:author[hl7:assignedAuthor]/hl7:assignedAuthor/hl7:representedOrganization/*[not(@xsi:nil = 'true')][not(self::hl7:id[not(@nullFlavor)] | self::hl7:name[not(@nullFlavor)] | self::hl7:telecom[not(@nullFlavor)] | self::hl7:addr[not(@nullFlavor)])]"
         id="d1011537e149-true-d1012010e0">
      <assert role="error"
              see="https://elga.art-decor.org/elgabgd-html-20250116T125424/tmp-1.2.40.0.34.6.0.11.2.42-2019-07-18T102350.html"
              test="not(.)">(elgagab_section_TermineKontrollenWiederbestellungen)/d1011537e149-true-d1012010e0: '<value-of select="name(..)"/>' ist als geschlossen definiert und dieses Element '<name/>' ist nicht erlaubt oder nicht mit diesem Inhalt erlaubt. Dies kann templateId, code oder id betreffen. Erwartet:  hl7:id[not(@nullFlavor)] | hl7:name[not(@nullFlavor)] | hl7:telecom[not(@nullFlavor)] | hl7:addr[not(@nullFlavor)] (rule-reference: d1011537e149-true-d1012010e0)</assert>
   </rule>

   <!-- Checking undefined contents for template/element @isClosed="true". Match context that we did not already match -->
   <rule fpi="RUL-QQQ"
         context="*[hl7:section[hl7:templateId[@root = '1.2.40.0.34.6.0.11.2.42']]]/hl7:section[hl7:templateId[@root = '1.2.40.0.34.6.0.11.2.42']]/hl7:author[hl7:assignedAuthor]/hl7:assignedAuthor/hl7:representedOrganization/hl7:addr[not(@nullFlavor)]/*[not(@xsi:nil = 'true')][not(self::hl7:streetAddressLine | self::hl7:streetName | self::hl7:houseNumber | self::hl7:postalCode[not(@nullFlavor)] | self::hl7:city[not(@nullFlavor)] | self::hl7:state | self::hl7:country[not(@nullFlavor)] | self::hl7:additionalLocator)]"
         id="d1011980e67-true-d1012073e0">
      <assert role="error"
              see="https://elga.art-decor.org/elgabgd-html-20250116T125424/tmp-1.2.40.0.34.6.0.11.2.42-2019-07-18T102350.html"
              test="not(.)">(elgagab_section_TermineKontrollenWiederbestellungen)/d1011980e67-true-d1012073e0: '<value-of select="name(..)"/>' ist als geschlossen definiert und dieses Element '<name/>' ist nicht erlaubt oder nicht mit diesem Inhalt erlaubt. Dies kann templateId, code oder id betreffen. Erwartet:  hl7:streetAddressLine | hl7:streetName | hl7:houseNumber | hl7:postalCode[not(@nullFlavor)] | hl7:city[not(@nullFlavor)] | hl7:state | hl7:country[not(@nullFlavor)] | hl7:additionalLocator (rule-reference: d1011980e67-true-d1012073e0)</assert>
   </rule>

   <!-- Checking undefined contents for template/element @isClosed="true". Match context that we did not already match -->
   <rule fpi="RUL-QQQ"
         context="*[hl7:section[hl7:templateId[@root = '1.2.40.0.34.6.0.11.2.42']]]/hl7:section[hl7:templateId[@root = '1.2.40.0.34.6.0.11.2.42']]/hl7:informant/*[not(@xsi:nil = 'true')][not(self::hl7:assignedEntity | self::hl7:relatedEntity[@classCode = 'PRS'])]"
         id="d42e20927-true-d1012241e0">
      <assert role="error"
              see="https://elga.art-decor.org/elgabgd-html-20250116T125424/tmp-1.2.40.0.34.6.0.11.2.42-2019-07-18T102350.html"
              test="not(.)">(elgagab_section_TermineKontrollenWiederbestellungen)/d42e20927-true-d1012241e0: '<value-of select="name(..)"/>' ist als geschlossen definiert und dieses Element '<name/>' ist nicht erlaubt oder nicht mit diesem Inhalt erlaubt. Dies kann templateId, code oder id betreffen. Erwartet:  hl7:assignedEntity | hl7:relatedEntity[@classCode = 'PRS'] (rule-reference: d42e20927-true-d1012241e0)</assert>
   </rule>

   <!-- Checking undefined contents for template/element @isClosed="true". Match context that we did not already match -->
   <rule fpi="RUL-QQQ"
         context="*[hl7:section[hl7:templateId[@root = '1.2.40.0.34.6.0.11.2.42']]]/hl7:section[hl7:templateId[@root = '1.2.40.0.34.6.0.11.2.42']]/hl7:informant/hl7:assignedEntity/*[not(@xsi:nil = 'true')][not(self::hl7:id[not(@nullFlavor)] | self::hl7:id[@nullFlavor='NI'] | self::hl7:id[@nullFlavor='UNK'] | self::hl7:code | self::hl7:addr | self::hl7:telecom | self::hl7:assignedPerson | self::hl7:assignedPerson | self::hl7:representedOrganization)]"
         id="d1012118e15-true-d1012373e0">
      <assert role="error"
              see="https://elga.art-decor.org/elgabgd-html-20250116T125424/tmp-1.2.40.0.34.6.0.11.2.42-2019-07-18T102350.html"
              test="not(.)">(elgagab_section_TermineKontrollenWiederbestellungen)/d1012118e15-true-d1012373e0: '<value-of select="name(..)"/>' ist als geschlossen definiert und dieses Element '<name/>' ist nicht erlaubt oder nicht mit diesem Inhalt erlaubt. Dies kann templateId, code oder id betreffen. Erwartet:  hl7:id[not(@nullFlavor)] | hl7:id[@nullFlavor='NI'] | hl7:id[@nullFlavor='UNK'] | hl7:code | hl7:addr | hl7:telecom | hl7:assignedPerson | hl7:assignedPerson | hl7:representedOrganization (rule-reference: d1012118e15-true-d1012373e0)</assert>
   </rule>

   <!-- Checking undefined contents for template/element @isClosed="true". Match context that we did not already match -->
   <rule fpi="RUL-QQQ"
         context="*[hl7:section[hl7:templateId[@root = '1.2.40.0.34.6.0.11.2.42']]]/hl7:section[hl7:templateId[@root = '1.2.40.0.34.6.0.11.2.42']]/hl7:informant/hl7:assignedEntity/hl7:addr/*[not(@xsi:nil = 'true')][not(self::hl7:streetAddressLine | self::hl7:streetName | self::hl7:houseNumber | self::hl7:postalCode | self::hl7:city | self::hl7:state | self::hl7:country | self::hl7:additionalLocator)]"
         id="d1012246e50-true-d1012439e0">
      <assert role="error"
              see="https://elga.art-decor.org/elgabgd-html-20250116T125424/tmp-1.2.40.0.34.6.0.11.2.42-2019-07-18T102350.html"
              test="not(.)">(elgagab_section_TermineKontrollenWiederbestellungen)/d1012246e50-true-d1012439e0: '<value-of select="name(..)"/>' ist als geschlossen definiert und dieses Element '<name/>' ist nicht erlaubt oder nicht mit diesem Inhalt erlaubt. Dies kann templateId, code oder id betreffen. Erwartet:  hl7:streetAddressLine | hl7:streetName | hl7:houseNumber | hl7:postalCode | hl7:city | hl7:state | hl7:country | hl7:additionalLocator (rule-reference: d1012246e50-true-d1012439e0)</assert>
   </rule>

   <!-- Checking undefined contents for template/element @isClosed="true". Match context that we did not already match -->
   <rule fpi="RUL-QQQ"
         context="*[hl7:section[hl7:templateId[@root = '1.2.40.0.34.6.0.11.2.42']]]/hl7:section[hl7:templateId[@root = '1.2.40.0.34.6.0.11.2.42']]/hl7:informant/hl7:assignedEntity/hl7:assignedPerson/*[not(@xsi:nil = 'true')][not(self::hl7:name[not(@nullFlavor)])]"
         id="d1012246e120-true-d1012501e0">
      <assert role="error"
              see="https://elga.art-decor.org/elgabgd-html-20250116T125424/tmp-1.2.40.0.34.6.0.11.2.42-2019-07-18T102350.html"
              test="not(.)">(elgagab_section_TermineKontrollenWiederbestellungen)/d1012246e120-true-d1012501e0: '<value-of select="name(..)"/>' ist als geschlossen definiert und dieses Element '<name/>' ist nicht erlaubt oder nicht mit diesem Inhalt erlaubt. Dies kann templateId, code oder id betreffen. Erwartet:  hl7:name[not(@nullFlavor)] (rule-reference: d1012246e120-true-d1012501e0)</assert>
   </rule>

   <!-- Checking undefined contents for template/element @isClosed="true". Match context that we did not already match -->
   <rule fpi="RUL-QQQ"
         context="*[hl7:section[hl7:templateId[@root = '1.2.40.0.34.6.0.11.2.42']]]/hl7:section[hl7:templateId[@root = '1.2.40.0.34.6.0.11.2.42']]/hl7:informant/hl7:assignedEntity/hl7:assignedPerson/*[not(@xsi:nil = 'true')][not(self::hl7:name[not(@nullFlavor)])]"
         id="d1012246e132-true-d1012523e0">
      <assert role="error"
              see="https://elga.art-decor.org/elgabgd-html-20250116T125424/tmp-1.2.40.0.34.6.0.11.2.42-2019-07-18T102350.html"
              test="not(.)">(elgagab_section_TermineKontrollenWiederbestellungen)/d1012246e132-true-d1012523e0: '<value-of select="name(..)"/>' ist als geschlossen definiert und dieses Element '<name/>' ist nicht erlaubt oder nicht mit diesem Inhalt erlaubt. Dies kann templateId, code oder id betreffen. Erwartet:  hl7:name[not(@nullFlavor)] (rule-reference: d1012246e132-true-d1012523e0)</assert>
   </rule>

   <!-- Checking undefined contents for template/element @isClosed="true". Match context that we did not already match -->
   <rule fpi="RUL-QQQ"
         context="*[hl7:section[hl7:templateId[@root = '1.2.40.0.34.6.0.11.2.42']]]/hl7:section[hl7:templateId[@root = '1.2.40.0.34.6.0.11.2.42']]/hl7:informant/hl7:assignedEntity/hl7:assignedPerson/hl7:name[not(@nullFlavor)]/*[not(@xsi:nil = 'true')][not(self::hl7:prefix | self::hl7:family[not(@nullFlavor)] | self::hl7:given[not(@nullFlavor)] | self::hl7:suffix)]"
         id="d1012511e12-true-d1012552e0">
      <assert role="error"
              see="https://elga.art-decor.org/elgabgd-html-20250116T125424/tmp-1.2.40.0.34.6.0.11.2.42-2019-07-18T102350.html"
              test="not(.)">(elgagab_section_TermineKontrollenWiederbestellungen)/d1012511e12-true-d1012552e0: '<value-of select="name(..)"/>' ist als geschlossen definiert und dieses Element '<name/>' ist nicht erlaubt oder nicht mit diesem Inhalt erlaubt. Dies kann templateId, code oder id betreffen. Erwartet:  hl7:prefix | hl7:family[not(@nullFlavor)] | hl7:given[not(@nullFlavor)] | hl7:suffix (rule-reference: d1012511e12-true-d1012552e0)</assert>
   </rule>

   <!-- Checking undefined contents for template/element @isClosed="true". Match context that we did not already match -->
   <rule fpi="RUL-QQQ"
         context="*[hl7:section[hl7:templateId[@root = '1.2.40.0.34.6.0.11.2.42']]]/hl7:section[hl7:templateId[@root = '1.2.40.0.34.6.0.11.2.42']]/hl7:informant/hl7:assignedEntity/hl7:representedOrganization/*[not(@xsi:nil = 'true')][not(self::hl7:id[not(@nullFlavor)] | self::hl7:name[not(@nullFlavor)] | self::hl7:telecom[not(@nullFlavor)] | self::hl7:addr[not(@nullFlavor)])]"
         id="d1012246e143-true-d1012603e0">
      <assert role="error"
              see="https://elga.art-decor.org/elgabgd-html-20250116T125424/tmp-1.2.40.0.34.6.0.11.2.42-2019-07-18T102350.html"
              test="not(.)">(elgagab_section_TermineKontrollenWiederbestellungen)/d1012246e143-true-d1012603e0: '<value-of select="name(..)"/>' ist als geschlossen definiert und dieses Element '<name/>' ist nicht erlaubt oder nicht mit diesem Inhalt erlaubt. Dies kann templateId, code oder id betreffen. Erwartet:  hl7:id[not(@nullFlavor)] | hl7:name[not(@nullFlavor)] | hl7:telecom[not(@nullFlavor)] | hl7:addr[not(@nullFlavor)] (rule-reference: d1012246e143-true-d1012603e0)</assert>
   </rule>

   <!-- Checking undefined contents for template/element @isClosed="true". Match context that we did not already match -->
   <rule fpi="RUL-QQQ"
         context="*[hl7:section[hl7:templateId[@root = '1.2.40.0.34.6.0.11.2.42']]]/hl7:section[hl7:templateId[@root = '1.2.40.0.34.6.0.11.2.42']]/hl7:informant/hl7:assignedEntity/hl7:representedOrganization/hl7:addr[not(@nullFlavor)]/*[not(@xsi:nil = 'true')][not(self::hl7:streetAddressLine | self::hl7:streetName | self::hl7:houseNumber | self::hl7:postalCode | self::hl7:city | self::hl7:state | self::hl7:country | self::hl7:additionalLocator)]"
         id="d1012577e58-true-d1012664e0">
      <assert role="error"
              see="https://elga.art-decor.org/elgabgd-html-20250116T125424/tmp-1.2.40.0.34.6.0.11.2.42-2019-07-18T102350.html"
              test="not(.)">(elgagab_section_TermineKontrollenWiederbestellungen)/d1012577e58-true-d1012664e0: '<value-of select="name(..)"/>' ist als geschlossen definiert und dieses Element '<name/>' ist nicht erlaubt oder nicht mit diesem Inhalt erlaubt. Dies kann templateId, code oder id betreffen. Erwartet:  hl7:streetAddressLine | hl7:streetName | hl7:houseNumber | hl7:postalCode | hl7:city | hl7:state | hl7:country | hl7:additionalLocator (rule-reference: d1012577e58-true-d1012664e0)</assert>
   </rule>

   <!-- Checking undefined contents for template/element @isClosed="true". Match context that we did not already match -->
   <rule fpi="RUL-QQQ"
         context="*[hl7:section[hl7:templateId[@root = '1.2.40.0.34.6.0.11.2.42']]]/hl7:section[hl7:templateId[@root = '1.2.40.0.34.6.0.11.2.42']]/hl7:informant/hl7:relatedEntity[@classCode = 'PRS']/*[not(@xsi:nil = 'true')][not(self::hl7:code[not(@nullFlavor)] | self::hl7:addr[not(@nullFlavor)] | self::hl7:telecom[not(@nullFlavor)] | self::hl7:relatedPerson)]"
         id="d1012118e17-true-d1012741e0">
      <assert role="error"
              see="https://elga.art-decor.org/elgabgd-html-20250116T125424/tmp-1.2.40.0.34.6.0.11.2.42-2019-07-18T102350.html"
              test="not(.)">(elgagab_section_TermineKontrollenWiederbestellungen)/d1012118e17-true-d1012741e0: '<value-of select="name(..)"/>' ist als geschlossen definiert und dieses Element '<name/>' ist nicht erlaubt oder nicht mit diesem Inhalt erlaubt. Dies kann templateId, code oder id betreffen. Erwartet:  hl7:code[not(@nullFlavor)] | hl7:addr[not(@nullFlavor)] | hl7:telecom[not(@nullFlavor)] | hl7:relatedPerson (rule-reference: d1012118e17-true-d1012741e0)</assert>
   </rule>

   <!-- Checking undefined contents for template/element @isClosed="true". Match context that we did not already match -->
   <rule fpi="RUL-QQQ"
         context="*[hl7:section[hl7:templateId[@root = '1.2.40.0.34.6.0.11.2.42']]]/hl7:section[hl7:templateId[@root = '1.2.40.0.34.6.0.11.2.42']]/hl7:informant/hl7:relatedEntity[@classCode = 'PRS']/hl7:addr[not(@nullFlavor)]/*[not(@xsi:nil = 'true')][not(self::hl7:streetAddressLine | self::hl7:streetName | self::hl7:houseNumber | self::hl7:postalCode | self::hl7:city | self::hl7:state | self::hl7:country | self::hl7:additionalLocator)]"
         id="d1012118e26-true-d1012794e0">
      <assert role="error"
              see="https://elga.art-decor.org/elgabgd-html-20250116T125424/tmp-1.2.40.0.34.6.0.11.2.42-2019-07-18T102350.html"
              test="not(.)">(elgagab_section_TermineKontrollenWiederbestellungen)/d1012118e26-true-d1012794e0: '<value-of select="name(..)"/>' ist als geschlossen definiert und dieses Element '<name/>' ist nicht erlaubt oder nicht mit diesem Inhalt erlaubt. Dies kann templateId, code oder id betreffen. Erwartet:  hl7:streetAddressLine | hl7:streetName | hl7:houseNumber | hl7:postalCode | hl7:city | hl7:state | hl7:country | hl7:additionalLocator (rule-reference: d1012118e26-true-d1012794e0)</assert>
   </rule>

   <!-- Checking undefined contents for template/element @isClosed="true". Match context that we did not already match -->
   <rule fpi="RUL-QQQ"
         context="*[hl7:section[hl7:templateId[@root = '1.2.40.0.34.6.0.11.2.42']]]/hl7:section[hl7:templateId[@root = '1.2.40.0.34.6.0.11.2.42']]/hl7:informant/hl7:relatedEntity[@classCode = 'PRS']/hl7:relatedPerson/*[not(@xsi:nil = 'true')][not(self::hl7:name[not(@nullFlavor)] | self::hl7:name[@nullFlavor='UNK'] | self::hl7:name[@nullFlavor='MSK'])]"
         id="d1012118e30-true-d1012849e0">
      <assert role="error"
              see="https://elga.art-decor.org/elgabgd-html-20250116T125424/tmp-1.2.40.0.34.6.0.11.2.42-2019-07-18T102350.html"
              test="not(.)">(elgagab_section_TermineKontrollenWiederbestellungen)/d1012118e30-true-d1012849e0: '<value-of select="name(..)"/>' ist als geschlossen definiert und dieses Element '<name/>' ist nicht erlaubt oder nicht mit diesem Inhalt erlaubt. Dies kann templateId, code oder id betreffen. Erwartet:  hl7:name[not(@nullFlavor)] | hl7:name[@nullFlavor='UNK'] | hl7:name[@nullFlavor='MSK'] (rule-reference: d1012118e30-true-d1012849e0)</assert>
   </rule>

   <!-- Checking undefined contents for template/element @isClosed="true". Match context that we did not already match -->
   <rule fpi="RUL-QQQ"
         context="*[hl7:section[hl7:templateId[@root = '1.2.40.0.34.6.0.11.2.42']]]/hl7:section[hl7:templateId[@root = '1.2.40.0.34.6.0.11.2.42']]/hl7:informant/hl7:relatedEntity[@classCode = 'PRS']/hl7:relatedPerson/hl7:name[not(@nullFlavor)]/*[not(@xsi:nil = 'true')][not(self::hl7:prefix | self::hl7:family[not(@nullFlavor)] | self::hl7:given[not(@nullFlavor)] | self::hl7:suffix)]"
         id="d1012842e10-true-d1012876e0">
      <assert role="error"
              see="https://elga.art-decor.org/elgabgd-html-20250116T125424/tmp-1.2.40.0.34.6.0.11.2.42-2019-07-18T102350.html"
              test="not(.)">(elgagab_section_TermineKontrollenWiederbestellungen)/d1012842e10-true-d1012876e0: '<value-of select="name(..)"/>' ist als geschlossen definiert und dieses Element '<name/>' ist nicht erlaubt oder nicht mit diesem Inhalt erlaubt. Dies kann templateId, code oder id betreffen. Erwartet:  hl7:prefix | hl7:family[not(@nullFlavor)] | hl7:given[not(@nullFlavor)] | hl7:suffix (rule-reference: d1012842e10-true-d1012876e0)</assert>
   </rule>
</pattern>
