<?xml version="1.0" encoding="UTF-8"?>
<!--
Template derived pattern
===========================================
ID: 1.2.40.0.34.11.13.3.13
Name: Problem Status Observation Entry
Description: Klinischer Status des Problems
-->
<pattern xmlns="http://purl.oclc.org/dsdl/schematron"
         id="template-1.2.40.0.34.11.13.3.13-2017-07-13T210314">
   <title>Problem Status Observation Entry</title>
   <!--
Template derived rules for ID: 1.2.40.0.34.11.13.3.13
Context: *[hl7:observation[hl7:templateId[@root = '1.2.40.0.34.11.13.3.13'] and hl7:templateId[@root = '2.16.840.1.113883.10.20.1.57'] and hl7:templateId[@root = '2.16.840.1.113883.10.20.1.50'] and hl7:templateId[@root = '1.3.6.1.4.1.19376.1.5.3.1.4.1.1']]]
Item: (ProblemStatusObservationEntry)
-->

   <!--
Template derived rules for ID: 1.2.40.0.34.11.13.3.13
Context: *[hl7:observation[hl7:templateId[@root = '1.2.40.0.34.11.13.3.13'] and hl7:templateId[@root = '2.16.840.1.113883.10.20.1.57'] and hl7:templateId[@root = '2.16.840.1.113883.10.20.1.50'] and hl7:templateId[@root = '1.3.6.1.4.1.19376.1.5.3.1.4.1.1']]]/hl7:observation[hl7:templateId[@root = '1.2.40.0.34.11.13.3.13'] and hl7:templateId[@root = '2.16.840.1.113883.10.20.1.57'] and hl7:templateId[@root = '2.16.840.1.113883.10.20.1.50'] and hl7:templateId[@root = '1.3.6.1.4.1.19376.1.5.3.1.4.1.1']]
Item: (ProblemStatusObservationEntry)
-->

   <rule fpi="RULC-1"
         context="*[hl7:observation[hl7:templateId[@root = '1.2.40.0.34.11.13.3.13'] and hl7:templateId[@root = '2.16.840.1.113883.10.20.1.57'] and hl7:templateId[@root = '2.16.840.1.113883.10.20.1.50'] and hl7:templateId[@root = '1.3.6.1.4.1.19376.1.5.3.1.4.1.1']]]/hl7:observation[hl7:templateId[@root = '1.2.40.0.34.11.13.3.13'] and hl7:templateId[@root = '2.16.840.1.113883.10.20.1.57'] and hl7:templateId[@root = '2.16.840.1.113883.10.20.1.50'] and hl7:templateId[@root = '1.3.6.1.4.1.19376.1.5.3.1.4.1.1']]"
         id="d42e537-false-d3626e0">
      <assert role="error"
              see="https://elga.art-decor.org/elgabgd-html-20250116T125424/tmp-1.2.40.0.34.11.13.3.13-2017-07-13T210314.html"
              test="string(@classCode) = ('OBS') or not(@classCode)">(ProblemStatusObservationEntry): Der Wert von classCode MUSS 'OBS' sein. Gefunden: "<value-of select="@classCode"/>"</assert>
      <assert role="error"
              see="https://elga.art-decor.org/elgabgd-html-20250116T125424/tmp-1.2.40.0.34.11.13.3.13-2017-07-13T210314.html"
              test="string(@moodCode) = ('EVN') or not(@moodCode)">(ProblemStatusObservationEntry): Der Wert von moodCode MUSS 'EVN' sein. Gefunden: "<value-of select="@moodCode"/>"</assert>
      <assert role="error"
              see="https://elga.art-decor.org/elgabgd-html-20250116T125424/tmp-1.2.40.0.34.11.13.3.13-2017-07-13T210314.html"
              test="count(hl7:templateId[@root = '1.2.40.0.34.11.13.3.13']) &gt;= 1">(ProblemStatusObservationEntry): Element hl7:templateId[@root = '1.2.40.0.34.11.13.3.13'] ist mandatory [min 1x].</assert>
      <assert role="error"
              see="https://elga.art-decor.org/elgabgd-html-20250116T125424/tmp-1.2.40.0.34.11.13.3.13-2017-07-13T210314.html"
              test="count(hl7:templateId[@root = '1.2.40.0.34.11.13.3.13']) &lt;= 1">(ProblemStatusObservationEntry): Element hl7:templateId[@root = '1.2.40.0.34.11.13.3.13'] kommt zu häufig vor [max 1x].</assert>
      <assert role="error"
              see="https://elga.art-decor.org/elgabgd-html-20250116T125424/tmp-1.2.40.0.34.11.13.3.13-2017-07-13T210314.html"
              test="count(hl7:templateId[@root = '2.16.840.1.113883.10.20.1.57']) &gt;= 1">(ProblemStatusObservationEntry): Element hl7:templateId[@root = '2.16.840.1.113883.10.20.1.57'] ist required [min 1x].</assert>
      <assert role="error"
              see="https://elga.art-decor.org/elgabgd-html-20250116T125424/tmp-1.2.40.0.34.11.13.3.13-2017-07-13T210314.html"
              test="count(hl7:templateId[@root = '2.16.840.1.113883.10.20.1.57']) &lt;= 1">(ProblemStatusObservationEntry): Element hl7:templateId[@root = '2.16.840.1.113883.10.20.1.57'] kommt zu häufig vor [max 1x].</assert>
      <assert role="error"
              see="https://elga.art-decor.org/elgabgd-html-20250116T125424/tmp-1.2.40.0.34.11.13.3.13-2017-07-13T210314.html"
              test="count(hl7:templateId[@root = '2.16.840.1.113883.10.20.1.50']) &gt;= 1">(ProblemStatusObservationEntry): Element hl7:templateId[@root = '2.16.840.1.113883.10.20.1.50'] ist required [min 1x].</assert>
      <assert role="error"
              see="https://elga.art-decor.org/elgabgd-html-20250116T125424/tmp-1.2.40.0.34.11.13.3.13-2017-07-13T210314.html"
              test="count(hl7:templateId[@root = '2.16.840.1.113883.10.20.1.50']) &lt;= 1">(ProblemStatusObservationEntry): Element hl7:templateId[@root = '2.16.840.1.113883.10.20.1.50'] kommt zu häufig vor [max 1x].</assert>
      <assert role="error"
              see="https://elga.art-decor.org/elgabgd-html-20250116T125424/tmp-1.2.40.0.34.11.13.3.13-2017-07-13T210314.html"
              test="count(hl7:templateId[@root = '1.3.6.1.4.1.19376.1.5.3.1.4.1.1']) &gt;= 1">(ProblemStatusObservationEntry): Element hl7:templateId[@root = '1.3.6.1.4.1.19376.1.5.3.1.4.1.1'] ist required [min 1x].</assert>
      <assert role="error"
              see="https://elga.art-decor.org/elgabgd-html-20250116T125424/tmp-1.2.40.0.34.11.13.3.13-2017-07-13T210314.html"
              test="count(hl7:templateId[@root = '1.3.6.1.4.1.19376.1.5.3.1.4.1.1']) &lt;= 1">(ProblemStatusObservationEntry): Element hl7:templateId[@root = '1.3.6.1.4.1.19376.1.5.3.1.4.1.1'] kommt zu häufig vor [max 1x].</assert>
      <assert role="error"
              see="https://elga.art-decor.org/elgabgd-html-20250116T125424/tmp-1.2.40.0.34.11.13.3.13-2017-07-13T210314.html"
              test="count(hl7:code[(@code = '33999-4' and @codeSystem = '2.16.840.1.113883.6.1') or @nullFlavor]) &gt;= 1">(ProblemStatusObservationEntry): Element hl7:code[(@code = '33999-4' and @codeSystem = '2.16.840.1.113883.6.1') or @nullFlavor] ist required [min 1x].</assert>
      <assert role="error"
              see="https://elga.art-decor.org/elgabgd-html-20250116T125424/tmp-1.2.40.0.34.11.13.3.13-2017-07-13T210314.html"
              test="count(hl7:code[(@code = '33999-4' and @codeSystem = '2.16.840.1.113883.6.1') or @nullFlavor]) &lt;= 1">(ProblemStatusObservationEntry): Element hl7:code[(@code = '33999-4' and @codeSystem = '2.16.840.1.113883.6.1') or @nullFlavor] kommt zu häufig vor [max 1x].</assert>
      <assert role="error"
              see="https://elga.art-decor.org/elgabgd-html-20250116T125424/tmp-1.2.40.0.34.11.13.3.13-2017-07-13T210314.html"
              test="count(hl7:text[not(@nullFlavor)]) &gt;= 1">(ProblemStatusObservationEntry): Element hl7:text[not(@nullFlavor)] ist mandatory [min 1x].</assert>
      <assert role="error"
              see="https://elga.art-decor.org/elgabgd-html-20250116T125424/tmp-1.2.40.0.34.11.13.3.13-2017-07-13T210314.html"
              test="count(hl7:text[not(@nullFlavor)]) &lt;= 1">(ProblemStatusObservationEntry): Element hl7:text[not(@nullFlavor)] kommt zu häufig vor [max 1x].</assert>
      <assert role="error"
              see="https://elga.art-decor.org/elgabgd-html-20250116T125424/tmp-1.2.40.0.34.11.13.3.13-2017-07-13T210314.html"
              test="count(hl7:statusCode[@code = 'completed']) &gt;= 1">(ProblemStatusObservationEntry): Element hl7:statusCode[@code = 'completed'] ist mandatory [min 1x].</assert>
      <assert role="error"
              see="https://elga.art-decor.org/elgabgd-html-20250116T125424/tmp-1.2.40.0.34.11.13.3.13-2017-07-13T210314.html"
              test="count(hl7:statusCode[@code = 'completed']) &lt;= 1">(ProblemStatusObservationEntry): Element hl7:statusCode[@code = 'completed'] kommt zu häufig vor [max 1x].</assert>
      <assert role="error"
              see="https://elga.art-decor.org/elgabgd-html-20250116T125424/tmp-1.2.40.0.34.11.13.3.13-2017-07-13T210314.html"
              test="count(hl7:value) &gt;= 1">(ProblemStatusObservationEntry): Element hl7:value ist required [min 1x].</assert>
      <assert role="error"
              see="https://elga.art-decor.org/elgabgd-html-20250116T125424/tmp-1.2.40.0.34.11.13.3.13-2017-07-13T210314.html"
              test="count(hl7:value) &lt;= 1">(ProblemStatusObservationEntry): Element hl7:value kommt zu häufig vor [max 1x].</assert>
   </rule>
   <!--
Template derived rules for ID: 1.2.40.0.34.11.13.3.13
Context: *[hl7:observation[hl7:templateId[@root = '1.2.40.0.34.11.13.3.13'] and hl7:templateId[@root = '2.16.840.1.113883.10.20.1.57'] and hl7:templateId[@root = '2.16.840.1.113883.10.20.1.50'] and hl7:templateId[@root = '1.3.6.1.4.1.19376.1.5.3.1.4.1.1']]]/hl7:observation[hl7:templateId[@root = '1.2.40.0.34.11.13.3.13'] and hl7:templateId[@root = '2.16.840.1.113883.10.20.1.57'] and hl7:templateId[@root = '2.16.840.1.113883.10.20.1.50'] and hl7:templateId[@root = '1.3.6.1.4.1.19376.1.5.3.1.4.1.1']]/hl7:templateId[@root = '1.2.40.0.34.11.13.3.13']
Item: (ProblemStatusObservationEntry)
-->

   <rule fpi="RULC-1"
         context="*[hl7:observation[hl7:templateId[@root = '1.2.40.0.34.11.13.3.13'] and hl7:templateId[@root = '2.16.840.1.113883.10.20.1.57'] and hl7:templateId[@root = '2.16.840.1.113883.10.20.1.50'] and hl7:templateId[@root = '1.3.6.1.4.1.19376.1.5.3.1.4.1.1']]]/hl7:observation[hl7:templateId[@root = '1.2.40.0.34.11.13.3.13'] and hl7:templateId[@root = '2.16.840.1.113883.10.20.1.57'] and hl7:templateId[@root = '2.16.840.1.113883.10.20.1.50'] and hl7:templateId[@root = '1.3.6.1.4.1.19376.1.5.3.1.4.1.1']]/hl7:templateId[@root = '1.2.40.0.34.11.13.3.13']"
         id="d42e543-false-d3716e0">
      <extends rule="II"/>
      <assert role="error"
              see="https://elga.art-decor.org/elgabgd-html-20250116T125424/tmp-1.2.40.0.34.11.13.3.13-2017-07-13T210314.html"
              test="empty(@xsi:type) or resolve-QName(@xsi:type, .) = QName('urn:hl7-org:v3', 'II')">(ProblemStatusObservationEntry): Wenn eine @xsi:type Instruktion anwesend ist MUSS diese den Wert "{urn:hl7-org:v3}:II" haben. Gefunden "{<value-of select="namespace-uri-from-QName(resolve-QName(@xsi:type,.))"/>}:<value-of select="local-name-from-QName(resolve-QName(@xsi:type,.))"/>"</assert>
      <assert role="error"
              see="https://elga.art-decor.org/elgabgd-html-20250116T125424/tmp-1.2.40.0.34.11.13.3.13-2017-07-13T210314.html"
              test="string(@root) = ('1.2.40.0.34.11.13.3.13')">(ProblemStatusObservationEntry): Der Wert von root MUSS '1.2.40.0.34.11.13.3.13' sein. Gefunden: "<value-of select="@root"/>"</assert>
   </rule>
   <!--
Template derived rules for ID: 1.2.40.0.34.11.13.3.13
Context: *[hl7:observation[hl7:templateId[@root = '1.2.40.0.34.11.13.3.13'] and hl7:templateId[@root = '2.16.840.1.113883.10.20.1.57'] and hl7:templateId[@root = '2.16.840.1.113883.10.20.1.50'] and hl7:templateId[@root = '1.3.6.1.4.1.19376.1.5.3.1.4.1.1']]]/hl7:observation[hl7:templateId[@root = '1.2.40.0.34.11.13.3.13'] and hl7:templateId[@root = '2.16.840.1.113883.10.20.1.57'] and hl7:templateId[@root = '2.16.840.1.113883.10.20.1.50'] and hl7:templateId[@root = '1.3.6.1.4.1.19376.1.5.3.1.4.1.1']]/hl7:templateId[@root = '2.16.840.1.113883.10.20.1.57']
Item: (ProblemStatusObservationEntry)
-->

   <rule fpi="RULC-1"
         context="*[hl7:observation[hl7:templateId[@root = '1.2.40.0.34.11.13.3.13'] and hl7:templateId[@root = '2.16.840.1.113883.10.20.1.57'] and hl7:templateId[@root = '2.16.840.1.113883.10.20.1.50'] and hl7:templateId[@root = '1.3.6.1.4.1.19376.1.5.3.1.4.1.1']]]/hl7:observation[hl7:templateId[@root = '1.2.40.0.34.11.13.3.13'] and hl7:templateId[@root = '2.16.840.1.113883.10.20.1.57'] and hl7:templateId[@root = '2.16.840.1.113883.10.20.1.50'] and hl7:templateId[@root = '1.3.6.1.4.1.19376.1.5.3.1.4.1.1']]/hl7:templateId[@root = '2.16.840.1.113883.10.20.1.57']"
         id="d42e548-false-d3731e0">
      <extends rule="II"/>
      <assert role="error"
              see="https://elga.art-decor.org/elgabgd-html-20250116T125424/tmp-1.2.40.0.34.11.13.3.13-2017-07-13T210314.html"
              test="empty(@xsi:type) or resolve-QName(@xsi:type, .) = QName('urn:hl7-org:v3', 'II')">(ProblemStatusObservationEntry): Wenn eine @xsi:type Instruktion anwesend ist MUSS diese den Wert "{urn:hl7-org:v3}:II" haben. Gefunden "{<value-of select="namespace-uri-from-QName(resolve-QName(@xsi:type,.))"/>}:<value-of select="local-name-from-QName(resolve-QName(@xsi:type,.))"/>"</assert>
      <assert role="error"
              see="https://elga.art-decor.org/elgabgd-html-20250116T125424/tmp-1.2.40.0.34.11.13.3.13-2017-07-13T210314.html"
              test="string(@root) = ('2.16.840.1.113883.10.20.1.57')">(ProblemStatusObservationEntry): Der Wert von root MUSS '2.16.840.1.113883.10.20.1.57' sein. Gefunden: "<value-of select="@root"/>"</assert>
   </rule>
   <!--
Template derived rules for ID: 1.2.40.0.34.11.13.3.13
Context: *[hl7:observation[hl7:templateId[@root = '1.2.40.0.34.11.13.3.13'] and hl7:templateId[@root = '2.16.840.1.113883.10.20.1.57'] and hl7:templateId[@root = '2.16.840.1.113883.10.20.1.50'] and hl7:templateId[@root = '1.3.6.1.4.1.19376.1.5.3.1.4.1.1']]]/hl7:observation[hl7:templateId[@root = '1.2.40.0.34.11.13.3.13'] and hl7:templateId[@root = '2.16.840.1.113883.10.20.1.57'] and hl7:templateId[@root = '2.16.840.1.113883.10.20.1.50'] and hl7:templateId[@root = '1.3.6.1.4.1.19376.1.5.3.1.4.1.1']]/hl7:templateId[@root = '2.16.840.1.113883.10.20.1.50']
Item: (ProblemStatusObservationEntry)
-->

   <rule fpi="RULC-1"
         context="*[hl7:observation[hl7:templateId[@root = '1.2.40.0.34.11.13.3.13'] and hl7:templateId[@root = '2.16.840.1.113883.10.20.1.57'] and hl7:templateId[@root = '2.16.840.1.113883.10.20.1.50'] and hl7:templateId[@root = '1.3.6.1.4.1.19376.1.5.3.1.4.1.1']]]/hl7:observation[hl7:templateId[@root = '1.2.40.0.34.11.13.3.13'] and hl7:templateId[@root = '2.16.840.1.113883.10.20.1.57'] and hl7:templateId[@root = '2.16.840.1.113883.10.20.1.50'] and hl7:templateId[@root = '1.3.6.1.4.1.19376.1.5.3.1.4.1.1']]/hl7:templateId[@root = '2.16.840.1.113883.10.20.1.50']"
         id="d42e553-false-d3746e0">
      <extends rule="II"/>
      <assert role="error"
              see="https://elga.art-decor.org/elgabgd-html-20250116T125424/tmp-1.2.40.0.34.11.13.3.13-2017-07-13T210314.html"
              test="empty(@xsi:type) or resolve-QName(@xsi:type, .) = QName('urn:hl7-org:v3', 'II')">(ProblemStatusObservationEntry): Wenn eine @xsi:type Instruktion anwesend ist MUSS diese den Wert "{urn:hl7-org:v3}:II" haben. Gefunden "{<value-of select="namespace-uri-from-QName(resolve-QName(@xsi:type,.))"/>}:<value-of select="local-name-from-QName(resolve-QName(@xsi:type,.))"/>"</assert>
      <assert role="error"
              see="https://elga.art-decor.org/elgabgd-html-20250116T125424/tmp-1.2.40.0.34.11.13.3.13-2017-07-13T210314.html"
              test="string(@root) = ('2.16.840.1.113883.10.20.1.50')">(ProblemStatusObservationEntry): Der Wert von root MUSS '2.16.840.1.113883.10.20.1.50' sein. Gefunden: "<value-of select="@root"/>"</assert>
   </rule>
   <!--
Template derived rules for ID: 1.2.40.0.34.11.13.3.13
Context: *[hl7:observation[hl7:templateId[@root = '1.2.40.0.34.11.13.3.13'] and hl7:templateId[@root = '2.16.840.1.113883.10.20.1.57'] and hl7:templateId[@root = '2.16.840.1.113883.10.20.1.50'] and hl7:templateId[@root = '1.3.6.1.4.1.19376.1.5.3.1.4.1.1']]]/hl7:observation[hl7:templateId[@root = '1.2.40.0.34.11.13.3.13'] and hl7:templateId[@root = '2.16.840.1.113883.10.20.1.57'] and hl7:templateId[@root = '2.16.840.1.113883.10.20.1.50'] and hl7:templateId[@root = '1.3.6.1.4.1.19376.1.5.3.1.4.1.1']]/hl7:templateId[@root = '1.3.6.1.4.1.19376.1.5.3.1.4.1.1']
Item: (ProblemStatusObservationEntry)
-->

   <rule fpi="RULC-1"
         context="*[hl7:observation[hl7:templateId[@root = '1.2.40.0.34.11.13.3.13'] and hl7:templateId[@root = '2.16.840.1.113883.10.20.1.57'] and hl7:templateId[@root = '2.16.840.1.113883.10.20.1.50'] and hl7:templateId[@root = '1.3.6.1.4.1.19376.1.5.3.1.4.1.1']]]/hl7:observation[hl7:templateId[@root = '1.2.40.0.34.11.13.3.13'] and hl7:templateId[@root = '2.16.840.1.113883.10.20.1.57'] and hl7:templateId[@root = '2.16.840.1.113883.10.20.1.50'] and hl7:templateId[@root = '1.3.6.1.4.1.19376.1.5.3.1.4.1.1']]/hl7:templateId[@root = '1.3.6.1.4.1.19376.1.5.3.1.4.1.1']"
         id="d42e559-false-d3761e0">
      <extends rule="II"/>
      <assert role="error"
              see="https://elga.art-decor.org/elgabgd-html-20250116T125424/tmp-1.2.40.0.34.11.13.3.13-2017-07-13T210314.html"
              test="empty(@xsi:type) or resolve-QName(@xsi:type, .) = QName('urn:hl7-org:v3', 'II')">(ProblemStatusObservationEntry): Wenn eine @xsi:type Instruktion anwesend ist MUSS diese den Wert "{urn:hl7-org:v3}:II" haben. Gefunden "{<value-of select="namespace-uri-from-QName(resolve-QName(@xsi:type,.))"/>}:<value-of select="local-name-from-QName(resolve-QName(@xsi:type,.))"/>"</assert>
      <assert role="error"
              see="https://elga.art-decor.org/elgabgd-html-20250116T125424/tmp-1.2.40.0.34.11.13.3.13-2017-07-13T210314.html"
              test="string(@root) = ('1.3.6.1.4.1.19376.1.5.3.1.4.1.1')">(ProblemStatusObservationEntry): Der Wert von root MUSS '1.3.6.1.4.1.19376.1.5.3.1.4.1.1' sein. Gefunden: "<value-of select="@root"/>"</assert>
   </rule>
   <!--
Template derived rules for ID: 1.2.40.0.34.11.13.3.13
Context: *[hl7:observation[hl7:templateId[@root = '1.2.40.0.34.11.13.3.13'] and hl7:templateId[@root = '2.16.840.1.113883.10.20.1.57'] and hl7:templateId[@root = '2.16.840.1.113883.10.20.1.50'] and hl7:templateId[@root = '1.3.6.1.4.1.19376.1.5.3.1.4.1.1']]]/hl7:observation[hl7:templateId[@root = '1.2.40.0.34.11.13.3.13'] and hl7:templateId[@root = '2.16.840.1.113883.10.20.1.57'] and hl7:templateId[@root = '2.16.840.1.113883.10.20.1.50'] and hl7:templateId[@root = '1.3.6.1.4.1.19376.1.5.3.1.4.1.1']]/hl7:code[(@code = '33999-4' and @codeSystem = '2.16.840.1.113883.6.1') or @nullFlavor]
Item: (ProblemStatusObservationEntry)
-->

   <rule fpi="RULC-1"
         context="*[hl7:observation[hl7:templateId[@root = '1.2.40.0.34.11.13.3.13'] and hl7:templateId[@root = '2.16.840.1.113883.10.20.1.57'] and hl7:templateId[@root = '2.16.840.1.113883.10.20.1.50'] and hl7:templateId[@root = '1.3.6.1.4.1.19376.1.5.3.1.4.1.1']]]/hl7:observation[hl7:templateId[@root = '1.2.40.0.34.11.13.3.13'] and hl7:templateId[@root = '2.16.840.1.113883.10.20.1.57'] and hl7:templateId[@root = '2.16.840.1.113883.10.20.1.50'] and hl7:templateId[@root = '1.3.6.1.4.1.19376.1.5.3.1.4.1.1']]/hl7:code[(@code = '33999-4' and @codeSystem = '2.16.840.1.113883.6.1') or @nullFlavor]"
         id="d42e564-false-d3776e0">
      <extends rule="CD"/>
      <assert role="error"
              see="https://elga.art-decor.org/elgabgd-html-20250116T125424/tmp-1.2.40.0.34.11.13.3.13-2017-07-13T210314.html"
              test="empty(@xsi:type) or resolve-QName(@xsi:type, .) = QName('urn:hl7-org:v3', 'CD')">(ProblemStatusObservationEntry): Wenn eine @xsi:type Instruktion anwesend ist MUSS diese den Wert "{urn:hl7-org:v3}:CD" haben. Gefunden "{<value-of select="namespace-uri-from-QName(resolve-QName(@xsi:type,.))"/>}:<value-of select="local-name-from-QName(resolve-QName(@xsi:type,.))"/>"</assert>
      <assert role="error"
              see="https://elga.art-decor.org/elgabgd-html-20250116T125424/tmp-1.2.40.0.34.11.13.3.13-2017-07-13T210314.html"
              test="@nullFlavor or (@code='33999-4' and @codeSystem='2.16.840.1.113883.6.1' and @displayName='Status' and @codeSystemName='LOINC')">(ProblemStatusObservationEntry): Der Elementinhalt MUSS einer von 'code '33999-4' codeSystem '2.16.840.1.113883.6.1' displayName='Status' codeSystemName='LOINC'' sein.</assert>
   </rule>
   <!--
Template derived rules for ID: 1.2.40.0.34.11.13.3.13
Context: *[hl7:observation[hl7:templateId[@root = '1.2.40.0.34.11.13.3.13'] and hl7:templateId[@root = '2.16.840.1.113883.10.20.1.57'] and hl7:templateId[@root = '2.16.840.1.113883.10.20.1.50'] and hl7:templateId[@root = '1.3.6.1.4.1.19376.1.5.3.1.4.1.1']]]/hl7:observation[hl7:templateId[@root = '1.2.40.0.34.11.13.3.13'] and hl7:templateId[@root = '2.16.840.1.113883.10.20.1.57'] and hl7:templateId[@root = '2.16.840.1.113883.10.20.1.50'] and hl7:templateId[@root = '1.3.6.1.4.1.19376.1.5.3.1.4.1.1']]/hl7:text[not(@nullFlavor)]
Item: (ProblemStatusObservationEntry)
-->

   <rule fpi="RULC-1"
         context="*[hl7:observation[hl7:templateId[@root = '1.2.40.0.34.11.13.3.13'] and hl7:templateId[@root = '2.16.840.1.113883.10.20.1.57'] and hl7:templateId[@root = '2.16.840.1.113883.10.20.1.50'] and hl7:templateId[@root = '1.3.6.1.4.1.19376.1.5.3.1.4.1.1']]]/hl7:observation[hl7:templateId[@root = '1.2.40.0.34.11.13.3.13'] and hl7:templateId[@root = '2.16.840.1.113883.10.20.1.57'] and hl7:templateId[@root = '2.16.840.1.113883.10.20.1.50'] and hl7:templateId[@root = '1.3.6.1.4.1.19376.1.5.3.1.4.1.1']]/hl7:text[not(@nullFlavor)]"
         id="d42e572-false-d3792e0">
      <extends rule="ED"/>
      <assert role="error"
              see="https://elga.art-decor.org/elgabgd-html-20250116T125424/tmp-1.2.40.0.34.11.13.3.13-2017-07-13T210314.html"
              test="empty(@xsi:type) or resolve-QName(@xsi:type, .) = QName('urn:hl7-org:v3', 'ED')">(ProblemStatusObservationEntry): Wenn eine @xsi:type Instruktion anwesend ist MUSS diese den Wert "{urn:hl7-org:v3}:ED" haben. Gefunden "{<value-of select="namespace-uri-from-QName(resolve-QName(@xsi:type,.))"/>}:<value-of select="local-name-from-QName(resolve-QName(@xsi:type,.))"/>"</assert>
      <assert role="error"
              see="https://elga.art-decor.org/elgabgd-html-20250116T125424/tmp-1.2.40.0.34.11.13.3.13-2017-07-13T210314.html"
              test="count(hl7:reference[not(@nullFlavor)]) &gt;= 1">(ProblemStatusObservationEntry): Element hl7:reference[not(@nullFlavor)] ist mandatory [min 1x].</assert>
      <assert role="error"
              see="https://elga.art-decor.org/elgabgd-html-20250116T125424/tmp-1.2.40.0.34.11.13.3.13-2017-07-13T210314.html"
              test="count(hl7:reference[not(@nullFlavor)]) &lt;= 1">(ProblemStatusObservationEntry): Element hl7:reference[not(@nullFlavor)] kommt zu häufig vor [max 1x].</assert>
   </rule>
   <!--
Template derived rules for ID: 1.2.40.0.34.11.13.3.13
Context: *[hl7:observation[hl7:templateId[@root = '1.2.40.0.34.11.13.3.13'] and hl7:templateId[@root = '2.16.840.1.113883.10.20.1.57'] and hl7:templateId[@root = '2.16.840.1.113883.10.20.1.50'] and hl7:templateId[@root = '1.3.6.1.4.1.19376.1.5.3.1.4.1.1']]]/hl7:observation[hl7:templateId[@root = '1.2.40.0.34.11.13.3.13'] and hl7:templateId[@root = '2.16.840.1.113883.10.20.1.57'] and hl7:templateId[@root = '2.16.840.1.113883.10.20.1.50'] and hl7:templateId[@root = '1.3.6.1.4.1.19376.1.5.3.1.4.1.1']]/hl7:text[not(@nullFlavor)]/hl7:reference[not(@nullFlavor)]
Item: (ProblemStatusObservationEntry)
-->

   <rule fpi="RULC-1"
         context="*[hl7:observation[hl7:templateId[@root = '1.2.40.0.34.11.13.3.13'] and hl7:templateId[@root = '2.16.840.1.113883.10.20.1.57'] and hl7:templateId[@root = '2.16.840.1.113883.10.20.1.50'] and hl7:templateId[@root = '1.3.6.1.4.1.19376.1.5.3.1.4.1.1']]]/hl7:observation[hl7:templateId[@root = '1.2.40.0.34.11.13.3.13'] and hl7:templateId[@root = '2.16.840.1.113883.10.20.1.57'] and hl7:templateId[@root = '2.16.840.1.113883.10.20.1.50'] and hl7:templateId[@root = '1.3.6.1.4.1.19376.1.5.3.1.4.1.1']]/hl7:text[not(@nullFlavor)]/hl7:reference[not(@nullFlavor)]"
         id="d42e577-false-d3811e0">
      <extends rule="TEL"/>
      <assert role="error"
              see="https://elga.art-decor.org/elgabgd-html-20250116T125424/tmp-1.2.40.0.34.11.13.3.13-2017-07-13T210314.html"
              test="empty(@xsi:type) or resolve-QName(@xsi:type, .) = QName('urn:hl7-org:v3', 'TEL')">(ProblemStatusObservationEntry): Wenn eine @xsi:type Instruktion anwesend ist MUSS diese den Wert "{urn:hl7-org:v3}:TEL" haben. Gefunden "{<value-of select="namespace-uri-from-QName(resolve-QName(@xsi:type,.))"/>}:<value-of select="local-name-from-QName(resolve-QName(@xsi:type,.))"/>"</assert>
      <assert role="error"
              see="https://elga.art-decor.org/elgabgd-html-20250116T125424/tmp-1.2.40.0.34.11.13.3.13-2017-07-13T210314.html"
              test="@value">(ProblemStatusObservationEntry): Attribut @value MUSS vorkommen.</assert>
   </rule>
   <!--
Template derived rules for ID: 1.2.40.0.34.11.13.3.13
Context: *[hl7:observation[hl7:templateId[@root = '1.2.40.0.34.11.13.3.13'] and hl7:templateId[@root = '2.16.840.1.113883.10.20.1.57'] and hl7:templateId[@root = '2.16.840.1.113883.10.20.1.50'] and hl7:templateId[@root = '1.3.6.1.4.1.19376.1.5.3.1.4.1.1']]]/hl7:observation[hl7:templateId[@root = '1.2.40.0.34.11.13.3.13'] and hl7:templateId[@root = '2.16.840.1.113883.10.20.1.57'] and hl7:templateId[@root = '2.16.840.1.113883.10.20.1.50'] and hl7:templateId[@root = '1.3.6.1.4.1.19376.1.5.3.1.4.1.1']]/hl7:statusCode[@code = 'completed']
Item: (ProblemStatusObservationEntry)
-->

   <rule fpi="RULC-1"
         context="*[hl7:observation[hl7:templateId[@root = '1.2.40.0.34.11.13.3.13'] and hl7:templateId[@root = '2.16.840.1.113883.10.20.1.57'] and hl7:templateId[@root = '2.16.840.1.113883.10.20.1.50'] and hl7:templateId[@root = '1.3.6.1.4.1.19376.1.5.3.1.4.1.1']]]/hl7:observation[hl7:templateId[@root = '1.2.40.0.34.11.13.3.13'] and hl7:templateId[@root = '2.16.840.1.113883.10.20.1.57'] and hl7:templateId[@root = '2.16.840.1.113883.10.20.1.50'] and hl7:templateId[@root = '1.3.6.1.4.1.19376.1.5.3.1.4.1.1']]/hl7:statusCode[@code = 'completed']"
         id="d42e587-false-d3826e0">
      <extends rule="CS"/>
      <assert role="error"
              see="https://elga.art-decor.org/elgabgd-html-20250116T125424/tmp-1.2.40.0.34.11.13.3.13-2017-07-13T210314.html"
              test="empty(@xsi:type) or resolve-QName(@xsi:type, .) = QName('urn:hl7-org:v3', 'CS')">(ProblemStatusObservationEntry): Wenn eine @xsi:type Instruktion anwesend ist MUSS diese den Wert "{urn:hl7-org:v3}:CS" haben. Gefunden "{<value-of select="namespace-uri-from-QName(resolve-QName(@xsi:type,.))"/>}:<value-of select="local-name-from-QName(resolve-QName(@xsi:type,.))"/>"</assert>
      <assert role="error"
              see="https://elga.art-decor.org/elgabgd-html-20250116T125424/tmp-1.2.40.0.34.11.13.3.13-2017-07-13T210314.html"
              test="@nullFlavor or (@code='completed')">(ProblemStatusObservationEntry): Der Elementinhalt MUSS einer von 'code 'completed'' sein.</assert>
   </rule>
   <!--
Template derived rules for ID: 1.2.40.0.34.11.13.3.13
Context: *[hl7:observation[hl7:templateId[@root = '1.2.40.0.34.11.13.3.13'] and hl7:templateId[@root = '2.16.840.1.113883.10.20.1.57'] and hl7:templateId[@root = '2.16.840.1.113883.10.20.1.50'] and hl7:templateId[@root = '1.3.6.1.4.1.19376.1.5.3.1.4.1.1']]]/hl7:observation[hl7:templateId[@root = '1.2.40.0.34.11.13.3.13'] and hl7:templateId[@root = '2.16.840.1.113883.10.20.1.57'] and hl7:templateId[@root = '2.16.840.1.113883.10.20.1.50'] and hl7:templateId[@root = '1.3.6.1.4.1.19376.1.5.3.1.4.1.1']]/hl7:value
Item: (ProblemStatusObservationEntry)
-->

   <rule fpi="RULC-1"
         context="*[hl7:observation[hl7:templateId[@root = '1.2.40.0.34.11.13.3.13'] and hl7:templateId[@root = '2.16.840.1.113883.10.20.1.57'] and hl7:templateId[@root = '2.16.840.1.113883.10.20.1.50'] and hl7:templateId[@root = '1.3.6.1.4.1.19376.1.5.3.1.4.1.1']]]/hl7:observation[hl7:templateId[@root = '1.2.40.0.34.11.13.3.13'] and hl7:templateId[@root = '2.16.840.1.113883.10.20.1.57'] and hl7:templateId[@root = '2.16.840.1.113883.10.20.1.50'] and hl7:templateId[@root = '1.3.6.1.4.1.19376.1.5.3.1.4.1.1']]/hl7:value"
         id="d42e595-false-d3845e0">
      <extends rule="CE"/>
      <assert role="error"
              see="https://elga.art-decor.org/elgabgd-html-20250116T125424/tmp-1.2.40.0.34.11.13.3.13-2017-07-13T210314.html"
              test="empty(@xsi:type) or resolve-QName(@xsi:type, .) = QName('urn:hl7-org:v3', 'CE')">(ProblemStatusObservationEntry): Wenn eine @xsi:type Instruktion anwesend ist MUSS diese den Wert "{urn:hl7-org:v3}:CE" haben. Gefunden "{<value-of select="namespace-uri-from-QName(resolve-QName(@xsi:type,.))"/>}:<value-of select="local-name-from-QName(resolve-QName(@xsi:type,.))"/>"</assert>
   </rule>
</pattern>
