<?xml version="1.0" encoding="UTF-8"?>
<!--
Template derived pattern
===========================================
ID: 1.2.40.0.34.6.0.11.3.37
Name: Allergy Status Observation
Description: Klinischer Status der Allergie
-->
<pattern xmlns="http://purl.oclc.org/dsdl/schematron"
         id="template-1.2.40.0.34.6.0.11.3.37-2021-02-19T124116">
   <title>Allergy Status Observation</title>
   <!--
Template derived rules for ID: 1.2.40.0.34.6.0.11.3.37
Context: *[hl7:observation[hl7:templateId[@root = '1.2.40.0.34.6.0.11.3.37'] and hl7:templateId[@root = '2.16.840.1.113883.10.22.4.21'] and hl7:templateId[@root = '1.3.6.1.4.1.19376.1.5.3.1.4.1.1']]]
Item: (atcdabbr_entry_AllergyStatusObservation)
-->

   <!--
Template derived rules for ID: 1.2.40.0.34.6.0.11.3.37
Context: *[hl7:observation[hl7:templateId[@root = '1.2.40.0.34.6.0.11.3.37'] and hl7:templateId[@root = '2.16.840.1.113883.10.22.4.21'] and hl7:templateId[@root = '1.3.6.1.4.1.19376.1.5.3.1.4.1.1']]]/hl7:observation[hl7:templateId[@root = '1.2.40.0.34.6.0.11.3.37'] and hl7:templateId[@root = '2.16.840.1.113883.10.22.4.21'] and hl7:templateId[@root = '1.3.6.1.4.1.19376.1.5.3.1.4.1.1']]
Item: (atcdabbr_entry_AllergyStatusObservation)
-->

   <rule fpi="RULC-1"
         context="*[hl7:observation[hl7:templateId[@root = '1.2.40.0.34.6.0.11.3.37'] and hl7:templateId[@root = '2.16.840.1.113883.10.22.4.21'] and hl7:templateId[@root = '1.3.6.1.4.1.19376.1.5.3.1.4.1.1']]]/hl7:observation[hl7:templateId[@root = '1.2.40.0.34.6.0.11.3.37'] and hl7:templateId[@root = '2.16.840.1.113883.10.22.4.21'] and hl7:templateId[@root = '1.3.6.1.4.1.19376.1.5.3.1.4.1.1']]"
         id="d42e65576-false-d5432712e0">
      <assert role="error"
              see="http://elga.art-decor.org/elgaambbef-html-20230118T144941/tmp-1.2.40.0.34.6.0.11.3.37-2021-02-19T124116.html"
              test="string(@classCode) = ('OBS')">(atcdabbr_entry_AllergyStatusObservation): Der Wert von classCode MUSS 'OBS' sein. Gefunden: "<value-of select="@classCode"/>"</assert>
      <assert role="error"
              see="http://elga.art-decor.org/elgaambbef-html-20230118T144941/tmp-1.2.40.0.34.6.0.11.3.37-2021-02-19T124116.html"
              test="string(@moodCode) = ('EVN')">(atcdabbr_entry_AllergyStatusObservation): Der Wert von moodCode MUSS 'EVN' sein. Gefunden: "<value-of select="@moodCode"/>"</assert>
      <assert role="error"
              see="http://elga.art-decor.org/elgaambbef-html-20230118T144941/tmp-1.2.40.0.34.6.0.11.3.37-2021-02-19T124116.html"
              test="count(hl7:templateId[@root = '1.2.40.0.34.6.0.11.3.37']) &gt;= 1">(atcdabbr_entry_AllergyStatusObservation): Element hl7:templateId[@root = '1.2.40.0.34.6.0.11.3.37'] ist mandatory [min 1x].</assert>
      <assert role="error"
              see="http://elga.art-decor.org/elgaambbef-html-20230118T144941/tmp-1.2.40.0.34.6.0.11.3.37-2021-02-19T124116.html"
              test="count(hl7:templateId[@root = '1.2.40.0.34.6.0.11.3.37']) &lt;= 1">(atcdabbr_entry_AllergyStatusObservation): Element hl7:templateId[@root = '1.2.40.0.34.6.0.11.3.37'] kommt zu häufig vor [max 1x].</assert>
      <assert role="error"
              see="http://elga.art-decor.org/elgaambbef-html-20230118T144941/tmp-1.2.40.0.34.6.0.11.3.37-2021-02-19T124116.html"
              test="count(hl7:templateId[@root = '2.16.840.1.113883.10.22.4.21']) &gt;= 1">(atcdabbr_entry_AllergyStatusObservation): Element hl7:templateId[@root = '2.16.840.1.113883.10.22.4.21'] ist mandatory [min 1x].</assert>
      <assert role="error"
              see="http://elga.art-decor.org/elgaambbef-html-20230118T144941/tmp-1.2.40.0.34.6.0.11.3.37-2021-02-19T124116.html"
              test="count(hl7:templateId[@root = '2.16.840.1.113883.10.22.4.21']) &lt;= 1">(atcdabbr_entry_AllergyStatusObservation): Element hl7:templateId[@root = '2.16.840.1.113883.10.22.4.21'] kommt zu häufig vor [max 1x].</assert>
      <assert role="error"
              see="http://elga.art-decor.org/elgaambbef-html-20230118T144941/tmp-1.2.40.0.34.6.0.11.3.37-2021-02-19T124116.html"
              test="count(hl7:templateId[@root = '1.3.6.1.4.1.19376.1.5.3.1.4.1.1']) &gt;= 1">(atcdabbr_entry_AllergyStatusObservation): Element hl7:templateId[@root = '1.3.6.1.4.1.19376.1.5.3.1.4.1.1'] ist mandatory [min 1x].</assert>
      <assert role="error"
              see="http://elga.art-decor.org/elgaambbef-html-20230118T144941/tmp-1.2.40.0.34.6.0.11.3.37-2021-02-19T124116.html"
              test="count(hl7:templateId[@root = '1.3.6.1.4.1.19376.1.5.3.1.4.1.1']) &lt;= 1">(atcdabbr_entry_AllergyStatusObservation): Element hl7:templateId[@root = '1.3.6.1.4.1.19376.1.5.3.1.4.1.1'] kommt zu häufig vor [max 1x].</assert>
      <assert role="error"
              see="http://elga.art-decor.org/elgaambbef-html-20230118T144941/tmp-1.2.40.0.34.6.0.11.3.37-2021-02-19T124116.html"
              test="count(hl7:code[(@code = '33999-4' and @codeSystem = '2.16.840.1.113883.6.1')]) &gt;= 1">(atcdabbr_entry_AllergyStatusObservation): Element hl7:code[(@code = '33999-4' and @codeSystem = '2.16.840.1.113883.6.1')] ist mandatory [min 1x].</assert>
      <assert role="error"
              see="http://elga.art-decor.org/elgaambbef-html-20230118T144941/tmp-1.2.40.0.34.6.0.11.3.37-2021-02-19T124116.html"
              test="count(hl7:code[(@code = '33999-4' and @codeSystem = '2.16.840.1.113883.6.1')]) &lt;= 1">(atcdabbr_entry_AllergyStatusObservation): Element hl7:code[(@code = '33999-4' and @codeSystem = '2.16.840.1.113883.6.1')] kommt zu häufig vor [max 1x].</assert>
      <assert role="error"
              see="http://elga.art-decor.org/elgaambbef-html-20230118T144941/tmp-1.2.40.0.34.6.0.11.3.37-2021-02-19T124116.html"
              test="count(hl7:text[not(@nullFlavor)]) &gt;= 1">(atcdabbr_entry_AllergyStatusObservation): Element hl7:text[not(@nullFlavor)] ist mandatory [min 1x].</assert>
      <assert role="error"
              see="http://elga.art-decor.org/elgaambbef-html-20230118T144941/tmp-1.2.40.0.34.6.0.11.3.37-2021-02-19T124116.html"
              test="count(hl7:text[not(@nullFlavor)]) &lt;= 1">(atcdabbr_entry_AllergyStatusObservation): Element hl7:text[not(@nullFlavor)] kommt zu häufig vor [max 1x].</assert>
      <assert role="error"
              see="http://elga.art-decor.org/elgaambbef-html-20230118T144941/tmp-1.2.40.0.34.6.0.11.3.37-2021-02-19T124116.html"
              test="count(hl7:statusCode[@code = 'completed']) &gt;= 1">(atcdabbr_entry_AllergyStatusObservation): Element hl7:statusCode[@code = 'completed'] ist mandatory [min 1x].</assert>
      <assert role="error"
              see="http://elga.art-decor.org/elgaambbef-html-20230118T144941/tmp-1.2.40.0.34.6.0.11.3.37-2021-02-19T124116.html"
              test="count(hl7:statusCode[@code = 'completed']) &lt;= 1">(atcdabbr_entry_AllergyStatusObservation): Element hl7:statusCode[@code = 'completed'] kommt zu häufig vor [max 1x].</assert>
      <assert role="error"
              see="http://elga.art-decor.org/elgaambbef-html-20230118T144941/tmp-1.2.40.0.34.6.0.11.3.37-2021-02-19T124116.html"
              test="count(hl7:value[concat(@code, @codeSystem) = doc('include/voc-1.2.40.0.34.10.183-DYNAMIC.xml')//valueSet[1]/conceptList/concept/concat(@code, @codeSystem)]) &gt;= 1">(atcdabbr_entry_AllergyStatusObservation): Element hl7:value[concat(@code, @codeSystem) = doc('include/voc-1.2.40.0.34.10.183-DYNAMIC.xml')//valueSet[1]/conceptList/concept/concat(@code, @codeSystem)] ist mandatory [min 1x].</assert>
      <assert role="error"
              see="http://elga.art-decor.org/elgaambbef-html-20230118T144941/tmp-1.2.40.0.34.6.0.11.3.37-2021-02-19T124116.html"
              test="count(hl7:value[concat(@code, @codeSystem) = doc('include/voc-1.2.40.0.34.10.183-DYNAMIC.xml')//valueSet[1]/conceptList/concept/concat(@code, @codeSystem)]) &lt;= 1">(atcdabbr_entry_AllergyStatusObservation): Element hl7:value[concat(@code, @codeSystem) = doc('include/voc-1.2.40.0.34.10.183-DYNAMIC.xml')//valueSet[1]/conceptList/concept/concat(@code, @codeSystem)] kommt zu häufig vor [max 1x].</assert>
   </rule>
   <!--
Template derived rules for ID: 1.2.40.0.34.6.0.11.3.37
Context: *[hl7:observation[hl7:templateId[@root = '1.2.40.0.34.6.0.11.3.37'] and hl7:templateId[@root = '2.16.840.1.113883.10.22.4.21'] and hl7:templateId[@root = '1.3.6.1.4.1.19376.1.5.3.1.4.1.1']]]/hl7:observation[hl7:templateId[@root = '1.2.40.0.34.6.0.11.3.37'] and hl7:templateId[@root = '2.16.840.1.113883.10.22.4.21'] and hl7:templateId[@root = '1.3.6.1.4.1.19376.1.5.3.1.4.1.1']]/hl7:templateId[@root = '1.2.40.0.34.6.0.11.3.37']
Item: (atcdabbr_entry_AllergyStatusObservation)
-->

   <rule fpi="RULC-1"
         context="*[hl7:observation[hl7:templateId[@root = '1.2.40.0.34.6.0.11.3.37'] and hl7:templateId[@root = '2.16.840.1.113883.10.22.4.21'] and hl7:templateId[@root = '1.3.6.1.4.1.19376.1.5.3.1.4.1.1']]]/hl7:observation[hl7:templateId[@root = '1.2.40.0.34.6.0.11.3.37'] and hl7:templateId[@root = '2.16.840.1.113883.10.22.4.21'] and hl7:templateId[@root = '1.3.6.1.4.1.19376.1.5.3.1.4.1.1']]/hl7:templateId[@root = '1.2.40.0.34.6.0.11.3.37']"
         id="d42e65582-false-d5432799e0">
      <extends rule="II"/>
      <assert role="error"
              see="http://elga.art-decor.org/elgaambbef-html-20230118T144941/tmp-1.2.40.0.34.6.0.11.3.37-2021-02-19T124116.html"
              test="empty(@xsi:type) or resolve-QName(@xsi:type, .) = QName('urn:hl7-org:v3', 'II')">(atcdabbr_entry_AllergyStatusObservation): Wenn eine @xsi:type Instruktion anwesend ist MUSS diese den Wert "{urn:hl7-org:v3}:II" haben. Gefunden "{<value-of select="namespace-uri-from-QName(resolve-QName(@xsi:type,.))"/>}:<value-of select="local-name-from-QName(resolve-QName(@xsi:type,.))"/>"</assert>
      <assert role="error"
              see="http://elga.art-decor.org/elgaambbef-html-20230118T144941/tmp-1.2.40.0.34.6.0.11.3.37-2021-02-19T124116.html"
              test="string(@root) = ('1.2.40.0.34.6.0.11.3.37')">(atcdabbr_entry_AllergyStatusObservation): Der Wert von root MUSS '1.2.40.0.34.6.0.11.3.37' sein. Gefunden: "<value-of select="@root"/>"</assert>
   </rule>
   <!--
Template derived rules for ID: 1.2.40.0.34.6.0.11.3.37
Context: *[hl7:observation[hl7:templateId[@root = '1.2.40.0.34.6.0.11.3.37'] and hl7:templateId[@root = '2.16.840.1.113883.10.22.4.21'] and hl7:templateId[@root = '1.3.6.1.4.1.19376.1.5.3.1.4.1.1']]]/hl7:observation[hl7:templateId[@root = '1.2.40.0.34.6.0.11.3.37'] and hl7:templateId[@root = '2.16.840.1.113883.10.22.4.21'] and hl7:templateId[@root = '1.3.6.1.4.1.19376.1.5.3.1.4.1.1']]/hl7:templateId[@root = '2.16.840.1.113883.10.22.4.21']
Item: (atcdabbr_entry_AllergyStatusObservation)
-->

   <rule fpi="RULC-1"
         context="*[hl7:observation[hl7:templateId[@root = '1.2.40.0.34.6.0.11.3.37'] and hl7:templateId[@root = '2.16.840.1.113883.10.22.4.21'] and hl7:templateId[@root = '1.3.6.1.4.1.19376.1.5.3.1.4.1.1']]]/hl7:observation[hl7:templateId[@root = '1.2.40.0.34.6.0.11.3.37'] and hl7:templateId[@root = '2.16.840.1.113883.10.22.4.21'] and hl7:templateId[@root = '1.3.6.1.4.1.19376.1.5.3.1.4.1.1']]/hl7:templateId[@root = '2.16.840.1.113883.10.22.4.21']"
         id="d42e65590-false-d5432814e0">
      <extends rule="II"/>
      <assert role="error"
              see="http://elga.art-decor.org/elgaambbef-html-20230118T144941/tmp-1.2.40.0.34.6.0.11.3.37-2021-02-19T124116.html"
              test="empty(@xsi:type) or resolve-QName(@xsi:type, .) = QName('urn:hl7-org:v3', 'II')">(atcdabbr_entry_AllergyStatusObservation): Wenn eine @xsi:type Instruktion anwesend ist MUSS diese den Wert "{urn:hl7-org:v3}:II" haben. Gefunden "{<value-of select="namespace-uri-from-QName(resolve-QName(@xsi:type,.))"/>}:<value-of select="local-name-from-QName(resolve-QName(@xsi:type,.))"/>"</assert>
      <assert role="error"
              see="http://elga.art-decor.org/elgaambbef-html-20230118T144941/tmp-1.2.40.0.34.6.0.11.3.37-2021-02-19T124116.html"
              test="string(@root) = ('2.16.840.1.113883.10.22.4.21')">(atcdabbr_entry_AllergyStatusObservation): Der Wert von root MUSS '2.16.840.1.113883.10.22.4.21' sein. Gefunden: "<value-of select="@root"/>"</assert>
   </rule>
   <!--
Template derived rules for ID: 1.2.40.0.34.6.0.11.3.37
Context: *[hl7:observation[hl7:templateId[@root = '1.2.40.0.34.6.0.11.3.37'] and hl7:templateId[@root = '2.16.840.1.113883.10.22.4.21'] and hl7:templateId[@root = '1.3.6.1.4.1.19376.1.5.3.1.4.1.1']]]/hl7:observation[hl7:templateId[@root = '1.2.40.0.34.6.0.11.3.37'] and hl7:templateId[@root = '2.16.840.1.113883.10.22.4.21'] and hl7:templateId[@root = '1.3.6.1.4.1.19376.1.5.3.1.4.1.1']]/hl7:templateId[@root = '1.3.6.1.4.1.19376.1.5.3.1.4.1.1']
Item: (atcdabbr_entry_AllergyStatusObservation)
-->

   <rule fpi="RULC-1"
         context="*[hl7:observation[hl7:templateId[@root = '1.2.40.0.34.6.0.11.3.37'] and hl7:templateId[@root = '2.16.840.1.113883.10.22.4.21'] and hl7:templateId[@root = '1.3.6.1.4.1.19376.1.5.3.1.4.1.1']]]/hl7:observation[hl7:templateId[@root = '1.2.40.0.34.6.0.11.3.37'] and hl7:templateId[@root = '2.16.840.1.113883.10.22.4.21'] and hl7:templateId[@root = '1.3.6.1.4.1.19376.1.5.3.1.4.1.1']]/hl7:templateId[@root = '1.3.6.1.4.1.19376.1.5.3.1.4.1.1']"
         id="d42e65598-false-d5432829e0">
      <extends rule="II"/>
      <assert role="error"
              see="http://elga.art-decor.org/elgaambbef-html-20230118T144941/tmp-1.2.40.0.34.6.0.11.3.37-2021-02-19T124116.html"
              test="empty(@xsi:type) or resolve-QName(@xsi:type, .) = QName('urn:hl7-org:v3', 'II')">(atcdabbr_entry_AllergyStatusObservation): Wenn eine @xsi:type Instruktion anwesend ist MUSS diese den Wert "{urn:hl7-org:v3}:II" haben. Gefunden "{<value-of select="namespace-uri-from-QName(resolve-QName(@xsi:type,.))"/>}:<value-of select="local-name-from-QName(resolve-QName(@xsi:type,.))"/>"</assert>
      <assert role="error"
              see="http://elga.art-decor.org/elgaambbef-html-20230118T144941/tmp-1.2.40.0.34.6.0.11.3.37-2021-02-19T124116.html"
              test="string(@root) = ('1.3.6.1.4.1.19376.1.5.3.1.4.1.1')">(atcdabbr_entry_AllergyStatusObservation): Der Wert von root MUSS '1.3.6.1.4.1.19376.1.5.3.1.4.1.1' sein. Gefunden: "<value-of select="@root"/>"</assert>
   </rule>
   <!--
Template derived rules for ID: 1.2.40.0.34.6.0.11.3.37
Context: *[hl7:observation[hl7:templateId[@root = '1.2.40.0.34.6.0.11.3.37'] and hl7:templateId[@root = '2.16.840.1.113883.10.22.4.21'] and hl7:templateId[@root = '1.3.6.1.4.1.19376.1.5.3.1.4.1.1']]]/hl7:observation[hl7:templateId[@root = '1.2.40.0.34.6.0.11.3.37'] and hl7:templateId[@root = '2.16.840.1.113883.10.22.4.21'] and hl7:templateId[@root = '1.3.6.1.4.1.19376.1.5.3.1.4.1.1']]/hl7:code[(@code = '33999-4' and @codeSystem = '2.16.840.1.113883.6.1')]
Item: (atcdabbr_entry_AllergyStatusObservation)
-->

   <rule fpi="RULC-1"
         context="*[hl7:observation[hl7:templateId[@root = '1.2.40.0.34.6.0.11.3.37'] and hl7:templateId[@root = '2.16.840.1.113883.10.22.4.21'] and hl7:templateId[@root = '1.3.6.1.4.1.19376.1.5.3.1.4.1.1']]]/hl7:observation[hl7:templateId[@root = '1.2.40.0.34.6.0.11.3.37'] and hl7:templateId[@root = '2.16.840.1.113883.10.22.4.21'] and hl7:templateId[@root = '1.3.6.1.4.1.19376.1.5.3.1.4.1.1']]/hl7:code[(@code = '33999-4' and @codeSystem = '2.16.840.1.113883.6.1')]"
         id="d42e65607-false-d5432844e0">
      <extends rule="CE"/>
      <assert role="error"
              see="http://elga.art-decor.org/elgaambbef-html-20230118T144941/tmp-1.2.40.0.34.6.0.11.3.37-2021-02-19T124116.html"
              test="empty(@xsi:type) or resolve-QName(@xsi:type, .) = QName('urn:hl7-org:v3', 'CE')">(atcdabbr_entry_AllergyStatusObservation): Wenn eine @xsi:type Instruktion anwesend ist MUSS diese den Wert "{urn:hl7-org:v3}:CE" haben. Gefunden "{<value-of select="namespace-uri-from-QName(resolve-QName(@xsi:type,.))"/>}:<value-of select="local-name-from-QName(resolve-QName(@xsi:type,.))"/>"</assert>
      <assert role="error"
              see="http://elga.art-decor.org/elgaambbef-html-20230118T144941/tmp-1.2.40.0.34.6.0.11.3.37-2021-02-19T124116.html"
              test="@nullFlavor or (@code='33999-4' and @codeSystem='2.16.840.1.113883.6.1')">(atcdabbr_entry_AllergyStatusObservation): Der Elementinhalt MUSS einer von 'code '33999-4' codeSystem '2.16.840.1.113883.6.1'' sein.</assert>
   </rule>
   <!--
Template derived rules for ID: 1.2.40.0.34.6.0.11.9.1
Context: *[hl7:observation[hl7:templateId[@root = '1.2.40.0.34.6.0.11.3.37'] and hl7:templateId[@root = '2.16.840.1.113883.10.22.4.21'] and hl7:templateId[@root = '1.3.6.1.4.1.19376.1.5.3.1.4.1.1']]]/hl7:observation[hl7:templateId[@root = '1.2.40.0.34.6.0.11.3.37'] and hl7:templateId[@root = '2.16.840.1.113883.10.22.4.21'] and hl7:templateId[@root = '1.3.6.1.4.1.19376.1.5.3.1.4.1.1']]/hl7:text
Item: (atcdabrr_other_NarrativeTextReference)
-->

   <rule fpi="RULC-1"
         context="*[hl7:observation[hl7:templateId[@root = '1.2.40.0.34.6.0.11.3.37'] and hl7:templateId[@root = '2.16.840.1.113883.10.22.4.21'] and hl7:templateId[@root = '1.3.6.1.4.1.19376.1.5.3.1.4.1.1']]]/hl7:observation[hl7:templateId[@root = '1.2.40.0.34.6.0.11.3.37'] and hl7:templateId[@root = '2.16.840.1.113883.10.22.4.21'] and hl7:templateId[@root = '1.3.6.1.4.1.19376.1.5.3.1.4.1.1']]/hl7:text"
         id="d5432845e67-false-d5432861e0">
      <extends rule="ED"/>
      <assert role="error"
              see="http://elga.art-decor.org/elgaambbef-html-20230118T144941/tmp-1.2.40.0.34.6.0.11.9.1-2021-05-06T093820.html"
              test="empty(@xsi:type) or resolve-QName(@xsi:type, .) = QName('urn:hl7-org:v3', 'ED')">(atcdabrr_other_NarrativeTextReference): Wenn eine @xsi:type Instruktion anwesend ist MUSS diese den Wert "{urn:hl7-org:v3}:ED" haben. Gefunden "{<value-of select="namespace-uri-from-QName(resolve-QName(@xsi:type,.))"/>}:<value-of select="local-name-from-QName(resolve-QName(@xsi:type,.))"/>"</assert>
      <assert role="error"
              see="http://elga.art-decor.org/elgaambbef-html-20230118T144941/tmp-1.2.40.0.34.6.0.11.9.1-2021-05-06T093820.html"
              test="count(hl7:reference[not(@nullFlavor)]) &gt;= 1">(atcdabrr_other_NarrativeTextReference): Element hl7:reference[not(@nullFlavor)] ist mandatory [min 1x].</assert>
      <assert role="error"
              see="http://elga.art-decor.org/elgaambbef-html-20230118T144941/tmp-1.2.40.0.34.6.0.11.9.1-2021-05-06T093820.html"
              test="count(hl7:reference[not(@nullFlavor)]) &lt;= 1">(atcdabrr_other_NarrativeTextReference): Element hl7:reference[not(@nullFlavor)] kommt zu häufig vor [max 1x].</assert>
   </rule>
   <!--
Template derived rules for ID: 1.2.40.0.34.6.0.11.9.1
Context: *[hl7:observation[hl7:templateId[@root = '1.2.40.0.34.6.0.11.3.37'] and hl7:templateId[@root = '2.16.840.1.113883.10.22.4.21'] and hl7:templateId[@root = '1.3.6.1.4.1.19376.1.5.3.1.4.1.1']]]/hl7:observation[hl7:templateId[@root = '1.2.40.0.34.6.0.11.3.37'] and hl7:templateId[@root = '2.16.840.1.113883.10.22.4.21'] and hl7:templateId[@root = '1.3.6.1.4.1.19376.1.5.3.1.4.1.1']]/hl7:text/hl7:reference[not(@nullFlavor)]
Item: (atcdabrr_other_NarrativeTextReference)
-->

   <rule fpi="RULC-1"
         context="*[hl7:observation[hl7:templateId[@root = '1.2.40.0.34.6.0.11.3.37'] and hl7:templateId[@root = '2.16.840.1.113883.10.22.4.21'] and hl7:templateId[@root = '1.3.6.1.4.1.19376.1.5.3.1.4.1.1']]]/hl7:observation[hl7:templateId[@root = '1.2.40.0.34.6.0.11.3.37'] and hl7:templateId[@root = '2.16.840.1.113883.10.22.4.21'] and hl7:templateId[@root = '1.3.6.1.4.1.19376.1.5.3.1.4.1.1']]/hl7:text/hl7:reference[not(@nullFlavor)]"
         id="d5432845e69-false-d5432880e0">
      <extends rule="TEL"/>
      <assert role="error"
              see="http://elga.art-decor.org/elgaambbef-html-20230118T144941/tmp-1.2.40.0.34.6.0.11.9.1-2021-05-06T093820.html"
              test="empty(@xsi:type) or resolve-QName(@xsi:type, .) = QName('urn:hl7-org:v3', 'TEL')">(atcdabrr_other_NarrativeTextReference): Wenn eine @xsi:type Instruktion anwesend ist MUSS diese den Wert "{urn:hl7-org:v3}:TEL" haben. Gefunden "{<value-of select="namespace-uri-from-QName(resolve-QName(@xsi:type,.))"/>}:<value-of select="local-name-from-QName(resolve-QName(@xsi:type,.))"/>"</assert>
      <assert role="error"
              see="http://elga.art-decor.org/elgaambbef-html-20230118T144941/tmp-1.2.40.0.34.6.0.11.9.1-2021-05-06T093820.html"
              test="@value">(atcdabrr_other_NarrativeTextReference): Attribut @value MUSS vorkommen.</assert>
      <assert role="error"
              see="http://elga.art-decor.org/elgaambbef-html-20230118T144941/tmp-1.2.40.0.34.6.0.11.9.1-2021-05-06T093820.html"
              test="starts-with(@value,'#') or starts-with(@value,'http')">(atcdabrr_other_NarrativeTextReference): The @value attribute content MUST conform to the format '#xxx', where xxx is the ID of the corresponding 'content'-element, or begin with the 'http' or 'https' url-scheme.</assert>
   </rule>
   <!--
Template derived rules for ID: 1.2.40.0.34.6.0.11.3.37
Context: *[hl7:observation[hl7:templateId[@root = '1.2.40.0.34.6.0.11.3.37'] and hl7:templateId[@root = '2.16.840.1.113883.10.22.4.21'] and hl7:templateId[@root = '1.3.6.1.4.1.19376.1.5.3.1.4.1.1']]]/hl7:observation[hl7:templateId[@root = '1.2.40.0.34.6.0.11.3.37'] and hl7:templateId[@root = '2.16.840.1.113883.10.22.4.21'] and hl7:templateId[@root = '1.3.6.1.4.1.19376.1.5.3.1.4.1.1']]/hl7:statusCode[@code = 'completed']
Item: (atcdabbr_entry_AllergyStatusObservation)
-->

   <rule fpi="RULC-1"
         context="*[hl7:observation[hl7:templateId[@root = '1.2.40.0.34.6.0.11.3.37'] and hl7:templateId[@root = '2.16.840.1.113883.10.22.4.21'] and hl7:templateId[@root = '1.3.6.1.4.1.19376.1.5.3.1.4.1.1']]]/hl7:observation[hl7:templateId[@root = '1.2.40.0.34.6.0.11.3.37'] and hl7:templateId[@root = '2.16.840.1.113883.10.22.4.21'] and hl7:templateId[@root = '1.3.6.1.4.1.19376.1.5.3.1.4.1.1']]/hl7:statusCode[@code = 'completed']"
         id="d42e65617-false-d5432895e0">
      <extends rule="CS"/>
      <assert role="error"
              see="http://elga.art-decor.org/elgaambbef-html-20230118T144941/tmp-1.2.40.0.34.6.0.11.3.37-2021-02-19T124116.html"
              test="empty(@xsi:type) or resolve-QName(@xsi:type, .) = QName('urn:hl7-org:v3', 'CS')">(atcdabbr_entry_AllergyStatusObservation): Wenn eine @xsi:type Instruktion anwesend ist MUSS diese den Wert "{urn:hl7-org:v3}:CS" haben. Gefunden "{<value-of select="namespace-uri-from-QName(resolve-QName(@xsi:type,.))"/>}:<value-of select="local-name-from-QName(resolve-QName(@xsi:type,.))"/>"</assert>
      <assert role="error"
              see="http://elga.art-decor.org/elgaambbef-html-20230118T144941/tmp-1.2.40.0.34.6.0.11.3.37-2021-02-19T124116.html"
              test="@nullFlavor or (@code='completed')">(atcdabbr_entry_AllergyStatusObservation): Der Elementinhalt MUSS einer von 'code 'completed'' sein.</assert>
   </rule>
   <!--
Template derived rules for ID: 1.2.40.0.34.6.0.11.3.37
Context: *[hl7:observation[hl7:templateId[@root = '1.2.40.0.34.6.0.11.3.37'] and hl7:templateId[@root = '2.16.840.1.113883.10.22.4.21'] and hl7:templateId[@root = '1.3.6.1.4.1.19376.1.5.3.1.4.1.1']]]/hl7:observation[hl7:templateId[@root = '1.2.40.0.34.6.0.11.3.37'] and hl7:templateId[@root = '2.16.840.1.113883.10.22.4.21'] and hl7:templateId[@root = '1.3.6.1.4.1.19376.1.5.3.1.4.1.1']]/hl7:value[concat(@code, @codeSystem) = doc('include/voc-1.2.40.0.34.10.183-DYNAMIC.xml')//valueSet[1]/conceptList/concept/concat(@code, @codeSystem)]
Item: (atcdabbr_entry_AllergyStatusObservation)
-->

   <rule fpi="RULC-1"
         context="*[hl7:observation[hl7:templateId[@root = '1.2.40.0.34.6.0.11.3.37'] and hl7:templateId[@root = '2.16.840.1.113883.10.22.4.21'] and hl7:templateId[@root = '1.3.6.1.4.1.19376.1.5.3.1.4.1.1']]]/hl7:observation[hl7:templateId[@root = '1.2.40.0.34.6.0.11.3.37'] and hl7:templateId[@root = '2.16.840.1.113883.10.22.4.21'] and hl7:templateId[@root = '1.3.6.1.4.1.19376.1.5.3.1.4.1.1']]/hl7:value[concat(@code, @codeSystem) = doc('include/voc-1.2.40.0.34.10.183-DYNAMIC.xml')//valueSet[1]/conceptList/concept/concat(@code, @codeSystem)]"
         id="d42e65625-false-d5432914e0">
      <let name="theCode" value="@code"/>
      <let name="theCodeSystem" value="@codeSystem"/>
      <assert role="error"
              see="http://elga.art-decor.org/elgaambbef-html-20230118T144941/tmp-1.2.40.0.34.6.0.11.3.37-2021-02-19T124116.html"
              test="@nullFlavor or exists(doc('include/voc-1.2.40.0.34.10.183-DYNAMIC.xml')//valueSet[1][conceptList/concept[@code = $theCode][@codeSystem = $theCodeSystem]])">(atcdabbr_entry_AllergyStatusObservation): Der Elementinhalt MUSS einer von '1.2.40.0.34.10.183 ELGA_AbsentOrUnknownAllergies (DYNAMIC)' sein.</assert>
      <let name="xsiLocalName"
           value="if (contains(@xsi:type, ':')) then substring-after(@xsi:type,':') else @xsi:type"/>
      <let name="xsiLocalNS"
           value="if (contains(@xsi:type, ':')) then namespace-uri-for-prefix(substring-before(@xsi:type,':'),.) else namespace-uri-for-prefix('',.)"/>
      <assert role="error"
              see="http://elga.art-decor.org/elgaambbef-html-20230118T144941/tmp-1.2.40.0.34.6.0.11.3.37-2021-02-19T124116.html"
              test="@nullFlavor or ($xsiLocalName='CD' and $xsiLocalNS='urn:hl7-org:v3')">(atcdabbr_entry_AllergyStatusObservation): Wenn eine @xsi:type Instruktion anwesend ist MUSS diese den Wert "{urn:hl7-org:v3}:CD" haben. Gefunden "{<value-of select="namespace-uri-from-QName(resolve-QName(@xsi:type,.))"/>}:<value-of select="local-name-from-QName(resolve-QName(@xsi:type,.))"/>"</assert>
   </rule>
</pattern>
