<?xml version="1.0" encoding="UTF-8"?>
<!--
Template derived pattern
===========================================
ID: 1.2.40.0.34.6.0.11.3.84
Name: Device PCHA Version Information Observation
Description: Die Device PCHA Version Information Observation dokumentiert die PCHA (Continua) Version des verwendeten Gerätes. In PCHA konformen Geräten, kommen die Informationen aus dem RegCertDataList Attribut oder dem RegCertData Werten des Device Information Service eines Bluetooth Low Energy Health device.
-->
<pattern xmlns="http://purl.oclc.org/dsdl/schematron"
         id="template-1.2.40.0.34.6.0.11.3.84-2021-02-18T132912-closed">
   <title>Device PCHA Version Information Observation</title>

   <!-- Checking undefined contents for template/element @isClosed="true". Match context that we did not already match -->
   <rule fpi="RUL-QQQ"
         context="*[hl7:observation[hl7:templateId[@root = '1.2.40.0.34.6.0.11.3.84'] and hl7:templateId[@root = '2.16.840.1.113883.10.20.36.17'][@extension = '2015-08-17'] and hl7:templateId[@root = '2.16.840.1.113883.10.20.36.17'][@extension = '2015-08-17'] and hl7:templateId[@root = '2.16.840.1.113883.10.20.36.27'][@extension = '2015-08-17']]]/*[not(@xsi:nil = 'true')][not(self::hl7:observation[hl7:templateId[@root = '1.2.40.0.34.6.0.11.3.84'] and hl7:templateId[@root = '2.16.840.1.113883.10.20.36.17'][@extension = '2015-08-17'] and hl7:templateId[@root = '2.16.840.1.113883.10.20.36.17'][@extension = '2015-08-17'] and hl7:templateId[@root = '2.16.840.1.113883.10.20.36.27'][@extension = '2015-08-17']])]"
         id="d41e54567-true-d3608404e0">
      <assert role="error"
              see="http://elga.art-decor.org/elgatgd-html-20240709T111220/tmp-1.2.40.0.34.6.0.11.3.84-2021-02-18T132912.html"
              test="not(.)">(atcdabbr_entry_DevicePCHAVersionInformationObservation)/d41e54567-true-d3608404e0: '<value-of select="name(..)"/>' ist als geschlossen definiert und dieses Element '<name/>' ist nicht erlaubt oder nicht mit diesem Inhalt erlaubt. Dies kann templateId, code oder id betreffen. Erwartet:  hl7:observation[hl7:templateId[@root = '1.2.40.0.34.6.0.11.3.84'] and hl7:templateId[@root = '2.16.840.1.113883.10.20.36.17'][@extension = '2015-08-17'] and hl7:templateId[@root = '2.16.840.1.113883.10.20.36.17'][@extension = '2015-08-17'] and hl7:templateId[@root = '2.16.840.1.113883.10.20.36.27'][@extension = '2015-08-17']] (rule-reference: d41e54567-true-d3608404e0)</assert>
   </rule>

   <!-- Checking undefined contents for template/element @isClosed="true". Match context that we did not already match -->
   <rule fpi="RUL-QQQ"
         context="*[hl7:observation[hl7:templateId[@root = '1.2.40.0.34.6.0.11.3.84'] and hl7:templateId[@root = '2.16.840.1.113883.10.20.36.17'][@extension = '2015-08-17'] and hl7:templateId[@root = '2.16.840.1.113883.10.20.36.17'][@extension = '2015-08-17'] and hl7:templateId[@root = '2.16.840.1.113883.10.20.36.27'][@extension = '2015-08-17']]]/hl7:observation[hl7:templateId[@root = '1.2.40.0.34.6.0.11.3.84'] and hl7:templateId[@root = '2.16.840.1.113883.10.20.36.17'][@extension = '2015-08-17'] and hl7:templateId[@root = '2.16.840.1.113883.10.20.36.17'][@extension = '2015-08-17'] and hl7:templateId[@root = '2.16.840.1.113883.10.20.36.27'][@extension = '2015-08-17']]/*[not(@xsi:nil = 'true')][not(self::hl7:templateId[@root = '1.2.40.0.34.6.0.11.3.84'] | self::hl7:templateId[@root = '2.16.840.1.113883.10.20.36.17'][@extension = '2015-08-17'] | self::hl7:templateId[@root = '2.16.840.1.113883.10.20.36.17'][@extension = '2015-08-17'] | self::hl7:templateId[@root = '2.16.840.1.113883.10.20.36.27'][@extension = '2015-08-17'] | self::hl7:code[(@code = '532352' and @codeSystem = '2.16.840.1.113883.6.24')] | self::hl7:text[not(@nullFlavor)] | self::hl7:value[not(@nullFlavor)][resolve-QName(@xsi:type, .) = QName('urn:hl7-org:v3', 'ST')])]"
         id="d41e54635-true-d3608462e0">
      <assert role="error"
              see="http://elga.art-decor.org/elgatgd-html-20240709T111220/tmp-1.2.40.0.34.6.0.11.3.84-2021-02-18T132912.html"
              test="not(.)">(atcdabbr_entry_DevicePCHAVersionInformationObservation)/d41e54635-true-d3608462e0: '<value-of select="name(..)"/>' ist als geschlossen definiert und dieses Element '<name/>' ist nicht erlaubt oder nicht mit diesem Inhalt erlaubt. Dies kann templateId, code oder id betreffen. Erwartet:  hl7:templateId[@root = '1.2.40.0.34.6.0.11.3.84'] | hl7:templateId[@root = '2.16.840.1.113883.10.20.36.17'][@extension = '2015-08-17'] | hl7:templateId[@root = '2.16.840.1.113883.10.20.36.17'][@extension = '2015-08-17'] | hl7:templateId[@root = '2.16.840.1.113883.10.20.36.27'][@extension = '2015-08-17'] | hl7:code[(@code = '532352' and @codeSystem = '2.16.840.1.113883.6.24')] | hl7:text[not(@nullFlavor)] | hl7:value[not(@nullFlavor)][resolve-QName(@xsi:type, .) = QName('urn:hl7-org:v3', 'ST')] (rule-reference: d41e54635-true-d3608462e0)</assert>
   </rule>

   <!-- Checking undefined contents for template/element @isClosed="true". Match context that we did not already match -->
   <rule fpi="RUL-QQQ"
         context="*[hl7:observation[hl7:templateId[@root = '1.2.40.0.34.6.0.11.3.84'] and hl7:templateId[@root = '2.16.840.1.113883.10.20.36.17'][@extension = '2015-08-17'] and hl7:templateId[@root = '2.16.840.1.113883.10.20.36.17'][@extension = '2015-08-17'] and hl7:templateId[@root = '2.16.840.1.113883.10.20.36.27'][@extension = '2015-08-17']]]/hl7:observation[hl7:templateId[@root = '1.2.40.0.34.6.0.11.3.84'] and hl7:templateId[@root = '2.16.840.1.113883.10.20.36.17'][@extension = '2015-08-17'] and hl7:templateId[@root = '2.16.840.1.113883.10.20.36.17'][@extension = '2015-08-17'] and hl7:templateId[@root = '2.16.840.1.113883.10.20.36.27'][@extension = '2015-08-17']]/hl7:code[(@code = '532352' and @codeSystem = '2.16.840.1.113883.6.24')]/*[not(@xsi:nil = 'true')][not(self::hl7:translation | self::ips:designation)]"
         id="d41e54680-true-d3608506e0">
      <assert role="error"
              see="http://elga.art-decor.org/elgatgd-html-20240709T111220/tmp-1.2.40.0.34.6.0.11.3.84-2021-02-18T132912.html"
              test="not(.)">(atcdabbr_entry_DevicePCHAVersionInformationObservation)/d41e54680-true-d3608506e0: '<value-of select="name(..)"/>' ist als geschlossen definiert und dieses Element '<name/>' ist nicht erlaubt oder nicht mit diesem Inhalt erlaubt. Dies kann templateId, code oder id betreffen. Erwartet:  hl7:translation | ips:designation (rule-reference: d41e54680-true-d3608506e0)</assert>
   </rule>

   <!-- Checking undefined contents for template/element @isClosed="true". Match context that we did not already match -->
   <rule fpi="RUL-QQQ"
         context="*[hl7:observation[hl7:templateId[@root = '1.2.40.0.34.6.0.11.3.84'] and hl7:templateId[@root = '2.16.840.1.113883.10.20.36.17'][@extension = '2015-08-17'] and hl7:templateId[@root = '2.16.840.1.113883.10.20.36.17'][@extension = '2015-08-17'] and hl7:templateId[@root = '2.16.840.1.113883.10.20.36.27'][@extension = '2015-08-17']]]/hl7:observation[hl7:templateId[@root = '1.2.40.0.34.6.0.11.3.84'] and hl7:templateId[@root = '2.16.840.1.113883.10.20.36.17'][@extension = '2015-08-17'] and hl7:templateId[@root = '2.16.840.1.113883.10.20.36.17'][@extension = '2015-08-17'] and hl7:templateId[@root = '2.16.840.1.113883.10.20.36.27'][@extension = '2015-08-17']]/hl7:text[not(@nullFlavor)]/*[not(@xsi:nil = 'true')][not(self::hl7:reference[not(@nullFlavor)])]"
         id="d41e54714-true-d3608530e0">
      <assert role="error"
              see="http://elga.art-decor.org/elgatgd-html-20240709T111220/tmp-1.2.40.0.34.6.0.11.3.84-2021-02-18T132912.html"
              test="not(.)">(atcdabbr_entry_DevicePCHAVersionInformationObservation)/d41e54714-true-d3608530e0: '<value-of select="name(..)"/>' ist als geschlossen definiert und dieses Element '<name/>' ist nicht erlaubt oder nicht mit diesem Inhalt erlaubt. Dies kann templateId, code oder id betreffen. Erwartet:  hl7:reference[not(@nullFlavor)] (rule-reference: d41e54714-true-d3608530e0)</assert>
   </rule>
</pattern>
