<?xml version="1.0" encoding="UTF-8"?>
<!-- 
    DTr1 IVXB_REAL - Real
    Status: draft
-->
<rule xmlns="http://purl.oclc.org/dsdl/schematron"
      abstract="true"
      id="IVXB_REAL">
    <extends rule="REAL"/>
    <assert role="error"
           test="not(@nullFlavor and @inclusive) or @inclusive = 'true'"
           see="https://docs.art-decor.org/documentation/datatypes/DTr1_IVXB_REAL">dtr1-1-IVXB_REAL: not inclusive if null</assert>
</rule>
