<?xml version="1.0" encoding="UTF-8"?>
<!--
Template derived pattern
===========================================
ID: 1.2.40.0.34.6.0.11.3.72
Name: Medikationseinnahme Entry
Description: 
-->
<pattern xmlns="http://purl.oclc.org/dsdl/schematron"
         id="template-1.2.40.0.34.6.0.11.3.72-2020-10-02T075121-closed">
   <title>Medikationseinnahme Entry</title>

   <!-- Checking undefined contents for template/element @isClosed="true". Match context that we did not already match -->
   <rule fpi="RUL-QQQ"
         context="*[hl7:substanceAdministration[hl7:templateId[@root = '1.2.40.0.34.6.0.11.3.72'] and hl7:templateId[@root = '2.16.840.1.113883.10.20.1.24'] and hl7:templateId[@root = '1.3.6.1.4.1.19376.1.5.3.1.4.7'] and hl7:templateId[@root = '1.3.6.1.4.1.19376.1.9.1.3.16'] and hl7:templateId[@root = '1.3.6.1.4.1.19376.1.5.3.1.4.7.1']]]/*[not(@xsi:nil = 'true')][not(self::hl7:substanceAdministration[hl7:templateId[@root = '1.2.40.0.34.6.0.11.3.72'] and hl7:templateId[@root = '2.16.840.1.113883.10.20.1.24'] and hl7:templateId[@root = '1.3.6.1.4.1.19376.1.5.3.1.4.7'] and hl7:templateId[@root = '1.3.6.1.4.1.19376.1.9.1.3.16'] and hl7:templateId[@root = '1.3.6.1.4.1.19376.1.5.3.1.4.7.1']])]"
         id="d42e76294-true-d5719899e0">
      <assert role="error"
              see="http://elga.art-decor.org/elgaambbef-html-20230118T144941/tmp-1.2.40.0.34.6.0.11.3.72-2020-10-02T075121.html"
              test="not(.)">(atcdabbr_entry_MedikationsEinnahmeEntry)/d42e76294-true-d5719899e0: '<value-of select="name(..)"/>' ist als geschlossen definiert und dieses Element '<name/>' ist nicht erlaubt oder nicht mit diesem Inhalt erlaubt. Dies kann templateId, code oder id betreffen. Erwartet:  hl7:substanceAdministration[hl7:templateId[@root = '1.2.40.0.34.6.0.11.3.72'] and hl7:templateId[@root = '2.16.840.1.113883.10.20.1.24'] and hl7:templateId[@root = '1.3.6.1.4.1.19376.1.5.3.1.4.7'] and hl7:templateId[@root = '1.3.6.1.4.1.19376.1.9.1.3.16'] and hl7:templateId[@root = '1.3.6.1.4.1.19376.1.5.3.1.4.7.1']] (rule-reference: d42e76294-true-d5719899e0)</assert>
   </rule>

   <!-- Checking undefined contents for template/element @isClosed="true". Match context that we did not already match -->
   <rule fpi="RUL-QQQ"
         context="*[hl7:substanceAdministration[hl7:templateId[@root = '1.2.40.0.34.6.0.11.3.72'] and hl7:templateId[@root = '2.16.840.1.113883.10.20.1.24'] and hl7:templateId[@root = '1.3.6.1.4.1.19376.1.5.3.1.4.7'] and hl7:templateId[@root = '1.3.6.1.4.1.19376.1.9.1.3.16'] and hl7:templateId[@root = '1.3.6.1.4.1.19376.1.5.3.1.4.7.1']]]/hl7:substanceAdministration[hl7:templateId[@root = '1.2.40.0.34.6.0.11.3.72'] and hl7:templateId[@root = '2.16.840.1.113883.10.20.1.24'] and hl7:templateId[@root = '1.3.6.1.4.1.19376.1.5.3.1.4.7'] and hl7:templateId[@root = '1.3.6.1.4.1.19376.1.9.1.3.16'] and hl7:templateId[@root = '1.3.6.1.4.1.19376.1.5.3.1.4.7.1']]/*[not(@xsi:nil = 'true')][not(self::hl7:templateId[@root = '1.2.40.0.34.6.0.11.3.72'] | self::hl7:templateId[@root = '2.16.840.1.113883.10.20.1.24'] | self::hl7:templateId[@root = '1.3.6.1.4.1.19376.1.5.3.1.4.7'] | self::hl7:templateId[@root = '1.3.6.1.4.1.19376.1.9.1.3.16'] | self::hl7:templateId[@root = '1.3.6.1.4.1.19376.1.5.3.1.4.7.1'] | self::hl7:id[not(@nullFlavor)] | self::hl7:code[@codeSystem = '2.16.840.1.113883.4.642.1.101'] | self::hl7:text[not(@nullFlavor)] | self::hl7:statusCode[@code = 'completed'] | self::hl7:effectiveTime | self::hl7:effectiveTime | self::hl7:routeCode[@nullFlavor = 'NA'] | self::hl7:approachSiteCode[@nullFlavor = 'NA'] | self::hl7:doseQuantity | self::hl7:rateQuantity[@nullFlavor = 'NA'] | self::hl7:consumable[hl7:manufacturedProduct[hl7:templateId[@root = '1.3.6.1.4.1.19376.1.5.3.1.4.7.2'] and hl7:templateId[@root = '2.16.840.1.113883.10.20.1.53']]] | self::hl7:author[hl7:assignedAuthor] | self::hl7:author | self::hl7:entryRelationship[@typeCode='RSON'][hl7:act/hl7:templateId[@root='1.3.6.1.4.1.19376.1.5.3.1.4.4.1']] | self::hl7:entryRelationship[@typeCode='SUBJ'][hl7:act/hl7:templateId[@root='2.16.840.1.113883.10.20.1.43']] | self::hl7:entryRelationship[@typeCode='COMP'][hl7:supply] | self::hl7:entryRelationship[@typeCode='REFR'][hl7:substanceAdministration/hl7:templateId[@root='1.3.6.1.4.1.19376.1.9.1.3.10']] | self::hl7:entryRelationship[@typeCode='REFR'][hl7:substanceAdministration/hl7:templateId[@root='1.3.6.1.4.1.19376.1.9.1.3.11']] | self::hl7:entryRelationship[@typeCode='REFR'][hl7:supply/hl7:templateId[@root='1.3.6.1.4.1.19376.1.9.1.3.12']] | self::hl7:entryRelationship[@typeCode='REFR'][hl7:substanceAdministration/hl7:templateId[@root='1.3.6.1.4.1.19376.1.9.1.3.13']] | self::hl7:entryRelationship[@typeCode='REFR'][hl7:substanceAdministration/hl7:templateId[@root='1.3.6.1.4.1.19376.1.9.1.3.14']] | self::hl7:reference[@typeCode = 'XCRPT'][hl7:externalDocument] | self::hl7:precondition[hl7:criterion])]"
         id="d42e76597-true-d5720159e0">
      <assert role="error"
              see="http://elga.art-decor.org/elgaambbef-html-20230118T144941/tmp-1.2.40.0.34.6.0.11.3.72-2020-10-02T075121.html"
              test="not(.)">(atcdabbr_entry_MedikationsEinnahmeEntry)/d42e76597-true-d5720159e0: '<value-of select="name(..)"/>' ist als geschlossen definiert und dieses Element '<name/>' ist nicht erlaubt oder nicht mit diesem Inhalt erlaubt. Dies kann templateId, code oder id betreffen. Erwartet:  hl7:templateId[@root = '1.2.40.0.34.6.0.11.3.72'] | hl7:templateId[@root = '2.16.840.1.113883.10.20.1.24'] | hl7:templateId[@root = '1.3.6.1.4.1.19376.1.5.3.1.4.7'] | hl7:templateId[@root = '1.3.6.1.4.1.19376.1.9.1.3.16'] | hl7:templateId[@root = '1.3.6.1.4.1.19376.1.5.3.1.4.7.1'] | hl7:id[not(@nullFlavor)] | hl7:code[@codeSystem = '2.16.840.1.113883.4.642.1.101'] | hl7:text[not(@nullFlavor)] | hl7:statusCode[@code = 'completed'] | hl7:effectiveTime | hl7:effectiveTime | hl7:routeCode[@nullFlavor = 'NA'] | hl7:approachSiteCode[@nullFlavor = 'NA'] | hl7:doseQuantity | hl7:rateQuantity[@nullFlavor = 'NA'] | hl7:consumable[hl7:manufacturedProduct[hl7:templateId[@root = '1.3.6.1.4.1.19376.1.5.3.1.4.7.2'] and hl7:templateId[@root = '2.16.840.1.113883.10.20.1.53']]] | hl7:author[hl7:assignedAuthor] | hl7:author | hl7:entryRelationship[@typeCode='RSON'][hl7:act/hl7:templateId[@root='1.3.6.1.4.1.19376.1.5.3.1.4.4.1']] | hl7:entryRelationship[@typeCode='SUBJ'][hl7:act/hl7:templateId[@root='2.16.840.1.113883.10.20.1.43']] | hl7:entryRelationship[@typeCode='COMP'][hl7:supply] | hl7:entryRelationship[@typeCode='REFR'][hl7:substanceAdministration/hl7:templateId[@root='1.3.6.1.4.1.19376.1.9.1.3.10']] | hl7:entryRelationship[@typeCode='REFR'][hl7:substanceAdministration/hl7:templateId[@root='1.3.6.1.4.1.19376.1.9.1.3.11']] | hl7:entryRelationship[@typeCode='REFR'][hl7:supply/hl7:templateId[@root='1.3.6.1.4.1.19376.1.9.1.3.12']] | hl7:entryRelationship[@typeCode='REFR'][hl7:substanceAdministration/hl7:templateId[@root='1.3.6.1.4.1.19376.1.9.1.3.13']] | hl7:entryRelationship[@typeCode='REFR'][hl7:substanceAdministration/hl7:templateId[@root='1.3.6.1.4.1.19376.1.9.1.3.14']] | hl7:reference[@typeCode = 'XCRPT'][hl7:externalDocument] | hl7:precondition[hl7:criterion] (rule-reference: d42e76597-true-d5720159e0)</assert>
   </rule>

   <!-- Checking undefined contents for template/element @isClosed="true". Match context that we did not already match -->
   <rule fpi="RUL-QQQ"
         context="*[hl7:substanceAdministration[hl7:templateId[@root = '1.2.40.0.34.6.0.11.3.72'] and hl7:templateId[@root = '2.16.840.1.113883.10.20.1.24'] and hl7:templateId[@root = '1.3.6.1.4.1.19376.1.5.3.1.4.7'] and hl7:templateId[@root = '1.3.6.1.4.1.19376.1.9.1.3.16'] and hl7:templateId[@root = '1.3.6.1.4.1.19376.1.5.3.1.4.7.1']]]/hl7:substanceAdministration[hl7:templateId[@root = '1.2.40.0.34.6.0.11.3.72'] and hl7:templateId[@root = '2.16.840.1.113883.10.20.1.24'] and hl7:templateId[@root = '1.3.6.1.4.1.19376.1.5.3.1.4.7'] and hl7:templateId[@root = '1.3.6.1.4.1.19376.1.9.1.3.16'] and hl7:templateId[@root = '1.3.6.1.4.1.19376.1.5.3.1.4.7.1']]/hl7:code[@codeSystem = '2.16.840.1.113883.4.642.1.101']/*[not(@xsi:nil = 'true')][not(self::hl7:translation | self::ips:designation)]"
         id="d42e76678-true-d5720214e0">
      <assert role="error"
              see="http://elga.art-decor.org/elgaambbef-html-20230118T144941/tmp-1.2.40.0.34.6.0.11.3.72-2020-10-02T075121.html"
              test="not(.)">(atcdabbr_entry_MedikationsEinnahmeEntry)/d42e76678-true-d5720214e0: '<value-of select="name(..)"/>' ist als geschlossen definiert und dieses Element '<name/>' ist nicht erlaubt oder nicht mit diesem Inhalt erlaubt. Dies kann templateId, code oder id betreffen. Erwartet:  hl7:translation | ips:designation (rule-reference: d42e76678-true-d5720214e0)</assert>
   </rule>

   <!-- Checking undefined contents for template/element @isClosed="true". Match context that we did not already match -->
   <rule fpi="RUL-QQQ"
         context="*[hl7:substanceAdministration[hl7:templateId[@root = '1.2.40.0.34.6.0.11.3.72'] and hl7:templateId[@root = '2.16.840.1.113883.10.20.1.24'] and hl7:templateId[@root = '1.3.6.1.4.1.19376.1.5.3.1.4.7'] and hl7:templateId[@root = '1.3.6.1.4.1.19376.1.9.1.3.16'] and hl7:templateId[@root = '1.3.6.1.4.1.19376.1.5.3.1.4.7.1']]]/hl7:substanceAdministration[hl7:templateId[@root = '1.2.40.0.34.6.0.11.3.72'] and hl7:templateId[@root = '2.16.840.1.113883.10.20.1.24'] and hl7:templateId[@root = '1.3.6.1.4.1.19376.1.5.3.1.4.7'] and hl7:templateId[@root = '1.3.6.1.4.1.19376.1.9.1.3.16'] and hl7:templateId[@root = '1.3.6.1.4.1.19376.1.5.3.1.4.7.1']]/hl7:text[not(@nullFlavor)]/*[not(@xsi:nil = 'true')][not(self::hl7:reference[not(@nullFlavor)])]"
         id="d42e76728-true-d5720238e0">
      <assert role="error"
              see="http://elga.art-decor.org/elgaambbef-html-20230118T144941/tmp-1.2.40.0.34.6.0.11.3.72-2020-10-02T075121.html"
              test="not(.)">(atcdabbr_entry_MedikationsEinnahmeEntry)/d42e76728-true-d5720238e0: '<value-of select="name(..)"/>' ist als geschlossen definiert und dieses Element '<name/>' ist nicht erlaubt oder nicht mit diesem Inhalt erlaubt. Dies kann templateId, code oder id betreffen. Erwartet:  hl7:reference[not(@nullFlavor)] (rule-reference: d42e76728-true-d5720238e0)</assert>
   </rule>

   <!-- Checking undefined contents for template/element @isClosed="true". Match context that we did not already match -->
   <rule fpi="RUL-QQQ"
         context="*[hl7:substanceAdministration[hl7:templateId[@root = '1.2.40.0.34.6.0.11.3.72'] and hl7:templateId[@root = '2.16.840.1.113883.10.20.1.24'] and hl7:templateId[@root = '1.3.6.1.4.1.19376.1.5.3.1.4.7'] and hl7:templateId[@root = '1.3.6.1.4.1.19376.1.9.1.3.16'] and hl7:templateId[@root = '1.3.6.1.4.1.19376.1.5.3.1.4.7.1']]]/hl7:substanceAdministration[hl7:templateId[@root = '1.2.40.0.34.6.0.11.3.72'] and hl7:templateId[@root = '2.16.840.1.113883.10.20.1.24'] and hl7:templateId[@root = '1.3.6.1.4.1.19376.1.5.3.1.4.7'] and hl7:templateId[@root = '1.3.6.1.4.1.19376.1.9.1.3.16'] and hl7:templateId[@root = '1.3.6.1.4.1.19376.1.5.3.1.4.7.1']]/hl7:effectiveTime/*[not(@xsi:nil = 'true')][not(self::hl7:low[not(@nullFlavor)] | self::hl7:high[not(@nullFlavor)])]"
         id="d42e76791-true-d5720273e0">
      <assert role="error"
              see="http://elga.art-decor.org/elgaambbef-html-20230118T144941/tmp-1.2.40.0.34.6.0.11.3.72-2020-10-02T075121.html"
              test="not(.)">(atcdabbr_entry_MedikationsEinnahmeEntry)/d42e76791-true-d5720273e0: '<value-of select="name(..)"/>' ist als geschlossen definiert und dieses Element '<name/>' ist nicht erlaubt oder nicht mit diesem Inhalt erlaubt. Dies kann templateId, code oder id betreffen. Erwartet:  hl7:low[not(@nullFlavor)] | hl7:high[not(@nullFlavor)] (rule-reference: d42e76791-true-d5720273e0)</assert>
   </rule>

   <!-- Checking undefined contents for template/element @isClosed="true". Match context that we did not already match -->
   <rule fpi="RUL-QQQ"
         context="*[hl7:substanceAdministration[hl7:templateId[@root = '1.2.40.0.34.6.0.11.3.72'] and hl7:templateId[@root = '2.16.840.1.113883.10.20.1.24'] and hl7:templateId[@root = '1.3.6.1.4.1.19376.1.5.3.1.4.7'] and hl7:templateId[@root = '1.3.6.1.4.1.19376.1.9.1.3.16'] and hl7:templateId[@root = '1.3.6.1.4.1.19376.1.5.3.1.4.7.1']]]/hl7:substanceAdministration[hl7:templateId[@root = '1.2.40.0.34.6.0.11.3.72'] and hl7:templateId[@root = '2.16.840.1.113883.10.20.1.24'] and hl7:templateId[@root = '1.3.6.1.4.1.19376.1.5.3.1.4.7'] and hl7:templateId[@root = '1.3.6.1.4.1.19376.1.9.1.3.16'] and hl7:templateId[@root = '1.3.6.1.4.1.19376.1.5.3.1.4.7.1']]/hl7:consumable[hl7:manufacturedProduct[hl7:templateId[@root = '1.3.6.1.4.1.19376.1.5.3.1.4.7.2'] and hl7:templateId[@root = '2.16.840.1.113883.10.20.1.53']]]/*[not(@xsi:nil = 'true')][not(self::hl7:manufacturedProduct[hl7:templateId[@root = '1.3.6.1.4.1.19376.1.5.3.1.4.7.2'] and hl7:templateId[@root = '2.16.840.1.113883.10.20.1.53']])]"
         id="d42e76900-true-d5720326e0">
      <assert role="error"
              see="http://elga.art-decor.org/elgaambbef-html-20230118T144941/tmp-1.2.40.0.34.6.0.11.3.72-2020-10-02T075121.html"
              test="not(.)">(atcdabbr_entry_MedikationsEinnahmeEntry)/d42e76900-true-d5720326e0: '<value-of select="name(..)"/>' ist als geschlossen definiert und dieses Element '<name/>' ist nicht erlaubt oder nicht mit diesem Inhalt erlaubt. Dies kann templateId, code oder id betreffen. Erwartet:  hl7:manufacturedProduct[hl7:templateId[@root = '1.3.6.1.4.1.19376.1.5.3.1.4.7.2'] and hl7:templateId[@root = '2.16.840.1.113883.10.20.1.53']] (rule-reference: d42e76900-true-d5720326e0)</assert>
   </rule>

   <!-- Checking undefined contents for template/element @isClosed="true". Match context that we did not already match -->
   <rule fpi="RUL-QQQ"
         context="*[hl7:substanceAdministration[hl7:templateId[@root = '1.2.40.0.34.6.0.11.3.72'] and hl7:templateId[@root = '2.16.840.1.113883.10.20.1.24'] and hl7:templateId[@root = '1.3.6.1.4.1.19376.1.5.3.1.4.7'] and hl7:templateId[@root = '1.3.6.1.4.1.19376.1.9.1.3.16'] and hl7:templateId[@root = '1.3.6.1.4.1.19376.1.5.3.1.4.7.1']]]/hl7:substanceAdministration[hl7:templateId[@root = '1.2.40.0.34.6.0.11.3.72'] and hl7:templateId[@root = '2.16.840.1.113883.10.20.1.24'] and hl7:templateId[@root = '1.3.6.1.4.1.19376.1.5.3.1.4.7'] and hl7:templateId[@root = '1.3.6.1.4.1.19376.1.9.1.3.16'] and hl7:templateId[@root = '1.3.6.1.4.1.19376.1.5.3.1.4.7.1']]/hl7:consumable[hl7:manufacturedProduct[hl7:templateId[@root = '1.3.6.1.4.1.19376.1.5.3.1.4.7.2'] and hl7:templateId[@root = '2.16.840.1.113883.10.20.1.53']]]/hl7:manufacturedProduct[hl7:templateId[@root = '1.3.6.1.4.1.19376.1.5.3.1.4.7.2'] and hl7:templateId[@root = '2.16.840.1.113883.10.20.1.53']]/*[not(@xsi:nil = 'true')][not(self::hl7:templateId[@root = '1.3.6.1.4.1.19376.1.5.3.1.4.7.2'] | self::hl7:templateId[@root = '2.16.840.1.113883.10.20.1.53'] | self::hl7:manufacturedMaterial[hl7:templateId[@root = '1.2.40.0.34.11.2.3.4'] and hl7:templateId[@root = '1.3.6.1.4.1.19376.1.9.1.3.1']])]"
         id="d5720308e50-true-d5720360e0">
      <assert role="error"
              see="http://elga.art-decor.org/elgaambbef-html-20230118T144941/tmp-1.2.40.0.34.6.0.11.3.72-2020-10-02T075121.html"
              test="not(.)">(atcdabbr_entry_MedikationsEinnahmeEntry)/d5720308e50-true-d5720360e0: '<value-of select="name(..)"/>' ist als geschlossen definiert und dieses Element '<name/>' ist nicht erlaubt oder nicht mit diesem Inhalt erlaubt. Dies kann templateId, code oder id betreffen. Erwartet:  hl7:templateId[@root = '1.3.6.1.4.1.19376.1.5.3.1.4.7.2'] | hl7:templateId[@root = '2.16.840.1.113883.10.20.1.53'] | hl7:manufacturedMaterial[hl7:templateId[@root = '1.2.40.0.34.11.2.3.4'] and hl7:templateId[@root = '1.3.6.1.4.1.19376.1.9.1.3.1']] (rule-reference: d5720308e50-true-d5720360e0)</assert>
   </rule>

   <!-- Checking undefined contents for template/element @isClosed="true". Match context that we did not already match -->
   <rule fpi="RUL-QQQ"
         context="*[hl7:substanceAdministration[hl7:templateId[@root = '1.2.40.0.34.6.0.11.3.72'] and hl7:templateId[@root = '2.16.840.1.113883.10.20.1.24'] and hl7:templateId[@root = '1.3.6.1.4.1.19376.1.5.3.1.4.7'] and hl7:templateId[@root = '1.3.6.1.4.1.19376.1.9.1.3.16'] and hl7:templateId[@root = '1.3.6.1.4.1.19376.1.5.3.1.4.7.1']]]/hl7:substanceAdministration[hl7:templateId[@root = '1.2.40.0.34.6.0.11.3.72'] and hl7:templateId[@root = '2.16.840.1.113883.10.20.1.24'] and hl7:templateId[@root = '1.3.6.1.4.1.19376.1.5.3.1.4.7'] and hl7:templateId[@root = '1.3.6.1.4.1.19376.1.9.1.3.16'] and hl7:templateId[@root = '1.3.6.1.4.1.19376.1.5.3.1.4.7.1']]/hl7:consumable[hl7:manufacturedProduct[hl7:templateId[@root = '1.3.6.1.4.1.19376.1.5.3.1.4.7.2'] and hl7:templateId[@root = '2.16.840.1.113883.10.20.1.53']]]/hl7:manufacturedProduct[hl7:templateId[@root = '1.3.6.1.4.1.19376.1.5.3.1.4.7.2'] and hl7:templateId[@root = '2.16.840.1.113883.10.20.1.53']]/hl7:manufacturedMaterial[hl7:templateId[@root = '1.2.40.0.34.11.2.3.4'] and hl7:templateId[@root = '1.3.6.1.4.1.19376.1.9.1.3.1']]/*[not(@xsi:nil = 'true')][not(self::hl7:templateId[@root = '1.2.40.0.34.11.2.3.4'] | self::hl7:templateId[@root = '1.3.6.1.4.1.19376.1.9.1.3.1'] | self::hl7:code[@codeSystem = '1.2.40.0.34.4.16' or @codeSystem = '1.2.40.0.34.4.17' or @nullFlavor] | self::hl7:name | self::pharm:formCode[@codeSystem = '1.2.40.0.10.1.4.3.4.3.5' or @nullFlavor] | self::pharm:asContent[@classCode = 'CONT'][pharm:containerPackagedMedicine[@classCode = 'CONT'][@determinerCode = 'INSTANCE']] | self::pharm:ingredient[@classCode = 'ACTI'][pharm:ingredient[@classCode = 'MMAT'][@determinerCode = 'KIND']])]"
         id="d5720308e64-true-d5720426e0">
      <assert role="error"
              see="http://elga.art-decor.org/elgaambbef-html-20230118T144941/tmp-1.2.40.0.34.6.0.11.3.72-2020-10-02T075121.html"
              test="not(.)">(atcdabbr_entry_MedikationsEinnahmeEntry)/d5720308e64-true-d5720426e0: '<value-of select="name(..)"/>' ist als geschlossen definiert und dieses Element '<name/>' ist nicht erlaubt oder nicht mit diesem Inhalt erlaubt. Dies kann templateId, code oder id betreffen. Erwartet:  hl7:templateId[@root = '1.2.40.0.34.11.2.3.4'] | hl7:templateId[@root = '1.3.6.1.4.1.19376.1.9.1.3.1'] | hl7:code[@codeSystem = '1.2.40.0.34.4.16' or @codeSystem = '1.2.40.0.34.4.17' or @nullFlavor] | hl7:name | pharm:formCode[@codeSystem = '1.2.40.0.10.1.4.3.4.3.5' or @nullFlavor] | pharm:asContent[@classCode = 'CONT'][pharm:containerPackagedMedicine[@classCode = 'CONT'][@determinerCode = 'INSTANCE']] | pharm:ingredient[@classCode = 'ACTI'][pharm:ingredient[@classCode = 'MMAT'][@determinerCode = 'KIND']] (rule-reference: d5720308e64-true-d5720426e0)</assert>
   </rule>

   <!-- Checking undefined contents for template/element @isClosed="true". Match context that we did not already match -->
   <rule fpi="RUL-QQQ"
         context="*[hl7:substanceAdministration[hl7:templateId[@root = '1.2.40.0.34.6.0.11.3.72'] and hl7:templateId[@root = '2.16.840.1.113883.10.20.1.24'] and hl7:templateId[@root = '1.3.6.1.4.1.19376.1.5.3.1.4.7'] and hl7:templateId[@root = '1.3.6.1.4.1.19376.1.9.1.3.16'] and hl7:templateId[@root = '1.3.6.1.4.1.19376.1.5.3.1.4.7.1']]]/hl7:substanceAdministration[hl7:templateId[@root = '1.2.40.0.34.6.0.11.3.72'] and hl7:templateId[@root = '2.16.840.1.113883.10.20.1.24'] and hl7:templateId[@root = '1.3.6.1.4.1.19376.1.5.3.1.4.7'] and hl7:templateId[@root = '1.3.6.1.4.1.19376.1.9.1.3.16'] and hl7:templateId[@root = '1.3.6.1.4.1.19376.1.5.3.1.4.7.1']]/hl7:consumable[hl7:manufacturedProduct[hl7:templateId[@root = '1.3.6.1.4.1.19376.1.5.3.1.4.7.2'] and hl7:templateId[@root = '2.16.840.1.113883.10.20.1.53']]]/hl7:manufacturedProduct[hl7:templateId[@root = '1.3.6.1.4.1.19376.1.5.3.1.4.7.2'] and hl7:templateId[@root = '2.16.840.1.113883.10.20.1.53']]/hl7:manufacturedMaterial[hl7:templateId[@root = '1.2.40.0.34.11.2.3.4'] and hl7:templateId[@root = '1.3.6.1.4.1.19376.1.9.1.3.1']]/hl7:code[@codeSystem = '1.2.40.0.34.4.16' or @codeSystem = '1.2.40.0.34.4.17' or @nullFlavor]/*[not(@xsi:nil = 'true')][not(self::hl7:originalText | self::hl7:translation[@codeSystem = '1.2.40.0.34.4.17' or @nullFlavor])]"
         id="d5720308e80-true-d5720460e0">
      <assert role="error"
              see="http://elga.art-decor.org/elgaambbef-html-20230118T144941/tmp-1.2.40.0.34.6.0.11.3.72-2020-10-02T075121.html"
              test="not(.)">(atcdabbr_entry_MedikationsEinnahmeEntry)/d5720308e80-true-d5720460e0: '<value-of select="name(..)"/>' ist als geschlossen definiert und dieses Element '<name/>' ist nicht erlaubt oder nicht mit diesem Inhalt erlaubt. Dies kann templateId, code oder id betreffen. Erwartet:  hl7:originalText | hl7:translation[@codeSystem = '1.2.40.0.34.4.17' or @nullFlavor] (rule-reference: d5720308e80-true-d5720460e0)</assert>
   </rule>

   <!-- Checking undefined contents for template/element @isClosed="true". Match context that we did not already match -->
   <rule fpi="RUL-QQQ"
         context="*[hl7:substanceAdministration[hl7:templateId[@root = '1.2.40.0.34.6.0.11.3.72'] and hl7:templateId[@root = '2.16.840.1.113883.10.20.1.24'] and hl7:templateId[@root = '1.3.6.1.4.1.19376.1.5.3.1.4.7'] and hl7:templateId[@root = '1.3.6.1.4.1.19376.1.9.1.3.16'] and hl7:templateId[@root = '1.3.6.1.4.1.19376.1.5.3.1.4.7.1']]]/hl7:substanceAdministration[hl7:templateId[@root = '1.2.40.0.34.6.0.11.3.72'] and hl7:templateId[@root = '2.16.840.1.113883.10.20.1.24'] and hl7:templateId[@root = '1.3.6.1.4.1.19376.1.5.3.1.4.7'] and hl7:templateId[@root = '1.3.6.1.4.1.19376.1.9.1.3.16'] and hl7:templateId[@root = '1.3.6.1.4.1.19376.1.5.3.1.4.7.1']]/hl7:consumable[hl7:manufacturedProduct[hl7:templateId[@root = '1.3.6.1.4.1.19376.1.5.3.1.4.7.2'] and hl7:templateId[@root = '2.16.840.1.113883.10.20.1.53']]]/hl7:manufacturedProduct[hl7:templateId[@root = '1.3.6.1.4.1.19376.1.5.3.1.4.7.2'] and hl7:templateId[@root = '2.16.840.1.113883.10.20.1.53']]/hl7:manufacturedMaterial[hl7:templateId[@root = '1.2.40.0.34.11.2.3.4'] and hl7:templateId[@root = '1.3.6.1.4.1.19376.1.9.1.3.1']]/pharm:asContent[@classCode = 'CONT'][pharm:containerPackagedMedicine[@classCode = 'CONT'][@determinerCode = 'INSTANCE']]/*[not(@xsi:nil = 'true')][not(self::pharm:containerPackagedMedicine[not(@nullFlavor)][@classCode = 'CONT'][@determinerCode = 'INSTANCE'])]"
         id="d5720308e258-true-d5720496e0">
      <assert role="error"
              see="http://elga.art-decor.org/elgaambbef-html-20230118T144941/tmp-1.2.40.0.34.6.0.11.3.72-2020-10-02T075121.html"
              test="not(.)">(atcdabbr_entry_MedikationsEinnahmeEntry)/d5720308e258-true-d5720496e0: '<value-of select="name(..)"/>' ist als geschlossen definiert und dieses Element '<name/>' ist nicht erlaubt oder nicht mit diesem Inhalt erlaubt. Dies kann templateId, code oder id betreffen. Erwartet:  pharm:containerPackagedMedicine[not(@nullFlavor)][@classCode = 'CONT'][@determinerCode = 'INSTANCE'] (rule-reference: d5720308e258-true-d5720496e0)</assert>
   </rule>

   <!-- Checking undefined contents for template/element @isClosed="true". Match context that we did not already match -->
   <rule fpi="RUL-QQQ"
         context="*[hl7:substanceAdministration[hl7:templateId[@root = '1.2.40.0.34.6.0.11.3.72'] and hl7:templateId[@root = '2.16.840.1.113883.10.20.1.24'] and hl7:templateId[@root = '1.3.6.1.4.1.19376.1.5.3.1.4.7'] and hl7:templateId[@root = '1.3.6.1.4.1.19376.1.9.1.3.16'] and hl7:templateId[@root = '1.3.6.1.4.1.19376.1.5.3.1.4.7.1']]]/hl7:substanceAdministration[hl7:templateId[@root = '1.2.40.0.34.6.0.11.3.72'] and hl7:templateId[@root = '2.16.840.1.113883.10.20.1.24'] and hl7:templateId[@root = '1.3.6.1.4.1.19376.1.5.3.1.4.7'] and hl7:templateId[@root = '1.3.6.1.4.1.19376.1.9.1.3.16'] and hl7:templateId[@root = '1.3.6.1.4.1.19376.1.5.3.1.4.7.1']]/hl7:consumable[hl7:manufacturedProduct[hl7:templateId[@root = '1.3.6.1.4.1.19376.1.5.3.1.4.7.2'] and hl7:templateId[@root = '2.16.840.1.113883.10.20.1.53']]]/hl7:manufacturedProduct[hl7:templateId[@root = '1.3.6.1.4.1.19376.1.5.3.1.4.7.2'] and hl7:templateId[@root = '2.16.840.1.113883.10.20.1.53']]/hl7:manufacturedMaterial[hl7:templateId[@root = '1.2.40.0.34.11.2.3.4'] and hl7:templateId[@root = '1.3.6.1.4.1.19376.1.9.1.3.1']]/pharm:asContent[@classCode = 'CONT'][pharm:containerPackagedMedicine[@classCode = 'CONT'][@determinerCode = 'INSTANCE']]/pharm:containerPackagedMedicine[not(@nullFlavor)][@classCode = 'CONT'][@determinerCode = 'INSTANCE']/*[not(@xsi:nil = 'true')][not(self::pharm:capacityQuantity[not(@nullFlavor)])]"
         id="d5720308e271-true-d5720510e0">
      <assert role="error"
              see="http://elga.art-decor.org/elgaambbef-html-20230118T144941/tmp-1.2.40.0.34.6.0.11.3.72-2020-10-02T075121.html"
              test="not(.)">(atcdabbr_entry_MedikationsEinnahmeEntry)/d5720308e271-true-d5720510e0: '<value-of select="name(..)"/>' ist als geschlossen definiert und dieses Element '<name/>' ist nicht erlaubt oder nicht mit diesem Inhalt erlaubt. Dies kann templateId, code oder id betreffen. Erwartet:  pharm:capacityQuantity[not(@nullFlavor)] (rule-reference: d5720308e271-true-d5720510e0)</assert>
   </rule>

   <!-- Checking undefined contents for template/element @isClosed="true". Match context that we did not already match -->
   <rule fpi="RUL-QQQ"
         context="*[hl7:substanceAdministration[hl7:templateId[@root = '1.2.40.0.34.6.0.11.3.72'] and hl7:templateId[@root = '2.16.840.1.113883.10.20.1.24'] and hl7:templateId[@root = '1.3.6.1.4.1.19376.1.5.3.1.4.7'] and hl7:templateId[@root = '1.3.6.1.4.1.19376.1.9.1.3.16'] and hl7:templateId[@root = '1.3.6.1.4.1.19376.1.5.3.1.4.7.1']]]/hl7:substanceAdministration[hl7:templateId[@root = '1.2.40.0.34.6.0.11.3.72'] and hl7:templateId[@root = '2.16.840.1.113883.10.20.1.24'] and hl7:templateId[@root = '1.3.6.1.4.1.19376.1.5.3.1.4.7'] and hl7:templateId[@root = '1.3.6.1.4.1.19376.1.9.1.3.16'] and hl7:templateId[@root = '1.3.6.1.4.1.19376.1.5.3.1.4.7.1']]/hl7:consumable[hl7:manufacturedProduct[hl7:templateId[@root = '1.3.6.1.4.1.19376.1.5.3.1.4.7.2'] and hl7:templateId[@root = '2.16.840.1.113883.10.20.1.53']]]/hl7:manufacturedProduct[hl7:templateId[@root = '1.3.6.1.4.1.19376.1.5.3.1.4.7.2'] and hl7:templateId[@root = '2.16.840.1.113883.10.20.1.53']]/hl7:manufacturedMaterial[hl7:templateId[@root = '1.2.40.0.34.11.2.3.4'] and hl7:templateId[@root = '1.3.6.1.4.1.19376.1.9.1.3.1']]/pharm:ingredient[@classCode = 'ACTI'][pharm:ingredient[@classCode = 'MMAT'][@determinerCode = 'KIND']]/*[not(@xsi:nil = 'true')][not(self::pharm:ingredient[not(@nullFlavor)][@classCode = 'MMAT'][@determinerCode = 'KIND'])]"
         id="d5720308e304-true-d5720529e0">
      <assert role="error"
              see="http://elga.art-decor.org/elgaambbef-html-20230118T144941/tmp-1.2.40.0.34.6.0.11.3.72-2020-10-02T075121.html"
              test="not(.)">(atcdabbr_entry_MedikationsEinnahmeEntry)/d5720308e304-true-d5720529e0: '<value-of select="name(..)"/>' ist als geschlossen definiert und dieses Element '<name/>' ist nicht erlaubt oder nicht mit diesem Inhalt erlaubt. Dies kann templateId, code oder id betreffen. Erwartet:  pharm:ingredient[not(@nullFlavor)][@classCode = 'MMAT'][@determinerCode = 'KIND'] (rule-reference: d5720308e304-true-d5720529e0)</assert>
   </rule>

   <!-- Checking undefined contents for template/element @isClosed="true". Match context that we did not already match -->
   <rule fpi="RUL-QQQ"
         context="*[hl7:substanceAdministration[hl7:templateId[@root = '1.2.40.0.34.6.0.11.3.72'] and hl7:templateId[@root = '2.16.840.1.113883.10.20.1.24'] and hl7:templateId[@root = '1.3.6.1.4.1.19376.1.5.3.1.4.7'] and hl7:templateId[@root = '1.3.6.1.4.1.19376.1.9.1.3.16'] and hl7:templateId[@root = '1.3.6.1.4.1.19376.1.5.3.1.4.7.1']]]/hl7:substanceAdministration[hl7:templateId[@root = '1.2.40.0.34.6.0.11.3.72'] and hl7:templateId[@root = '2.16.840.1.113883.10.20.1.24'] and hl7:templateId[@root = '1.3.6.1.4.1.19376.1.5.3.1.4.7'] and hl7:templateId[@root = '1.3.6.1.4.1.19376.1.9.1.3.16'] and hl7:templateId[@root = '1.3.6.1.4.1.19376.1.5.3.1.4.7.1']]/hl7:consumable[hl7:manufacturedProduct[hl7:templateId[@root = '1.3.6.1.4.1.19376.1.5.3.1.4.7.2'] and hl7:templateId[@root = '2.16.840.1.113883.10.20.1.53']]]/hl7:manufacturedProduct[hl7:templateId[@root = '1.3.6.1.4.1.19376.1.5.3.1.4.7.2'] and hl7:templateId[@root = '2.16.840.1.113883.10.20.1.53']]/hl7:manufacturedMaterial[hl7:templateId[@root = '1.2.40.0.34.11.2.3.4'] and hl7:templateId[@root = '1.3.6.1.4.1.19376.1.9.1.3.1']]/pharm:ingredient[@classCode = 'ACTI'][pharm:ingredient[@classCode = 'MMAT'][@determinerCode = 'KIND']]/pharm:ingredient[not(@nullFlavor)][@classCode = 'MMAT'][@determinerCode = 'KIND']/*[not(@xsi:nil = 'true')][not(self::pharm:code[@codeSystem = '2.16.840.1.113883.6.73' or @codeSystem = '1.2.40.0.34.5.156' or @nullFlavor] | self::pharm:name[not(@nullFlavor)])]"
         id="d5720308e340-true-d5720550e0">
      <assert role="error"
              see="http://elga.art-decor.org/elgaambbef-html-20230118T144941/tmp-1.2.40.0.34.6.0.11.3.72-2020-10-02T075121.html"
              test="not(.)">(atcdabbr_entry_MedikationsEinnahmeEntry)/d5720308e340-true-d5720550e0: '<value-of select="name(..)"/>' ist als geschlossen definiert und dieses Element '<name/>' ist nicht erlaubt oder nicht mit diesem Inhalt erlaubt. Dies kann templateId, code oder id betreffen. Erwartet:  pharm:code[@codeSystem = '2.16.840.1.113883.6.73' or @codeSystem = '1.2.40.0.34.5.156' or @nullFlavor] | pharm:name[not(@nullFlavor)] (rule-reference: d5720308e340-true-d5720550e0)</assert>
   </rule>

   <!-- Checking undefined contents for template/element @isClosed="true". Match context that we did not already match -->
   <rule fpi="RUL-QQQ"
         context="*[hl7:substanceAdministration[hl7:templateId[@root = '1.2.40.0.34.6.0.11.3.72'] and hl7:templateId[@root = '2.16.840.1.113883.10.20.1.24'] and hl7:templateId[@root = '1.3.6.1.4.1.19376.1.5.3.1.4.7'] and hl7:templateId[@root = '1.3.6.1.4.1.19376.1.9.1.3.16'] and hl7:templateId[@root = '1.3.6.1.4.1.19376.1.5.3.1.4.7.1']]]/hl7:substanceAdministration[hl7:templateId[@root = '1.2.40.0.34.6.0.11.3.72'] and hl7:templateId[@root = '2.16.840.1.113883.10.20.1.24'] and hl7:templateId[@root = '1.3.6.1.4.1.19376.1.5.3.1.4.7'] and hl7:templateId[@root = '1.3.6.1.4.1.19376.1.9.1.3.16'] and hl7:templateId[@root = '1.3.6.1.4.1.19376.1.5.3.1.4.7.1']]/hl7:consumable[hl7:manufacturedProduct[hl7:templateId[@root = '1.3.6.1.4.1.19376.1.5.3.1.4.7.2'] and hl7:templateId[@root = '2.16.840.1.113883.10.20.1.53']]]/hl7:manufacturedProduct[hl7:templateId[@root = '1.3.6.1.4.1.19376.1.5.3.1.4.7.2'] and hl7:templateId[@root = '2.16.840.1.113883.10.20.1.53']]/hl7:manufacturedMaterial[hl7:templateId[@root = '1.2.40.0.34.11.2.3.4'] and hl7:templateId[@root = '1.3.6.1.4.1.19376.1.9.1.3.1']]/pharm:ingredient[@classCode = 'ACTI'][pharm:ingredient[@classCode = 'MMAT'][@determinerCode = 'KIND']]/pharm:ingredient[not(@nullFlavor)][@classCode = 'MMAT'][@determinerCode = 'KIND']/pharm:code[@codeSystem = '2.16.840.1.113883.6.73' or @codeSystem = '1.2.40.0.34.5.156' or @nullFlavor]/*[not(@xsi:nil = 'true')][not(self::hl7:originalText | self::hl7:translation)]"
         id="d5720308e349-true-d5720570e0">
      <assert role="error"
              see="http://elga.art-decor.org/elgaambbef-html-20230118T144941/tmp-1.2.40.0.34.6.0.11.3.72-2020-10-02T075121.html"
              test="not(.)">(atcdabbr_entry_MedikationsEinnahmeEntry)/d5720308e349-true-d5720570e0: '<value-of select="name(..)"/>' ist als geschlossen definiert und dieses Element '<name/>' ist nicht erlaubt oder nicht mit diesem Inhalt erlaubt. Dies kann templateId, code oder id betreffen. Erwartet:  hl7:originalText | hl7:translation (rule-reference: d5720308e349-true-d5720570e0)</assert>
   </rule>

   <!-- Checking undefined contents for template/element @isClosed="true". Match context that we did not already match -->
   <rule fpi="RUL-QQQ"
         context="*[hl7:substanceAdministration[hl7:templateId[@root = '1.2.40.0.34.6.0.11.3.72'] and hl7:templateId[@root = '2.16.840.1.113883.10.20.1.24'] and hl7:templateId[@root = '1.3.6.1.4.1.19376.1.5.3.1.4.7'] and hl7:templateId[@root = '1.3.6.1.4.1.19376.1.9.1.3.16'] and hl7:templateId[@root = '1.3.6.1.4.1.19376.1.5.3.1.4.7.1']]]/hl7:substanceAdministration[hl7:templateId[@root = '1.2.40.0.34.6.0.11.3.72'] and hl7:templateId[@root = '2.16.840.1.113883.10.20.1.24'] and hl7:templateId[@root = '1.3.6.1.4.1.19376.1.5.3.1.4.7'] and hl7:templateId[@root = '1.3.6.1.4.1.19376.1.9.1.3.16'] and hl7:templateId[@root = '1.3.6.1.4.1.19376.1.5.3.1.4.7.1']]/hl7:author[hl7:assignedAuthor]/*[not(@xsi:nil = 'true')][not(self::hl7:functionCode | self::hl7:time[not(@nullFlavor)] | self::hl7:time[@nullFlavor='UNK'] | self::hl7:assignedAuthor)]"
         id="d42e76951-true-d5720712e0">
      <assert role="error"
              see="http://elga.art-decor.org/elgaambbef-html-20230118T144941/tmp-1.2.40.0.34.6.0.11.3.72-2020-10-02T075121.html"
              test="not(.)">(atcdabbr_entry_MedikationsEinnahmeEntry)/d42e76951-true-d5720712e0: '<value-of select="name(..)"/>' ist als geschlossen definiert und dieses Element '<name/>' ist nicht erlaubt oder nicht mit diesem Inhalt erlaubt. Dies kann templateId, code oder id betreffen. Erwartet:  hl7:functionCode | hl7:time[not(@nullFlavor)] | hl7:time[@nullFlavor='UNK'] | hl7:assignedAuthor (rule-reference: d42e76951-true-d5720712e0)</assert>
   </rule>

   <!-- Checking undefined contents for template/element @isClosed="true". Match context that we did not already match -->
   <rule fpi="RUL-QQQ"
         context="*[hl7:substanceAdministration[hl7:templateId[@root = '1.2.40.0.34.6.0.11.3.72'] and hl7:templateId[@root = '2.16.840.1.113883.10.20.1.24'] and hl7:templateId[@root = '1.3.6.1.4.1.19376.1.5.3.1.4.7'] and hl7:templateId[@root = '1.3.6.1.4.1.19376.1.9.1.3.16'] and hl7:templateId[@root = '1.3.6.1.4.1.19376.1.5.3.1.4.7.1']]]/hl7:substanceAdministration[hl7:templateId[@root = '1.2.40.0.34.6.0.11.3.72'] and hl7:templateId[@root = '2.16.840.1.113883.10.20.1.24'] and hl7:templateId[@root = '1.3.6.1.4.1.19376.1.5.3.1.4.7'] and hl7:templateId[@root = '1.3.6.1.4.1.19376.1.9.1.3.16'] and hl7:templateId[@root = '1.3.6.1.4.1.19376.1.5.3.1.4.7.1']]/hl7:author[hl7:assignedAuthor]/hl7:assignedAuthor/*[not(@xsi:nil = 'true')][not(self::hl7:id[not(@nullFlavor)] | self::hl7:id[@nullFlavor='UNK'] | self::hl7:code[not(@nullFlavor)] | self::hl7:addr[not(@nullFlavor)] | self::hl7:telecom[not(@nullFlavor)] | self::hl7:assignedPerson | self::hl7:assignedAuthoringDevice | self::hl7:representedOrganization)]"
         id="d5720590e42-true-d5720820e0">
      <assert role="error"
              see="http://elga.art-decor.org/elgaambbef-html-20230118T144941/tmp-1.2.40.0.34.6.0.11.3.72-2020-10-02T075121.html"
              test="not(.)">(atcdabbr_entry_MedikationsEinnahmeEntry)/d5720590e42-true-d5720820e0: '<value-of select="name(..)"/>' ist als geschlossen definiert und dieses Element '<name/>' ist nicht erlaubt oder nicht mit diesem Inhalt erlaubt. Dies kann templateId, code oder id betreffen. Erwartet:  hl7:id[not(@nullFlavor)] | hl7:id[@nullFlavor='UNK'] | hl7:code[not(@nullFlavor)] | hl7:addr[not(@nullFlavor)] | hl7:telecom[not(@nullFlavor)] | hl7:assignedPerson | hl7:assignedAuthoringDevice | hl7:representedOrganization (rule-reference: d5720590e42-true-d5720820e0)</assert>
   </rule>

   <!-- Checking undefined contents for template/element @isClosed="true". Match context that we did not already match -->
   <rule fpi="RUL-QQQ"
         context="*[hl7:substanceAdministration[hl7:templateId[@root = '1.2.40.0.34.6.0.11.3.72'] and hl7:templateId[@root = '2.16.840.1.113883.10.20.1.24'] and hl7:templateId[@root = '1.3.6.1.4.1.19376.1.5.3.1.4.7'] and hl7:templateId[@root = '1.3.6.1.4.1.19376.1.9.1.3.16'] and hl7:templateId[@root = '1.3.6.1.4.1.19376.1.5.3.1.4.7.1']]]/hl7:substanceAdministration[hl7:templateId[@root = '1.2.40.0.34.6.0.11.3.72'] and hl7:templateId[@root = '2.16.840.1.113883.10.20.1.24'] and hl7:templateId[@root = '1.3.6.1.4.1.19376.1.5.3.1.4.7'] and hl7:templateId[@root = '1.3.6.1.4.1.19376.1.9.1.3.16'] and hl7:templateId[@root = '1.3.6.1.4.1.19376.1.5.3.1.4.7.1']]/hl7:author[hl7:assignedAuthor]/hl7:assignedAuthor/hl7:addr[not(@nullFlavor)]/*[not(@xsi:nil = 'true')][not(self::hl7:streetAddressLine | self::hl7:streetName | self::hl7:houseNumber | self::hl7:postalCode[not(@nullFlavor)] | self::hl7:city[not(@nullFlavor)] | self::hl7:state | self::hl7:country[not(@nullFlavor)] | self::hl7:additionalLocator)]"
         id="d5720590e61-true-d5720879e0">
      <assert role="error"
              see="http://elga.art-decor.org/elgaambbef-html-20230118T144941/tmp-1.2.40.0.34.6.0.11.3.72-2020-10-02T075121.html"
              test="not(.)">(atcdabbr_entry_MedikationsEinnahmeEntry)/d5720590e61-true-d5720879e0: '<value-of select="name(..)"/>' ist als geschlossen definiert und dieses Element '<name/>' ist nicht erlaubt oder nicht mit diesem Inhalt erlaubt. Dies kann templateId, code oder id betreffen. Erwartet:  hl7:streetAddressLine | hl7:streetName | hl7:houseNumber | hl7:postalCode[not(@nullFlavor)] | hl7:city[not(@nullFlavor)] | hl7:state | hl7:country[not(@nullFlavor)] | hl7:additionalLocator (rule-reference: d5720590e61-true-d5720879e0)</assert>
   </rule>

   <!-- Checking undefined contents for template/element @isClosed="true". Match context that we did not already match -->
   <rule fpi="RUL-QQQ"
         context="*[hl7:substanceAdministration[hl7:templateId[@root = '1.2.40.0.34.6.0.11.3.72'] and hl7:templateId[@root = '2.16.840.1.113883.10.20.1.24'] and hl7:templateId[@root = '1.3.6.1.4.1.19376.1.5.3.1.4.7'] and hl7:templateId[@root = '1.3.6.1.4.1.19376.1.9.1.3.16'] and hl7:templateId[@root = '1.3.6.1.4.1.19376.1.5.3.1.4.7.1']]]/hl7:substanceAdministration[hl7:templateId[@root = '1.2.40.0.34.6.0.11.3.72'] and hl7:templateId[@root = '2.16.840.1.113883.10.20.1.24'] and hl7:templateId[@root = '1.3.6.1.4.1.19376.1.5.3.1.4.7'] and hl7:templateId[@root = '1.3.6.1.4.1.19376.1.9.1.3.16'] and hl7:templateId[@root = '1.3.6.1.4.1.19376.1.5.3.1.4.7.1']]/hl7:author[hl7:assignedAuthor]/hl7:assignedAuthor/hl7:assignedPerson/*[not(@xsi:nil = 'true')][not(self::hl7:name[not(@nullFlavor)] | self::hl7:name[@nullFlavor='UNK'] | self::hl7:name[@nullFlavor='MSK'])]"
         id="d5720590e104-true-d5720936e0">
      <assert role="error"
              see="http://elga.art-decor.org/elgaambbef-html-20230118T144941/tmp-1.2.40.0.34.6.0.11.3.72-2020-10-02T075121.html"
              test="not(.)">(atcdabbr_entry_MedikationsEinnahmeEntry)/d5720590e104-true-d5720936e0: '<value-of select="name(..)"/>' ist als geschlossen definiert und dieses Element '<name/>' ist nicht erlaubt oder nicht mit diesem Inhalt erlaubt. Dies kann templateId, code oder id betreffen. Erwartet:  hl7:name[not(@nullFlavor)] | hl7:name[@nullFlavor='UNK'] | hl7:name[@nullFlavor='MSK'] (rule-reference: d5720590e104-true-d5720936e0)</assert>
   </rule>

   <!-- Checking undefined contents for template/element @isClosed="true". Match context that we did not already match -->
   <rule fpi="RUL-QQQ"
         context="*[hl7:substanceAdministration[hl7:templateId[@root = '1.2.40.0.34.6.0.11.3.72'] and hl7:templateId[@root = '2.16.840.1.113883.10.20.1.24'] and hl7:templateId[@root = '1.3.6.1.4.1.19376.1.5.3.1.4.7'] and hl7:templateId[@root = '1.3.6.1.4.1.19376.1.9.1.3.16'] and hl7:templateId[@root = '1.3.6.1.4.1.19376.1.5.3.1.4.7.1']]]/hl7:substanceAdministration[hl7:templateId[@root = '1.2.40.0.34.6.0.11.3.72'] and hl7:templateId[@root = '2.16.840.1.113883.10.20.1.24'] and hl7:templateId[@root = '1.3.6.1.4.1.19376.1.5.3.1.4.7'] and hl7:templateId[@root = '1.3.6.1.4.1.19376.1.9.1.3.16'] and hl7:templateId[@root = '1.3.6.1.4.1.19376.1.5.3.1.4.7.1']]/hl7:author[hl7:assignedAuthor]/hl7:assignedAuthor/hl7:assignedPerson/hl7:name[not(@nullFlavor)]/*[not(@xsi:nil = 'true')][not(self::hl7:prefix | self::hl7:family[not(@nullFlavor)] | self::hl7:given[not(@nullFlavor)] | self::hl7:suffix)]"
         id="d5720940e91-true-d5720970e0">
      <assert role="error"
              see="http://elga.art-decor.org/elgaambbef-html-20230118T144941/tmp-1.2.40.0.34.6.0.11.9.6-2021-02-19T133649.html"
              test="not(.)">(atcdabbr_other_PersonNameCompilationG2)/d5720940e91-true-d5720970e0: '<value-of select="name(..)"/>' ist als geschlossen definiert und dieses Element '<name/>' ist nicht erlaubt oder nicht mit diesem Inhalt erlaubt. Dies kann templateId, code oder id betreffen. Erwartet:  hl7:prefix | hl7:family[not(@nullFlavor)] | hl7:given[not(@nullFlavor)] | hl7:suffix (rule-reference: d5720940e91-true-d5720970e0)</assert>
   </rule>

   <!-- Checking undefined contents for template/element @isClosed="true". Match context that we did not already match -->
   <rule fpi="RUL-QQQ"
         context="*[hl7:substanceAdministration[hl7:templateId[@root = '1.2.40.0.34.6.0.11.3.72'] and hl7:templateId[@root = '2.16.840.1.113883.10.20.1.24'] and hl7:templateId[@root = '1.3.6.1.4.1.19376.1.5.3.1.4.7'] and hl7:templateId[@root = '1.3.6.1.4.1.19376.1.9.1.3.16'] and hl7:templateId[@root = '1.3.6.1.4.1.19376.1.5.3.1.4.7.1']]]/hl7:substanceAdministration[hl7:templateId[@root = '1.2.40.0.34.6.0.11.3.72'] and hl7:templateId[@root = '2.16.840.1.113883.10.20.1.24'] and hl7:templateId[@root = '1.3.6.1.4.1.19376.1.5.3.1.4.7'] and hl7:templateId[@root = '1.3.6.1.4.1.19376.1.9.1.3.16'] and hl7:templateId[@root = '1.3.6.1.4.1.19376.1.5.3.1.4.7.1']]/hl7:author[hl7:assignedAuthor]/hl7:assignedAuthor/hl7:assignedAuthoringDevice/*[not(@xsi:nil = 'true')][not(self::hl7:manufacturerModelName[not(@nullFlavor)] | self::hl7:softwareName[not(@nullFlavor)])]"
         id="d5720590e127-true-d5721018e0">
      <assert role="error"
              see="http://elga.art-decor.org/elgaambbef-html-20230118T144941/tmp-1.2.40.0.34.6.0.11.3.72-2020-10-02T075121.html"
              test="not(.)">(atcdabbr_entry_MedikationsEinnahmeEntry)/d5720590e127-true-d5721018e0: '<value-of select="name(..)"/>' ist als geschlossen definiert und dieses Element '<name/>' ist nicht erlaubt oder nicht mit diesem Inhalt erlaubt. Dies kann templateId, code oder id betreffen. Erwartet:  hl7:manufacturerModelName[not(@nullFlavor)] | hl7:softwareName[not(@nullFlavor)] (rule-reference: d5720590e127-true-d5721018e0)</assert>
   </rule>

   <!-- Checking undefined contents for template/element @isClosed="true". Match context that we did not already match -->
   <rule fpi="RUL-QQQ"
         context="*[hl7:substanceAdministration[hl7:templateId[@root = '1.2.40.0.34.6.0.11.3.72'] and hl7:templateId[@root = '2.16.840.1.113883.10.20.1.24'] and hl7:templateId[@root = '1.3.6.1.4.1.19376.1.5.3.1.4.7'] and hl7:templateId[@root = '1.3.6.1.4.1.19376.1.9.1.3.16'] and hl7:templateId[@root = '1.3.6.1.4.1.19376.1.5.3.1.4.7.1']]]/hl7:substanceAdministration[hl7:templateId[@root = '1.2.40.0.34.6.0.11.3.72'] and hl7:templateId[@root = '2.16.840.1.113883.10.20.1.24'] and hl7:templateId[@root = '1.3.6.1.4.1.19376.1.5.3.1.4.7'] and hl7:templateId[@root = '1.3.6.1.4.1.19376.1.9.1.3.16'] and hl7:templateId[@root = '1.3.6.1.4.1.19376.1.5.3.1.4.7.1']]/hl7:author[hl7:assignedAuthor]/hl7:assignedAuthor/hl7:representedOrganization/*[not(@xsi:nil = 'true')][not(self::hl7:id[not(@nullFlavor)] | self::hl7:name[not(@nullFlavor)] | self::hl7:telecom[not(@nullFlavor)] | self::hl7:addr[not(@nullFlavor)])]"
         id="d5720590e143-true-d5721063e0">
      <assert role="error"
              see="http://elga.art-decor.org/elgaambbef-html-20230118T144941/tmp-1.2.40.0.34.6.0.11.3.72-2020-10-02T075121.html"
              test="not(.)">(atcdabbr_entry_MedikationsEinnahmeEntry)/d5720590e143-true-d5721063e0: '<value-of select="name(..)"/>' ist als geschlossen definiert und dieses Element '<name/>' ist nicht erlaubt oder nicht mit diesem Inhalt erlaubt. Dies kann templateId, code oder id betreffen. Erwartet:  hl7:id[not(@nullFlavor)] | hl7:name[not(@nullFlavor)] | hl7:telecom[not(@nullFlavor)] | hl7:addr[not(@nullFlavor)] (rule-reference: d5720590e143-true-d5721063e0)</assert>
   </rule>

   <!-- Checking undefined contents for template/element @isClosed="true". Match context that we did not already match -->
   <rule fpi="RUL-QQQ"
         context="*[hl7:substanceAdministration[hl7:templateId[@root = '1.2.40.0.34.6.0.11.3.72'] and hl7:templateId[@root = '2.16.840.1.113883.10.20.1.24'] and hl7:templateId[@root = '1.3.6.1.4.1.19376.1.5.3.1.4.7'] and hl7:templateId[@root = '1.3.6.1.4.1.19376.1.9.1.3.16'] and hl7:templateId[@root = '1.3.6.1.4.1.19376.1.5.3.1.4.7.1']]]/hl7:substanceAdministration[hl7:templateId[@root = '1.2.40.0.34.6.0.11.3.72'] and hl7:templateId[@root = '2.16.840.1.113883.10.20.1.24'] and hl7:templateId[@root = '1.3.6.1.4.1.19376.1.5.3.1.4.7'] and hl7:templateId[@root = '1.3.6.1.4.1.19376.1.9.1.3.16'] and hl7:templateId[@root = '1.3.6.1.4.1.19376.1.5.3.1.4.7.1']]/hl7:author[hl7:assignedAuthor]/hl7:assignedAuthor/hl7:representedOrganization/hl7:addr[not(@nullFlavor)]/*[not(@xsi:nil = 'true')][not(self::hl7:streetAddressLine | self::hl7:streetName | self::hl7:houseNumber | self::hl7:postalCode[not(@nullFlavor)] | self::hl7:city[not(@nullFlavor)] | self::hl7:state | self::hl7:country[not(@nullFlavor)] | self::hl7:additionalLocator)]"
         id="d5721033e66-true-d5721126e0">
      <assert role="error"
              see="http://elga.art-decor.org/elgaambbef-html-20230118T144941/tmp-1.2.40.0.34.6.0.11.3.72-2020-10-02T075121.html"
              test="not(.)">(atcdabbr_entry_MedikationsEinnahmeEntry)/d5721033e66-true-d5721126e0: '<value-of select="name(..)"/>' ist als geschlossen definiert und dieses Element '<name/>' ist nicht erlaubt oder nicht mit diesem Inhalt erlaubt. Dies kann templateId, code oder id betreffen. Erwartet:  hl7:streetAddressLine | hl7:streetName | hl7:houseNumber | hl7:postalCode[not(@nullFlavor)] | hl7:city[not(@nullFlavor)] | hl7:state | hl7:country[not(@nullFlavor)] | hl7:additionalLocator (rule-reference: d5721033e66-true-d5721126e0)</assert>
   </rule>

   <!-- Checking undefined contents for template/element @isClosed="true". Match context that we did not already match -->
   <rule fpi="RUL-QQQ"
         context="*[hl7:substanceAdministration[hl7:templateId[@root = '1.2.40.0.34.6.0.11.3.72'] and hl7:templateId[@root = '2.16.840.1.113883.10.20.1.24'] and hl7:templateId[@root = '1.3.6.1.4.1.19376.1.5.3.1.4.7'] and hl7:templateId[@root = '1.3.6.1.4.1.19376.1.9.1.3.16'] and hl7:templateId[@root = '1.3.6.1.4.1.19376.1.5.3.1.4.7.1']]]/hl7:substanceAdministration[hl7:templateId[@root = '1.2.40.0.34.6.0.11.3.72'] and hl7:templateId[@root = '2.16.840.1.113883.10.20.1.24'] and hl7:templateId[@root = '1.3.6.1.4.1.19376.1.5.3.1.4.7'] and hl7:templateId[@root = '1.3.6.1.4.1.19376.1.9.1.3.16'] and hl7:templateId[@root = '1.3.6.1.4.1.19376.1.5.3.1.4.7.1']]/hl7:entryRelationship[@typeCode='RSON'][hl7:act/hl7:templateId[@root='1.3.6.1.4.1.19376.1.5.3.1.4.4.1']]/*[not(@xsi:nil = 'true')][not(self::hl7:act[hl7:templateId[@root = '1.3.6.1.4.1.19376.1.5.3.1.4.4.1']])]"
         id="d42e76966-true-d5721185e0">
      <assert role="error"
              see="http://elga.art-decor.org/elgaambbef-html-20230118T144941/tmp-1.2.40.0.34.6.0.11.3.72-2020-10-02T075121.html"
              test="not(.)">(atcdabbr_entry_MedikationsEinnahmeEntry)/d42e76966-true-d5721185e0: '<value-of select="name(..)"/>' ist als geschlossen definiert und dieses Element '<name/>' ist nicht erlaubt oder nicht mit diesem Inhalt erlaubt. Dies kann templateId, code oder id betreffen. Erwartet:  hl7:act[hl7:templateId[@root = '1.3.6.1.4.1.19376.1.5.3.1.4.4.1']] (rule-reference: d42e76966-true-d5721185e0)</assert>
   </rule>

   <!-- Checking undefined contents for template/element @isClosed="true". Match context that we did not already match -->
   <rule fpi="RUL-QQQ"
         context="*[hl7:substanceAdministration[hl7:templateId[@root = '1.2.40.0.34.6.0.11.3.72'] and hl7:templateId[@root = '2.16.840.1.113883.10.20.1.24'] and hl7:templateId[@root = '1.3.6.1.4.1.19376.1.5.3.1.4.7'] and hl7:templateId[@root = '1.3.6.1.4.1.19376.1.9.1.3.16'] and hl7:templateId[@root = '1.3.6.1.4.1.19376.1.5.3.1.4.7.1']]]/hl7:substanceAdministration[hl7:templateId[@root = '1.2.40.0.34.6.0.11.3.72'] and hl7:templateId[@root = '2.16.840.1.113883.10.20.1.24'] and hl7:templateId[@root = '1.3.6.1.4.1.19376.1.5.3.1.4.7'] and hl7:templateId[@root = '1.3.6.1.4.1.19376.1.9.1.3.16'] and hl7:templateId[@root = '1.3.6.1.4.1.19376.1.5.3.1.4.7.1']]/hl7:entryRelationship[@typeCode='RSON'][hl7:act/hl7:templateId[@root='1.3.6.1.4.1.19376.1.5.3.1.4.4.1']]/hl7:act[hl7:templateId[@root = '1.3.6.1.4.1.19376.1.5.3.1.4.4.1']]/*[not(@xsi:nil = 'true')][not(self::hl7:templateId[@root = '1.3.6.1.4.1.19376.1.5.3.1.4.4.1'] | self::hl7:id[not(@nullFlavor)])]"
         id="d42e76980-true-d5721207e0">
      <assert role="error"
              see="http://elga.art-decor.org/elgaambbef-html-20230118T144941/tmp-1.2.40.0.34.6.0.11.3.72-2020-10-02T075121.html"
              test="not(.)">(atcdabbr_entry_MedikationsEinnahmeEntry)/d42e76980-true-d5721207e0: '<value-of select="name(..)"/>' ist als geschlossen definiert und dieses Element '<name/>' ist nicht erlaubt oder nicht mit diesem Inhalt erlaubt. Dies kann templateId, code oder id betreffen. Erwartet:  hl7:templateId[@root = '1.3.6.1.4.1.19376.1.5.3.1.4.4.1'] | hl7:id[not(@nullFlavor)] (rule-reference: d42e76980-true-d5721207e0)</assert>
   </rule>

   <!-- Checking undefined contents for template/element @isClosed="true". Match context that we did not already match -->
   <rule fpi="RUL-QQQ"
         context="*[hl7:substanceAdministration[hl7:templateId[@root = '1.2.40.0.34.6.0.11.3.72'] and hl7:templateId[@root = '2.16.840.1.113883.10.20.1.24'] and hl7:templateId[@root = '1.3.6.1.4.1.19376.1.5.3.1.4.7'] and hl7:templateId[@root = '1.3.6.1.4.1.19376.1.9.1.3.16'] and hl7:templateId[@root = '1.3.6.1.4.1.19376.1.5.3.1.4.7.1']]]/hl7:substanceAdministration[hl7:templateId[@root = '1.2.40.0.34.6.0.11.3.72'] and hl7:templateId[@root = '2.16.840.1.113883.10.20.1.24'] and hl7:templateId[@root = '1.3.6.1.4.1.19376.1.5.3.1.4.7'] and hl7:templateId[@root = '1.3.6.1.4.1.19376.1.9.1.3.16'] and hl7:templateId[@root = '1.3.6.1.4.1.19376.1.5.3.1.4.7.1']]/hl7:entryRelationship[@typeCode='SUBJ'][hl7:act/hl7:templateId[@root='2.16.840.1.113883.10.20.1.43']]/*[not(@xsi:nil = 'true')][not(self::hl7:act[hl7:templateId[@root = '2.16.840.1.113883.10.20.1.43'] and hl7:templateId[@root = '1.3.6.1.4.1.19376.1.5.3.1.4.3.1']])]"
         id="d42e77000-true-d5721234e0">
      <assert role="error"
              see="http://elga.art-decor.org/elgaambbef-html-20230118T144941/tmp-1.2.40.0.34.6.0.11.3.72-2020-10-02T075121.html"
              test="not(.)">(atcdabbr_entry_MedikationsEinnahmeEntry)/d42e77000-true-d5721234e0: '<value-of select="name(..)"/>' ist als geschlossen definiert und dieses Element '<name/>' ist nicht erlaubt oder nicht mit diesem Inhalt erlaubt. Dies kann templateId, code oder id betreffen. Erwartet:  hl7:act[hl7:templateId[@root = '2.16.840.1.113883.10.20.1.43'] and hl7:templateId[@root = '1.3.6.1.4.1.19376.1.5.3.1.4.3.1']] (rule-reference: d42e77000-true-d5721234e0)</assert>
   </rule>

   <!-- Checking undefined contents for template/element @isClosed="true". Match context that we did not already match -->
   <rule fpi="RUL-QQQ"
         context="*[hl7:substanceAdministration[hl7:templateId[@root = '1.2.40.0.34.6.0.11.3.72'] and hl7:templateId[@root = '2.16.840.1.113883.10.20.1.24'] and hl7:templateId[@root = '1.3.6.1.4.1.19376.1.5.3.1.4.7'] and hl7:templateId[@root = '1.3.6.1.4.1.19376.1.9.1.3.16'] and hl7:templateId[@root = '1.3.6.1.4.1.19376.1.5.3.1.4.7.1']]]/hl7:substanceAdministration[hl7:templateId[@root = '1.2.40.0.34.6.0.11.3.72'] and hl7:templateId[@root = '2.16.840.1.113883.10.20.1.24'] and hl7:templateId[@root = '1.3.6.1.4.1.19376.1.5.3.1.4.7'] and hl7:templateId[@root = '1.3.6.1.4.1.19376.1.9.1.3.16'] and hl7:templateId[@root = '1.3.6.1.4.1.19376.1.5.3.1.4.7.1']]/hl7:entryRelationship[@typeCode='SUBJ'][hl7:act/hl7:templateId[@root='2.16.840.1.113883.10.20.1.43']]/hl7:act[hl7:templateId[@root = '2.16.840.1.113883.10.20.1.43'] and hl7:templateId[@root = '1.3.6.1.4.1.19376.1.5.3.1.4.3.1']]/*[not(@xsi:nil = 'true')][not(self::hl7:templateId[@root = '2.16.840.1.113883.10.20.1.43'] | self::hl7:templateId[@root = '1.3.6.1.4.1.19376.1.5.3.1.4.3.1'] | self::hl7:code[(@code = 'FINSTRUCT' and @codeSystem = '1.3.6.1.4.1.19376.1.5.3.2')] | self::hl7:text[not(@nullFlavor)] | self::hl7:statusCode[@code = 'completed'])]"
         id="d42e77011-true-d5721278e0">
      <assert role="error"
              see="http://elga.art-decor.org/elgaambbef-html-20230118T144941/tmp-1.2.40.0.34.6.0.11.3.72-2020-10-02T075121.html"
              test="not(.)">(atcdabbr_entry_MedikationsEinnahmeEntry)/d42e77011-true-d5721278e0: '<value-of select="name(..)"/>' ist als geschlossen definiert und dieses Element '<name/>' ist nicht erlaubt oder nicht mit diesem Inhalt erlaubt. Dies kann templateId, code oder id betreffen. Erwartet:  hl7:templateId[@root = '2.16.840.1.113883.10.20.1.43'] | hl7:templateId[@root = '1.3.6.1.4.1.19376.1.5.3.1.4.3.1'] | hl7:code[(@code = 'FINSTRUCT' and @codeSystem = '1.3.6.1.4.1.19376.1.5.3.2')] | hl7:text[not(@nullFlavor)] | hl7:statusCode[@code = 'completed'] (rule-reference: d42e77011-true-d5721278e0)</assert>
   </rule>

   <!-- Checking undefined contents for template/element @isClosed="true". Match context that we did not already match -->
   <rule fpi="RUL-QQQ"
         context="*[hl7:substanceAdministration[hl7:templateId[@root = '1.2.40.0.34.6.0.11.3.72'] and hl7:templateId[@root = '2.16.840.1.113883.10.20.1.24'] and hl7:templateId[@root = '1.3.6.1.4.1.19376.1.5.3.1.4.7'] and hl7:templateId[@root = '1.3.6.1.4.1.19376.1.9.1.3.16'] and hl7:templateId[@root = '1.3.6.1.4.1.19376.1.5.3.1.4.7.1']]]/hl7:substanceAdministration[hl7:templateId[@root = '1.2.40.0.34.6.0.11.3.72'] and hl7:templateId[@root = '2.16.840.1.113883.10.20.1.24'] and hl7:templateId[@root = '1.3.6.1.4.1.19376.1.5.3.1.4.7'] and hl7:templateId[@root = '1.3.6.1.4.1.19376.1.9.1.3.16'] and hl7:templateId[@root = '1.3.6.1.4.1.19376.1.5.3.1.4.7.1']]/hl7:entryRelationship[@typeCode='SUBJ'][hl7:act/hl7:templateId[@root='2.16.840.1.113883.10.20.1.43']]/hl7:act[hl7:templateId[@root = '2.16.840.1.113883.10.20.1.43'] and hl7:templateId[@root = '1.3.6.1.4.1.19376.1.5.3.1.4.3.1']]/hl7:text[not(@nullFlavor)]/*[not(@xsi:nil = 'true')][not(self::hl7:reference[not(@nullFlavor)])]"
         id="d42e77033-true-d5721310e0">
      <assert role="error"
              see="http://elga.art-decor.org/elgaambbef-html-20230118T144941/tmp-1.2.40.0.34.6.0.11.3.72-2020-10-02T075121.html"
              test="not(.)">(atcdabbr_entry_MedikationsEinnahmeEntry)/d42e77033-true-d5721310e0: '<value-of select="name(..)"/>' ist als geschlossen definiert und dieses Element '<name/>' ist nicht erlaubt oder nicht mit diesem Inhalt erlaubt. Dies kann templateId, code oder id betreffen. Erwartet:  hl7:reference[not(@nullFlavor)] (rule-reference: d42e77033-true-d5721310e0)</assert>
   </rule>

   <!-- Checking undefined contents for template/element @isClosed="true". Match context that we did not already match -->
   <rule fpi="RUL-QQQ"
         context="*[hl7:substanceAdministration[hl7:templateId[@root = '1.2.40.0.34.6.0.11.3.72'] and hl7:templateId[@root = '2.16.840.1.113883.10.20.1.24'] and hl7:templateId[@root = '1.3.6.1.4.1.19376.1.5.3.1.4.7'] and hl7:templateId[@root = '1.3.6.1.4.1.19376.1.9.1.3.16'] and hl7:templateId[@root = '1.3.6.1.4.1.19376.1.5.3.1.4.7.1']]]/hl7:substanceAdministration[hl7:templateId[@root = '1.2.40.0.34.6.0.11.3.72'] and hl7:templateId[@root = '2.16.840.1.113883.10.20.1.24'] and hl7:templateId[@root = '1.3.6.1.4.1.19376.1.5.3.1.4.7'] and hl7:templateId[@root = '1.3.6.1.4.1.19376.1.9.1.3.16'] and hl7:templateId[@root = '1.3.6.1.4.1.19376.1.5.3.1.4.7.1']]/hl7:entryRelationship[@typeCode='COMP'][hl7:supply]/*[not(@xsi:nil = 'true')][not(self::hl7:supply[not(@nullFlavor)][@classCode = 'SPLY'][@moodCode = 'RQO'])]"
         id="d42e77056-true-d5721333e0">
      <assert role="error"
              see="http://elga.art-decor.org/elgaambbef-html-20230118T144941/tmp-1.2.40.0.34.6.0.11.3.72-2020-10-02T075121.html"
              test="not(.)">(atcdabbr_entry_MedikationsEinnahmeEntry)/d42e77056-true-d5721333e0: '<value-of select="name(..)"/>' ist als geschlossen definiert und dieses Element '<name/>' ist nicht erlaubt oder nicht mit diesem Inhalt erlaubt. Dies kann templateId, code oder id betreffen. Erwartet:  hl7:supply[not(@nullFlavor)][@classCode = 'SPLY'][@moodCode = 'RQO'] (rule-reference: d42e77056-true-d5721333e0)</assert>
   </rule>

   <!-- Checking undefined contents for template/element @isClosed="true". Match context that we did not already match -->
   <rule fpi="RUL-QQQ"
         context="*[hl7:substanceAdministration[hl7:templateId[@root = '1.2.40.0.34.6.0.11.3.72'] and hl7:templateId[@root = '2.16.840.1.113883.10.20.1.24'] and hl7:templateId[@root = '1.3.6.1.4.1.19376.1.5.3.1.4.7'] and hl7:templateId[@root = '1.3.6.1.4.1.19376.1.9.1.3.16'] and hl7:templateId[@root = '1.3.6.1.4.1.19376.1.5.3.1.4.7.1']]]/hl7:substanceAdministration[hl7:templateId[@root = '1.2.40.0.34.6.0.11.3.72'] and hl7:templateId[@root = '2.16.840.1.113883.10.20.1.24'] and hl7:templateId[@root = '1.3.6.1.4.1.19376.1.5.3.1.4.7'] and hl7:templateId[@root = '1.3.6.1.4.1.19376.1.9.1.3.16'] and hl7:templateId[@root = '1.3.6.1.4.1.19376.1.5.3.1.4.7.1']]/hl7:entryRelationship[@typeCode='COMP'][hl7:supply]/hl7:supply[not(@nullFlavor)][@classCode = 'SPLY'][@moodCode = 'RQO']/*[not(@xsi:nil = 'true')][not(self::hl7:independentInd[not(@nullFlavor)] | self::hl7:quantity)]"
         id="d42e77081-true-d5721352e0">
      <assert role="error"
              see="http://elga.art-decor.org/elgaambbef-html-20230118T144941/tmp-1.2.40.0.34.6.0.11.3.72-2020-10-02T075121.html"
              test="not(.)">(atcdabbr_entry_MedikationsEinnahmeEntry)/d42e77081-true-d5721352e0: '<value-of select="name(..)"/>' ist als geschlossen definiert und dieses Element '<name/>' ist nicht erlaubt oder nicht mit diesem Inhalt erlaubt. Dies kann templateId, code oder id betreffen. Erwartet:  hl7:independentInd[not(@nullFlavor)] | hl7:quantity (rule-reference: d42e77081-true-d5721352e0)</assert>
   </rule>

   <!-- Checking undefined contents for template/element @isClosed="true". Match context that we did not already match -->
   <rule fpi="RUL-QQQ"
         context="*[hl7:substanceAdministration[hl7:templateId[@root = '1.2.40.0.34.6.0.11.3.72'] and hl7:templateId[@root = '2.16.840.1.113883.10.20.1.24'] and hl7:templateId[@root = '1.3.6.1.4.1.19376.1.5.3.1.4.7'] and hl7:templateId[@root = '1.3.6.1.4.1.19376.1.9.1.3.16'] and hl7:templateId[@root = '1.3.6.1.4.1.19376.1.5.3.1.4.7.1']]]/hl7:substanceAdministration[hl7:templateId[@root = '1.2.40.0.34.6.0.11.3.72'] and hl7:templateId[@root = '2.16.840.1.113883.10.20.1.24'] and hl7:templateId[@root = '1.3.6.1.4.1.19376.1.5.3.1.4.7'] and hl7:templateId[@root = '1.3.6.1.4.1.19376.1.9.1.3.16'] and hl7:templateId[@root = '1.3.6.1.4.1.19376.1.5.3.1.4.7.1']]/hl7:entryRelationship[@typeCode='REFR'][hl7:substanceAdministration/hl7:templateId[@root='1.3.6.1.4.1.19376.1.9.1.3.10']]/*[not(@xsi:nil = 'true')][not(self::hl7:substanceAdministration[hl7:templateId[@root = '1.3.6.1.4.1.19376.1.9.1.3.10']])]"
         id="d42e77129-true-d5721376e0">
      <assert role="error"
              see="http://elga.art-decor.org/elgaambbef-html-20230118T144941/tmp-1.2.40.0.34.6.0.11.3.72-2020-10-02T075121.html"
              test="not(.)">(atcdabbr_entry_MedikationsEinnahmeEntry)/d42e77129-true-d5721376e0: '<value-of select="name(..)"/>' ist als geschlossen definiert und dieses Element '<name/>' ist nicht erlaubt oder nicht mit diesem Inhalt erlaubt. Dies kann templateId, code oder id betreffen. Erwartet:  hl7:substanceAdministration[hl7:templateId[@root = '1.3.6.1.4.1.19376.1.9.1.3.10']] (rule-reference: d42e77129-true-d5721376e0)</assert>
   </rule>

   <!-- Checking undefined contents for template/element @isClosed="true". Match context that we did not already match -->
   <rule fpi="RUL-QQQ"
         context="*[hl7:substanceAdministration[hl7:templateId[@root = '1.2.40.0.34.6.0.11.3.72'] and hl7:templateId[@root = '2.16.840.1.113883.10.20.1.24'] and hl7:templateId[@root = '1.3.6.1.4.1.19376.1.5.3.1.4.7'] and hl7:templateId[@root = '1.3.6.1.4.1.19376.1.9.1.3.16'] and hl7:templateId[@root = '1.3.6.1.4.1.19376.1.5.3.1.4.7.1']]]/hl7:substanceAdministration[hl7:templateId[@root = '1.2.40.0.34.6.0.11.3.72'] and hl7:templateId[@root = '2.16.840.1.113883.10.20.1.24'] and hl7:templateId[@root = '1.3.6.1.4.1.19376.1.5.3.1.4.7'] and hl7:templateId[@root = '1.3.6.1.4.1.19376.1.9.1.3.16'] and hl7:templateId[@root = '1.3.6.1.4.1.19376.1.5.3.1.4.7.1']]/hl7:entryRelationship[@typeCode='REFR'][hl7:substanceAdministration/hl7:templateId[@root='1.3.6.1.4.1.19376.1.9.1.3.10']]/hl7:substanceAdministration[hl7:templateId[@root = '1.3.6.1.4.1.19376.1.9.1.3.10']]/*[not(@xsi:nil = 'true')][not(self::hl7:templateId[@root = '1.3.6.1.4.1.19376.1.9.1.3.10'] | self::hl7:id[not(@nullFlavor)] | self::hl7:code[(@code = 'MTPItem' and @codeSystem = '1.3.6.1.4.1.19376.1.9.2.2')] | self::hl7:consumable[not(@nullFlavor)][hl7:manufacturedProduct])]"
         id="d42e77143-true-d5721410e0">
      <assert role="error"
              see="http://elga.art-decor.org/elgaambbef-html-20230118T144941/tmp-1.2.40.0.34.6.0.11.3.72-2020-10-02T075121.html"
              test="not(.)">(atcdabbr_entry_MedikationsEinnahmeEntry)/d42e77143-true-d5721410e0: '<value-of select="name(..)"/>' ist als geschlossen definiert und dieses Element '<name/>' ist nicht erlaubt oder nicht mit diesem Inhalt erlaubt. Dies kann templateId, code oder id betreffen. Erwartet:  hl7:templateId[@root = '1.3.6.1.4.1.19376.1.9.1.3.10'] | hl7:id[not(@nullFlavor)] | hl7:code[(@code = 'MTPItem' and @codeSystem = '1.3.6.1.4.1.19376.1.9.2.2')] | hl7:consumable[not(@nullFlavor)][hl7:manufacturedProduct] (rule-reference: d42e77143-true-d5721410e0)</assert>
   </rule>

   <!-- Checking undefined contents for template/element @isClosed="true". Match context that we did not already match -->
   <rule fpi="RUL-QQQ"
         context="*[hl7:substanceAdministration[hl7:templateId[@root = '1.2.40.0.34.6.0.11.3.72'] and hl7:templateId[@root = '2.16.840.1.113883.10.20.1.24'] and hl7:templateId[@root = '1.3.6.1.4.1.19376.1.5.3.1.4.7'] and hl7:templateId[@root = '1.3.6.1.4.1.19376.1.9.1.3.16'] and hl7:templateId[@root = '1.3.6.1.4.1.19376.1.5.3.1.4.7.1']]]/hl7:substanceAdministration[hl7:templateId[@root = '1.2.40.0.34.6.0.11.3.72'] and hl7:templateId[@root = '2.16.840.1.113883.10.20.1.24'] and hl7:templateId[@root = '1.3.6.1.4.1.19376.1.5.3.1.4.7'] and hl7:templateId[@root = '1.3.6.1.4.1.19376.1.9.1.3.16'] and hl7:templateId[@root = '1.3.6.1.4.1.19376.1.5.3.1.4.7.1']]/hl7:entryRelationship[@typeCode='REFR'][hl7:substanceAdministration/hl7:templateId[@root='1.3.6.1.4.1.19376.1.9.1.3.10']]/hl7:substanceAdministration[hl7:templateId[@root = '1.3.6.1.4.1.19376.1.9.1.3.10']]/hl7:consumable[not(@nullFlavor)][hl7:manufacturedProduct]/*[not(@xsi:nil = 'true')][not(self::hl7:manufacturedProduct[not(@nullFlavor)][hl7:manufacturedMaterial[@nullFlavor = 'NA']])]"
         id="d42e77177-true-d5721441e0">
      <assert role="error"
              see="http://elga.art-decor.org/elgaambbef-html-20230118T144941/tmp-1.2.40.0.34.6.0.11.3.72-2020-10-02T075121.html"
              test="not(.)">(atcdabbr_entry_MedikationsEinnahmeEntry)/d42e77177-true-d5721441e0: '<value-of select="name(..)"/>' ist als geschlossen definiert und dieses Element '<name/>' ist nicht erlaubt oder nicht mit diesem Inhalt erlaubt. Dies kann templateId, code oder id betreffen. Erwartet:  hl7:manufacturedProduct[not(@nullFlavor)][hl7:manufacturedMaterial[@nullFlavor = 'NA']] (rule-reference: d42e77177-true-d5721441e0)</assert>
   </rule>

   <!-- Checking undefined contents for template/element @isClosed="true". Match context that we did not already match -->
   <rule fpi="RUL-QQQ"
         context="*[hl7:substanceAdministration[hl7:templateId[@root = '1.2.40.0.34.6.0.11.3.72'] and hl7:templateId[@root = '2.16.840.1.113883.10.20.1.24'] and hl7:templateId[@root = '1.3.6.1.4.1.19376.1.5.3.1.4.7'] and hl7:templateId[@root = '1.3.6.1.4.1.19376.1.9.1.3.16'] and hl7:templateId[@root = '1.3.6.1.4.1.19376.1.5.3.1.4.7.1']]]/hl7:substanceAdministration[hl7:templateId[@root = '1.2.40.0.34.6.0.11.3.72'] and hl7:templateId[@root = '2.16.840.1.113883.10.20.1.24'] and hl7:templateId[@root = '1.3.6.1.4.1.19376.1.5.3.1.4.7'] and hl7:templateId[@root = '1.3.6.1.4.1.19376.1.9.1.3.16'] and hl7:templateId[@root = '1.3.6.1.4.1.19376.1.5.3.1.4.7.1']]/hl7:entryRelationship[@typeCode='REFR'][hl7:substanceAdministration/hl7:templateId[@root='1.3.6.1.4.1.19376.1.9.1.3.10']]/hl7:substanceAdministration[hl7:templateId[@root = '1.3.6.1.4.1.19376.1.9.1.3.10']]/hl7:consumable[not(@nullFlavor)][hl7:manufacturedProduct]/hl7:manufacturedProduct[not(@nullFlavor)][hl7:manufacturedMaterial[@nullFlavor = 'NA']]/*[not(@xsi:nil = 'true')][not(self::hl7:manufacturedMaterial[@nullFlavor = 'NA'])]"
         id="d42e77179-true-d5721455e0">
      <assert role="error"
              see="http://elga.art-decor.org/elgaambbef-html-20230118T144941/tmp-1.2.40.0.34.6.0.11.3.72-2020-10-02T075121.html"
              test="not(.)">(atcdabbr_entry_MedikationsEinnahmeEntry)/d42e77179-true-d5721455e0: '<value-of select="name(..)"/>' ist als geschlossen definiert und dieses Element '<name/>' ist nicht erlaubt oder nicht mit diesem Inhalt erlaubt. Dies kann templateId, code oder id betreffen. Erwartet:  hl7:manufacturedMaterial[@nullFlavor = 'NA'] (rule-reference: d42e77179-true-d5721455e0)</assert>
   </rule>

   <!-- Checking undefined contents for template/element @isClosed="true". Match context that we did not already match -->
   <rule fpi="RUL-QQQ"
         context="*[hl7:substanceAdministration[hl7:templateId[@root = '1.2.40.0.34.6.0.11.3.72'] and hl7:templateId[@root = '2.16.840.1.113883.10.20.1.24'] and hl7:templateId[@root = '1.3.6.1.4.1.19376.1.5.3.1.4.7'] and hl7:templateId[@root = '1.3.6.1.4.1.19376.1.9.1.3.16'] and hl7:templateId[@root = '1.3.6.1.4.1.19376.1.5.3.1.4.7.1']]]/hl7:substanceAdministration[hl7:templateId[@root = '1.2.40.0.34.6.0.11.3.72'] and hl7:templateId[@root = '2.16.840.1.113883.10.20.1.24'] and hl7:templateId[@root = '1.3.6.1.4.1.19376.1.5.3.1.4.7'] and hl7:templateId[@root = '1.3.6.1.4.1.19376.1.9.1.3.16'] and hl7:templateId[@root = '1.3.6.1.4.1.19376.1.5.3.1.4.7.1']]/hl7:entryRelationship[@typeCode='REFR'][hl7:substanceAdministration/hl7:templateId[@root='1.3.6.1.4.1.19376.1.9.1.3.11']]/*[not(@xsi:nil = 'true')][not(self::hl7:substanceAdministration[hl7:templateId[@root = '1.3.6.1.4.1.19376.1.9.1.3.11']])]"
         id="d42e77190-true-d5721474e0">
      <assert role="error"
              see="http://elga.art-decor.org/elgaambbef-html-20230118T144941/tmp-1.2.40.0.34.6.0.11.3.72-2020-10-02T075121.html"
              test="not(.)">(atcdabbr_entry_MedikationsEinnahmeEntry)/d42e77190-true-d5721474e0: '<value-of select="name(..)"/>' ist als geschlossen definiert und dieses Element '<name/>' ist nicht erlaubt oder nicht mit diesem Inhalt erlaubt. Dies kann templateId, code oder id betreffen. Erwartet:  hl7:substanceAdministration[hl7:templateId[@root = '1.3.6.1.4.1.19376.1.9.1.3.11']] (rule-reference: d42e77190-true-d5721474e0)</assert>
   </rule>

   <!-- Checking undefined contents for template/element @isClosed="true". Match context that we did not already match -->
   <rule fpi="RUL-QQQ"
         context="*[hl7:substanceAdministration[hl7:templateId[@root = '1.2.40.0.34.6.0.11.3.72'] and hl7:templateId[@root = '2.16.840.1.113883.10.20.1.24'] and hl7:templateId[@root = '1.3.6.1.4.1.19376.1.5.3.1.4.7'] and hl7:templateId[@root = '1.3.6.1.4.1.19376.1.9.1.3.16'] and hl7:templateId[@root = '1.3.6.1.4.1.19376.1.5.3.1.4.7.1']]]/hl7:substanceAdministration[hl7:templateId[@root = '1.2.40.0.34.6.0.11.3.72'] and hl7:templateId[@root = '2.16.840.1.113883.10.20.1.24'] and hl7:templateId[@root = '1.3.6.1.4.1.19376.1.5.3.1.4.7'] and hl7:templateId[@root = '1.3.6.1.4.1.19376.1.9.1.3.16'] and hl7:templateId[@root = '1.3.6.1.4.1.19376.1.5.3.1.4.7.1']]/hl7:entryRelationship[@typeCode='REFR'][hl7:substanceAdministration/hl7:templateId[@root='1.3.6.1.4.1.19376.1.9.1.3.11']]/hl7:substanceAdministration[hl7:templateId[@root = '1.3.6.1.4.1.19376.1.9.1.3.11']]/*[not(@xsi:nil = 'true')][not(self::hl7:templateId[@root = '1.3.6.1.4.1.19376.1.9.1.3.11'] | self::hl7:id[not(@nullFlavor)] | self::hl7:code[(@code = 'PREItem' and @codeSystem = '1.3.6.1.4.1.19376.1.9.2.2')] | self::hl7:consumable[not(@nullFlavor)][hl7:manufacturedProduct])]"
         id="d42e77199-true-d5721508e0">
      <assert role="error"
              see="http://elga.art-decor.org/elgaambbef-html-20230118T144941/tmp-1.2.40.0.34.6.0.11.3.72-2020-10-02T075121.html"
              test="not(.)">(atcdabbr_entry_MedikationsEinnahmeEntry)/d42e77199-true-d5721508e0: '<value-of select="name(..)"/>' ist als geschlossen definiert und dieses Element '<name/>' ist nicht erlaubt oder nicht mit diesem Inhalt erlaubt. Dies kann templateId, code oder id betreffen. Erwartet:  hl7:templateId[@root = '1.3.6.1.4.1.19376.1.9.1.3.11'] | hl7:id[not(@nullFlavor)] | hl7:code[(@code = 'PREItem' and @codeSystem = '1.3.6.1.4.1.19376.1.9.2.2')] | hl7:consumable[not(@nullFlavor)][hl7:manufacturedProduct] (rule-reference: d42e77199-true-d5721508e0)</assert>
   </rule>

   <!-- Checking undefined contents for template/element @isClosed="true". Match context that we did not already match -->
   <rule fpi="RUL-QQQ"
         context="*[hl7:substanceAdministration[hl7:templateId[@root = '1.2.40.0.34.6.0.11.3.72'] and hl7:templateId[@root = '2.16.840.1.113883.10.20.1.24'] and hl7:templateId[@root = '1.3.6.1.4.1.19376.1.5.3.1.4.7'] and hl7:templateId[@root = '1.3.6.1.4.1.19376.1.9.1.3.16'] and hl7:templateId[@root = '1.3.6.1.4.1.19376.1.5.3.1.4.7.1']]]/hl7:substanceAdministration[hl7:templateId[@root = '1.2.40.0.34.6.0.11.3.72'] and hl7:templateId[@root = '2.16.840.1.113883.10.20.1.24'] and hl7:templateId[@root = '1.3.6.1.4.1.19376.1.5.3.1.4.7'] and hl7:templateId[@root = '1.3.6.1.4.1.19376.1.9.1.3.16'] and hl7:templateId[@root = '1.3.6.1.4.1.19376.1.5.3.1.4.7.1']]/hl7:entryRelationship[@typeCode='REFR'][hl7:substanceAdministration/hl7:templateId[@root='1.3.6.1.4.1.19376.1.9.1.3.11']]/hl7:substanceAdministration[hl7:templateId[@root = '1.3.6.1.4.1.19376.1.9.1.3.11']]/hl7:consumable[not(@nullFlavor)][hl7:manufacturedProduct]/*[not(@xsi:nil = 'true')][not(self::hl7:manufacturedProduct[not(@nullFlavor)][hl7:manufacturedMaterial[@nullFlavor = 'NA']])]"
         id="d42e77233-true-d5721539e0">
      <assert role="error"
              see="http://elga.art-decor.org/elgaambbef-html-20230118T144941/tmp-1.2.40.0.34.6.0.11.3.72-2020-10-02T075121.html"
              test="not(.)">(atcdabbr_entry_MedikationsEinnahmeEntry)/d42e77233-true-d5721539e0: '<value-of select="name(..)"/>' ist als geschlossen definiert und dieses Element '<name/>' ist nicht erlaubt oder nicht mit diesem Inhalt erlaubt. Dies kann templateId, code oder id betreffen. Erwartet:  hl7:manufacturedProduct[not(@nullFlavor)][hl7:manufacturedMaterial[@nullFlavor = 'NA']] (rule-reference: d42e77233-true-d5721539e0)</assert>
   </rule>

   <!-- Checking undefined contents for template/element @isClosed="true". Match context that we did not already match -->
   <rule fpi="RUL-QQQ"
         context="*[hl7:substanceAdministration[hl7:templateId[@root = '1.2.40.0.34.6.0.11.3.72'] and hl7:templateId[@root = '2.16.840.1.113883.10.20.1.24'] and hl7:templateId[@root = '1.3.6.1.4.1.19376.1.5.3.1.4.7'] and hl7:templateId[@root = '1.3.6.1.4.1.19376.1.9.1.3.16'] and hl7:templateId[@root = '1.3.6.1.4.1.19376.1.5.3.1.4.7.1']]]/hl7:substanceAdministration[hl7:templateId[@root = '1.2.40.0.34.6.0.11.3.72'] and hl7:templateId[@root = '2.16.840.1.113883.10.20.1.24'] and hl7:templateId[@root = '1.3.6.1.4.1.19376.1.5.3.1.4.7'] and hl7:templateId[@root = '1.3.6.1.4.1.19376.1.9.1.3.16'] and hl7:templateId[@root = '1.3.6.1.4.1.19376.1.5.3.1.4.7.1']]/hl7:entryRelationship[@typeCode='REFR'][hl7:substanceAdministration/hl7:templateId[@root='1.3.6.1.4.1.19376.1.9.1.3.11']]/hl7:substanceAdministration[hl7:templateId[@root = '1.3.6.1.4.1.19376.1.9.1.3.11']]/hl7:consumable[not(@nullFlavor)][hl7:manufacturedProduct]/hl7:manufacturedProduct[not(@nullFlavor)][hl7:manufacturedMaterial[@nullFlavor = 'NA']]/*[not(@xsi:nil = 'true')][not(self::hl7:manufacturedMaterial[@nullFlavor = 'NA'])]"
         id="d42e77235-true-d5721553e0">
      <assert role="error"
              see="http://elga.art-decor.org/elgaambbef-html-20230118T144941/tmp-1.2.40.0.34.6.0.11.3.72-2020-10-02T075121.html"
              test="not(.)">(atcdabbr_entry_MedikationsEinnahmeEntry)/d42e77235-true-d5721553e0: '<value-of select="name(..)"/>' ist als geschlossen definiert und dieses Element '<name/>' ist nicht erlaubt oder nicht mit diesem Inhalt erlaubt. Dies kann templateId, code oder id betreffen. Erwartet:  hl7:manufacturedMaterial[@nullFlavor = 'NA'] (rule-reference: d42e77235-true-d5721553e0)</assert>
   </rule>

   <!-- Checking undefined contents for template/element @isClosed="true". Match context that we did not already match -->
   <rule fpi="RUL-QQQ"
         context="*[hl7:substanceAdministration[hl7:templateId[@root = '1.2.40.0.34.6.0.11.3.72'] and hl7:templateId[@root = '2.16.840.1.113883.10.20.1.24'] and hl7:templateId[@root = '1.3.6.1.4.1.19376.1.5.3.1.4.7'] and hl7:templateId[@root = '1.3.6.1.4.1.19376.1.9.1.3.16'] and hl7:templateId[@root = '1.3.6.1.4.1.19376.1.5.3.1.4.7.1']]]/hl7:substanceAdministration[hl7:templateId[@root = '1.2.40.0.34.6.0.11.3.72'] and hl7:templateId[@root = '2.16.840.1.113883.10.20.1.24'] and hl7:templateId[@root = '1.3.6.1.4.1.19376.1.5.3.1.4.7'] and hl7:templateId[@root = '1.3.6.1.4.1.19376.1.9.1.3.16'] and hl7:templateId[@root = '1.3.6.1.4.1.19376.1.5.3.1.4.7.1']]/hl7:entryRelationship[@typeCode='REFR'][hl7:supply/hl7:templateId[@root='1.3.6.1.4.1.19376.1.9.1.3.12']]/*[not(@xsi:nil = 'true')][not(self::hl7:supply[hl7:templateId[@root = '1.3.6.1.4.1.19376.1.9.1.3.12']])]"
         id="d42e77246-true-d5721572e0">
      <assert role="error"
              see="http://elga.art-decor.org/elgaambbef-html-20230118T144941/tmp-1.2.40.0.34.6.0.11.3.72-2020-10-02T075121.html"
              test="not(.)">(atcdabbr_entry_MedikationsEinnahmeEntry)/d42e77246-true-d5721572e0: '<value-of select="name(..)"/>' ist als geschlossen definiert und dieses Element '<name/>' ist nicht erlaubt oder nicht mit diesem Inhalt erlaubt. Dies kann templateId, code oder id betreffen. Erwartet:  hl7:supply[hl7:templateId[@root = '1.3.6.1.4.1.19376.1.9.1.3.12']] (rule-reference: d42e77246-true-d5721572e0)</assert>
   </rule>

   <!-- Checking undefined contents for template/element @isClosed="true". Match context that we did not already match -->
   <rule fpi="RUL-QQQ"
         context="*[hl7:substanceAdministration[hl7:templateId[@root = '1.2.40.0.34.6.0.11.3.72'] and hl7:templateId[@root = '2.16.840.1.113883.10.20.1.24'] and hl7:templateId[@root = '1.3.6.1.4.1.19376.1.5.3.1.4.7'] and hl7:templateId[@root = '1.3.6.1.4.1.19376.1.9.1.3.16'] and hl7:templateId[@root = '1.3.6.1.4.1.19376.1.5.3.1.4.7.1']]]/hl7:substanceAdministration[hl7:templateId[@root = '1.2.40.0.34.6.0.11.3.72'] and hl7:templateId[@root = '2.16.840.1.113883.10.20.1.24'] and hl7:templateId[@root = '1.3.6.1.4.1.19376.1.5.3.1.4.7'] and hl7:templateId[@root = '1.3.6.1.4.1.19376.1.9.1.3.16'] and hl7:templateId[@root = '1.3.6.1.4.1.19376.1.5.3.1.4.7.1']]/hl7:entryRelationship[@typeCode='REFR'][hl7:supply/hl7:templateId[@root='1.3.6.1.4.1.19376.1.9.1.3.12']]/hl7:supply[hl7:templateId[@root = '1.3.6.1.4.1.19376.1.9.1.3.12']]/*[not(@xsi:nil = 'true')][not(self::hl7:templateId[@root = '1.3.6.1.4.1.19376.1.9.1.3.12'] | self::hl7:id[not(@nullFlavor)] | self::hl7:code[(@code = 'DISItem' and @codeSystem = '1.3.6.1.4.1.19376.1.9.2.2')])]"
         id="d42e77255-true-d5721601e0">
      <assert role="error"
              see="http://elga.art-decor.org/elgaambbef-html-20230118T144941/tmp-1.2.40.0.34.6.0.11.3.72-2020-10-02T075121.html"
              test="not(.)">(atcdabbr_entry_MedikationsEinnahmeEntry)/d42e77255-true-d5721601e0: '<value-of select="name(..)"/>' ist als geschlossen definiert und dieses Element '<name/>' ist nicht erlaubt oder nicht mit diesem Inhalt erlaubt. Dies kann templateId, code oder id betreffen. Erwartet:  hl7:templateId[@root = '1.3.6.1.4.1.19376.1.9.1.3.12'] | hl7:id[not(@nullFlavor)] | hl7:code[(@code = 'DISItem' and @codeSystem = '1.3.6.1.4.1.19376.1.9.2.2')] (rule-reference: d42e77255-true-d5721601e0)</assert>
   </rule>

   <!-- Checking undefined contents for template/element @isClosed="true". Match context that we did not already match -->
   <rule fpi="RUL-QQQ"
         context="*[hl7:substanceAdministration[hl7:templateId[@root = '1.2.40.0.34.6.0.11.3.72'] and hl7:templateId[@root = '2.16.840.1.113883.10.20.1.24'] and hl7:templateId[@root = '1.3.6.1.4.1.19376.1.5.3.1.4.7'] and hl7:templateId[@root = '1.3.6.1.4.1.19376.1.9.1.3.16'] and hl7:templateId[@root = '1.3.6.1.4.1.19376.1.5.3.1.4.7.1']]]/hl7:substanceAdministration[hl7:templateId[@root = '1.2.40.0.34.6.0.11.3.72'] and hl7:templateId[@root = '2.16.840.1.113883.10.20.1.24'] and hl7:templateId[@root = '1.3.6.1.4.1.19376.1.5.3.1.4.7'] and hl7:templateId[@root = '1.3.6.1.4.1.19376.1.9.1.3.16'] and hl7:templateId[@root = '1.3.6.1.4.1.19376.1.5.3.1.4.7.1']]/hl7:entryRelationship[@typeCode='REFR'][hl7:substanceAdministration/hl7:templateId[@root='1.3.6.1.4.1.19376.1.9.1.3.13']]/*[not(@xsi:nil = 'true')][not(self::hl7:substanceAdministration[hl7:templateId[@root = '1.3.6.1.4.1.19376.1.9.1.3.13']])]"
         id="d42e77290-true-d5721632e0">
      <assert role="error"
              see="http://elga.art-decor.org/elgaambbef-html-20230118T144941/tmp-1.2.40.0.34.6.0.11.3.72-2020-10-02T075121.html"
              test="not(.)">(atcdabbr_entry_MedikationsEinnahmeEntry)/d42e77290-true-d5721632e0: '<value-of select="name(..)"/>' ist als geschlossen definiert und dieses Element '<name/>' ist nicht erlaubt oder nicht mit diesem Inhalt erlaubt. Dies kann templateId, code oder id betreffen. Erwartet:  hl7:substanceAdministration[hl7:templateId[@root = '1.3.6.1.4.1.19376.1.9.1.3.13']] (rule-reference: d42e77290-true-d5721632e0)</assert>
   </rule>

   <!-- Checking undefined contents for template/element @isClosed="true". Match context that we did not already match -->
   <rule fpi="RUL-QQQ"
         context="*[hl7:substanceAdministration[hl7:templateId[@root = '1.2.40.0.34.6.0.11.3.72'] and hl7:templateId[@root = '2.16.840.1.113883.10.20.1.24'] and hl7:templateId[@root = '1.3.6.1.4.1.19376.1.5.3.1.4.7'] and hl7:templateId[@root = '1.3.6.1.4.1.19376.1.9.1.3.16'] and hl7:templateId[@root = '1.3.6.1.4.1.19376.1.5.3.1.4.7.1']]]/hl7:substanceAdministration[hl7:templateId[@root = '1.2.40.0.34.6.0.11.3.72'] and hl7:templateId[@root = '2.16.840.1.113883.10.20.1.24'] and hl7:templateId[@root = '1.3.6.1.4.1.19376.1.5.3.1.4.7'] and hl7:templateId[@root = '1.3.6.1.4.1.19376.1.9.1.3.16'] and hl7:templateId[@root = '1.3.6.1.4.1.19376.1.5.3.1.4.7.1']]/hl7:entryRelationship[@typeCode='REFR'][hl7:substanceAdministration/hl7:templateId[@root='1.3.6.1.4.1.19376.1.9.1.3.13']]/hl7:substanceAdministration[hl7:templateId[@root = '1.3.6.1.4.1.19376.1.9.1.3.13']]/*[not(@xsi:nil = 'true')][not(self::hl7:templateId[@root = '1.3.6.1.4.1.19376.1.9.1.3.13'] | self::hl7:id[not(@nullFlavor)] | self::hl7:code[(@code = 'PADVItem' and @codeSystem = '1.3.6.1.4.1.19376.1.9.2.2')])]"
         id="d42e77299-true-d5721661e0">
      <assert role="error"
              see="http://elga.art-decor.org/elgaambbef-html-20230118T144941/tmp-1.2.40.0.34.6.0.11.3.72-2020-10-02T075121.html"
              test="not(.)">(atcdabbr_entry_MedikationsEinnahmeEntry)/d42e77299-true-d5721661e0: '<value-of select="name(..)"/>' ist als geschlossen definiert und dieses Element '<name/>' ist nicht erlaubt oder nicht mit diesem Inhalt erlaubt. Dies kann templateId, code oder id betreffen. Erwartet:  hl7:templateId[@root = '1.3.6.1.4.1.19376.1.9.1.3.13'] | hl7:id[not(@nullFlavor)] | hl7:code[(@code = 'PADVItem' and @codeSystem = '1.3.6.1.4.1.19376.1.9.2.2')] (rule-reference: d42e77299-true-d5721661e0)</assert>
   </rule>

   <!-- Checking undefined contents for template/element @isClosed="true". Match context that we did not already match -->
   <rule fpi="RUL-QQQ"
         context="*[hl7:substanceAdministration[hl7:templateId[@root = '1.2.40.0.34.6.0.11.3.72'] and hl7:templateId[@root = '2.16.840.1.113883.10.20.1.24'] and hl7:templateId[@root = '1.3.6.1.4.1.19376.1.5.3.1.4.7'] and hl7:templateId[@root = '1.3.6.1.4.1.19376.1.9.1.3.16'] and hl7:templateId[@root = '1.3.6.1.4.1.19376.1.5.3.1.4.7.1']]]/hl7:substanceAdministration[hl7:templateId[@root = '1.2.40.0.34.6.0.11.3.72'] and hl7:templateId[@root = '2.16.840.1.113883.10.20.1.24'] and hl7:templateId[@root = '1.3.6.1.4.1.19376.1.5.3.1.4.7'] and hl7:templateId[@root = '1.3.6.1.4.1.19376.1.9.1.3.16'] and hl7:templateId[@root = '1.3.6.1.4.1.19376.1.5.3.1.4.7.1']]/hl7:entryRelationship[@typeCode='REFR'][hl7:substanceAdministration/hl7:templateId[@root='1.3.6.1.4.1.19376.1.9.1.3.14']]/*[not(@xsi:nil = 'true')][not(self::hl7:substanceAdministration[hl7:templateId[@root = '1.3.6.1.4.1.19376.1.9.1.3.14']])]"
         id="d42e77334-true-d5721692e0">
      <assert role="error"
              see="http://elga.art-decor.org/elgaambbef-html-20230118T144941/tmp-1.2.40.0.34.6.0.11.3.72-2020-10-02T075121.html"
              test="not(.)">(atcdabbr_entry_MedikationsEinnahmeEntry)/d42e77334-true-d5721692e0: '<value-of select="name(..)"/>' ist als geschlossen definiert und dieses Element '<name/>' ist nicht erlaubt oder nicht mit diesem Inhalt erlaubt. Dies kann templateId, code oder id betreffen. Erwartet:  hl7:substanceAdministration[hl7:templateId[@root = '1.3.6.1.4.1.19376.1.9.1.3.14']] (rule-reference: d42e77334-true-d5721692e0)</assert>
   </rule>

   <!-- Checking undefined contents for template/element @isClosed="true". Match context that we did not already match -->
   <rule fpi="RUL-QQQ"
         context="*[hl7:substanceAdministration[hl7:templateId[@root = '1.2.40.0.34.6.0.11.3.72'] and hl7:templateId[@root = '2.16.840.1.113883.10.20.1.24'] and hl7:templateId[@root = '1.3.6.1.4.1.19376.1.5.3.1.4.7'] and hl7:templateId[@root = '1.3.6.1.4.1.19376.1.9.1.3.16'] and hl7:templateId[@root = '1.3.6.1.4.1.19376.1.5.3.1.4.7.1']]]/hl7:substanceAdministration[hl7:templateId[@root = '1.2.40.0.34.6.0.11.3.72'] and hl7:templateId[@root = '2.16.840.1.113883.10.20.1.24'] and hl7:templateId[@root = '1.3.6.1.4.1.19376.1.5.3.1.4.7'] and hl7:templateId[@root = '1.3.6.1.4.1.19376.1.9.1.3.16'] and hl7:templateId[@root = '1.3.6.1.4.1.19376.1.5.3.1.4.7.1']]/hl7:entryRelationship[@typeCode='REFR'][hl7:substanceAdministration/hl7:templateId[@root='1.3.6.1.4.1.19376.1.9.1.3.14']]/hl7:substanceAdministration[hl7:templateId[@root = '1.3.6.1.4.1.19376.1.9.1.3.14']]/*[not(@xsi:nil = 'true')][not(self::hl7:templateId[@root = '1.3.6.1.4.1.19376.1.9.1.3.14'] | self::hl7:id[not(@nullFlavor)] | self::hl7:code[(@code = 'CMAItem' and @codeSystem = '1.3.6.1.4.1.19376.1.9.2.2')] | self::hl7:consumable[not(@nullFlavor)][hl7:manufacturedProduct])]"
         id="d42e77343-true-d5721726e0">
      <assert role="error"
              see="http://elga.art-decor.org/elgaambbef-html-20230118T144941/tmp-1.2.40.0.34.6.0.11.3.72-2020-10-02T075121.html"
              test="not(.)">(atcdabbr_entry_MedikationsEinnahmeEntry)/d42e77343-true-d5721726e0: '<value-of select="name(..)"/>' ist als geschlossen definiert und dieses Element '<name/>' ist nicht erlaubt oder nicht mit diesem Inhalt erlaubt. Dies kann templateId, code oder id betreffen. Erwartet:  hl7:templateId[@root = '1.3.6.1.4.1.19376.1.9.1.3.14'] | hl7:id[not(@nullFlavor)] | hl7:code[(@code = 'CMAItem' and @codeSystem = '1.3.6.1.4.1.19376.1.9.2.2')] | hl7:consumable[not(@nullFlavor)][hl7:manufacturedProduct] (rule-reference: d42e77343-true-d5721726e0)</assert>
   </rule>

   <!-- Checking undefined contents for template/element @isClosed="true". Match context that we did not already match -->
   <rule fpi="RUL-QQQ"
         context="*[hl7:substanceAdministration[hl7:templateId[@root = '1.2.40.0.34.6.0.11.3.72'] and hl7:templateId[@root = '2.16.840.1.113883.10.20.1.24'] and hl7:templateId[@root = '1.3.6.1.4.1.19376.1.5.3.1.4.7'] and hl7:templateId[@root = '1.3.6.1.4.1.19376.1.9.1.3.16'] and hl7:templateId[@root = '1.3.6.1.4.1.19376.1.5.3.1.4.7.1']]]/hl7:substanceAdministration[hl7:templateId[@root = '1.2.40.0.34.6.0.11.3.72'] and hl7:templateId[@root = '2.16.840.1.113883.10.20.1.24'] and hl7:templateId[@root = '1.3.6.1.4.1.19376.1.5.3.1.4.7'] and hl7:templateId[@root = '1.3.6.1.4.1.19376.1.9.1.3.16'] and hl7:templateId[@root = '1.3.6.1.4.1.19376.1.5.3.1.4.7.1']]/hl7:entryRelationship[@typeCode='REFR'][hl7:substanceAdministration/hl7:templateId[@root='1.3.6.1.4.1.19376.1.9.1.3.14']]/hl7:substanceAdministration[hl7:templateId[@root = '1.3.6.1.4.1.19376.1.9.1.3.14']]/hl7:consumable[not(@nullFlavor)][hl7:manufacturedProduct]/*[not(@xsi:nil = 'true')][not(self::hl7:manufacturedProduct[not(@nullFlavor)][hl7:manufacturedMaterial[@nullFlavor = 'NA']])]"
         id="d42e77380-true-d5721757e0">
      <assert role="error"
              see="http://elga.art-decor.org/elgaambbef-html-20230118T144941/tmp-1.2.40.0.34.6.0.11.3.72-2020-10-02T075121.html"
              test="not(.)">(atcdabbr_entry_MedikationsEinnahmeEntry)/d42e77380-true-d5721757e0: '<value-of select="name(..)"/>' ist als geschlossen definiert und dieses Element '<name/>' ist nicht erlaubt oder nicht mit diesem Inhalt erlaubt. Dies kann templateId, code oder id betreffen. Erwartet:  hl7:manufacturedProduct[not(@nullFlavor)][hl7:manufacturedMaterial[@nullFlavor = 'NA']] (rule-reference: d42e77380-true-d5721757e0)</assert>
   </rule>

   <!-- Checking undefined contents for template/element @isClosed="true". Match context that we did not already match -->
   <rule fpi="RUL-QQQ"
         context="*[hl7:substanceAdministration[hl7:templateId[@root = '1.2.40.0.34.6.0.11.3.72'] and hl7:templateId[@root = '2.16.840.1.113883.10.20.1.24'] and hl7:templateId[@root = '1.3.6.1.4.1.19376.1.5.3.1.4.7'] and hl7:templateId[@root = '1.3.6.1.4.1.19376.1.9.1.3.16'] and hl7:templateId[@root = '1.3.6.1.4.1.19376.1.5.3.1.4.7.1']]]/hl7:substanceAdministration[hl7:templateId[@root = '1.2.40.0.34.6.0.11.3.72'] and hl7:templateId[@root = '2.16.840.1.113883.10.20.1.24'] and hl7:templateId[@root = '1.3.6.1.4.1.19376.1.5.3.1.4.7'] and hl7:templateId[@root = '1.3.6.1.4.1.19376.1.9.1.3.16'] and hl7:templateId[@root = '1.3.6.1.4.1.19376.1.5.3.1.4.7.1']]/hl7:entryRelationship[@typeCode='REFR'][hl7:substanceAdministration/hl7:templateId[@root='1.3.6.1.4.1.19376.1.9.1.3.14']]/hl7:substanceAdministration[hl7:templateId[@root = '1.3.6.1.4.1.19376.1.9.1.3.14']]/hl7:consumable[not(@nullFlavor)][hl7:manufacturedProduct]/hl7:manufacturedProduct[not(@nullFlavor)][hl7:manufacturedMaterial[@nullFlavor = 'NA']]/*[not(@xsi:nil = 'true')][not(self::hl7:manufacturedMaterial[@nullFlavor = 'NA'])]"
         id="d42e77382-true-d5721771e0">
      <assert role="error"
              see="http://elga.art-decor.org/elgaambbef-html-20230118T144941/tmp-1.2.40.0.34.6.0.11.3.72-2020-10-02T075121.html"
              test="not(.)">(atcdabbr_entry_MedikationsEinnahmeEntry)/d42e77382-true-d5721771e0: '<value-of select="name(..)"/>' ist als geschlossen definiert und dieses Element '<name/>' ist nicht erlaubt oder nicht mit diesem Inhalt erlaubt. Dies kann templateId, code oder id betreffen. Erwartet:  hl7:manufacturedMaterial[@nullFlavor = 'NA'] (rule-reference: d42e77382-true-d5721771e0)</assert>
   </rule>

   <!-- Checking undefined contents for template/element @isClosed="true". Match context that we did not already match -->
   <rule fpi="RUL-QQQ"
         context="*[hl7:substanceAdministration[hl7:templateId[@root = '1.2.40.0.34.6.0.11.3.72'] and hl7:templateId[@root = '2.16.840.1.113883.10.20.1.24'] and hl7:templateId[@root = '1.3.6.1.4.1.19376.1.5.3.1.4.7'] and hl7:templateId[@root = '1.3.6.1.4.1.19376.1.9.1.3.16'] and hl7:templateId[@root = '1.3.6.1.4.1.19376.1.5.3.1.4.7.1']]]/hl7:substanceAdministration[hl7:templateId[@root = '1.2.40.0.34.6.0.11.3.72'] and hl7:templateId[@root = '2.16.840.1.113883.10.20.1.24'] and hl7:templateId[@root = '1.3.6.1.4.1.19376.1.5.3.1.4.7'] and hl7:templateId[@root = '1.3.6.1.4.1.19376.1.9.1.3.16'] and hl7:templateId[@root = '1.3.6.1.4.1.19376.1.5.3.1.4.7.1']]/hl7:reference[@typeCode = 'XCRPT'][hl7:externalDocument]/*[not(@xsi:nil = 'true')][not(self::hl7:externalDocument[not(@nullFlavor)])]"
         id="d42e77394-true-d5721790e0">
      <assert role="error"
              see="http://elga.art-decor.org/elgaambbef-html-20230118T144941/tmp-1.2.40.0.34.6.0.11.3.72-2020-10-02T075121.html"
              test="not(.)">(atcdabbr_entry_MedikationsEinnahmeEntry)/d42e77394-true-d5721790e0: '<value-of select="name(..)"/>' ist als geschlossen definiert und dieses Element '<name/>' ist nicht erlaubt oder nicht mit diesem Inhalt erlaubt. Dies kann templateId, code oder id betreffen. Erwartet:  hl7:externalDocument[not(@nullFlavor)] (rule-reference: d42e77394-true-d5721790e0)</assert>
   </rule>

   <!-- Checking undefined contents for template/element @isClosed="true". Match context that we did not already match -->
   <rule fpi="RUL-QQQ"
         context="*[hl7:substanceAdministration[hl7:templateId[@root = '1.2.40.0.34.6.0.11.3.72'] and hl7:templateId[@root = '2.16.840.1.113883.10.20.1.24'] and hl7:templateId[@root = '1.3.6.1.4.1.19376.1.5.3.1.4.7'] and hl7:templateId[@root = '1.3.6.1.4.1.19376.1.9.1.3.16'] and hl7:templateId[@root = '1.3.6.1.4.1.19376.1.5.3.1.4.7.1']]]/hl7:substanceAdministration[hl7:templateId[@root = '1.2.40.0.34.6.0.11.3.72'] and hl7:templateId[@root = '2.16.840.1.113883.10.20.1.24'] and hl7:templateId[@root = '1.3.6.1.4.1.19376.1.5.3.1.4.7'] and hl7:templateId[@root = '1.3.6.1.4.1.19376.1.9.1.3.16'] and hl7:templateId[@root = '1.3.6.1.4.1.19376.1.5.3.1.4.7.1']]/hl7:reference[@typeCode = 'XCRPT'][hl7:externalDocument]/hl7:externalDocument[not(@nullFlavor)]/*[not(@xsi:nil = 'true')][not(self::hl7:id[not(@nullFlavor)])]"
         id="d42e77406-true-d5721804e0">
      <assert role="error"
              see="http://elga.art-decor.org/elgaambbef-html-20230118T144941/tmp-1.2.40.0.34.6.0.11.3.72-2020-10-02T075121.html"
              test="not(.)">(atcdabbr_entry_MedikationsEinnahmeEntry)/d42e77406-true-d5721804e0: '<value-of select="name(..)"/>' ist als geschlossen definiert und dieses Element '<name/>' ist nicht erlaubt oder nicht mit diesem Inhalt erlaubt. Dies kann templateId, code oder id betreffen. Erwartet:  hl7:id[not(@nullFlavor)] (rule-reference: d42e77406-true-d5721804e0)</assert>
   </rule>

   <!-- Checking undefined contents for template/element @isClosed="true". Match context that we did not already match -->
   <rule fpi="RUL-QQQ"
         context="*[hl7:substanceAdministration[hl7:templateId[@root = '1.2.40.0.34.6.0.11.3.72'] and hl7:templateId[@root = '2.16.840.1.113883.10.20.1.24'] and hl7:templateId[@root = '1.3.6.1.4.1.19376.1.5.3.1.4.7'] and hl7:templateId[@root = '1.3.6.1.4.1.19376.1.9.1.3.16'] and hl7:templateId[@root = '1.3.6.1.4.1.19376.1.5.3.1.4.7.1']]]/hl7:substanceAdministration[hl7:templateId[@root = '1.2.40.0.34.6.0.11.3.72'] and hl7:templateId[@root = '2.16.840.1.113883.10.20.1.24'] and hl7:templateId[@root = '1.3.6.1.4.1.19376.1.5.3.1.4.7'] and hl7:templateId[@root = '1.3.6.1.4.1.19376.1.9.1.3.16'] and hl7:templateId[@root = '1.3.6.1.4.1.19376.1.5.3.1.4.7.1']]/hl7:precondition[hl7:criterion]/*[not(@xsi:nil = 'true')][not(self::hl7:criterion[not(@nullFlavor)])]"
         id="d42e77417-true-d5721823e0">
      <assert role="error"
              see="http://elga.art-decor.org/elgaambbef-html-20230118T144941/tmp-1.2.40.0.34.6.0.11.3.72-2020-10-02T075121.html"
              test="not(.)">(atcdabbr_entry_MedikationsEinnahmeEntry)/d42e77417-true-d5721823e0: '<value-of select="name(..)"/>' ist als geschlossen definiert und dieses Element '<name/>' ist nicht erlaubt oder nicht mit diesem Inhalt erlaubt. Dies kann templateId, code oder id betreffen. Erwartet:  hl7:criterion[not(@nullFlavor)] (rule-reference: d42e77417-true-d5721823e0)</assert>
   </rule>

   <!-- Checking undefined contents for template/element @isClosed="true". Match context that we did not already match -->
   <rule fpi="RUL-QQQ"
         context="*[hl7:substanceAdministration[hl7:templateId[@root = '1.2.40.0.34.6.0.11.3.72'] and hl7:templateId[@root = '2.16.840.1.113883.10.20.1.24'] and hl7:templateId[@root = '1.3.6.1.4.1.19376.1.5.3.1.4.7'] and hl7:templateId[@root = '1.3.6.1.4.1.19376.1.9.1.3.16'] and hl7:templateId[@root = '1.3.6.1.4.1.19376.1.5.3.1.4.7.1']]]/hl7:substanceAdministration[hl7:templateId[@root = '1.2.40.0.34.6.0.11.3.72'] and hl7:templateId[@root = '2.16.840.1.113883.10.20.1.24'] and hl7:templateId[@root = '1.3.6.1.4.1.19376.1.5.3.1.4.7'] and hl7:templateId[@root = '1.3.6.1.4.1.19376.1.9.1.3.16'] and hl7:templateId[@root = '1.3.6.1.4.1.19376.1.5.3.1.4.7.1']]/hl7:precondition[hl7:criterion]/hl7:criterion[not(@nullFlavor)]/*[not(@xsi:nil = 'true')][not(self::hl7:text[not(@nullFlavor)])]"
         id="d42e77422-true-d5721837e0">
      <assert role="error"
              see="http://elga.art-decor.org/elgaambbef-html-20230118T144941/tmp-1.2.40.0.34.6.0.11.3.72-2020-10-02T075121.html"
              test="not(.)">(atcdabbr_entry_MedikationsEinnahmeEntry)/d42e77422-true-d5721837e0: '<value-of select="name(..)"/>' ist als geschlossen definiert und dieses Element '<name/>' ist nicht erlaubt oder nicht mit diesem Inhalt erlaubt. Dies kann templateId, code oder id betreffen. Erwartet:  hl7:text[not(@nullFlavor)] (rule-reference: d42e77422-true-d5721837e0)</assert>
   </rule>

   <!-- Checking undefined contents for template/element @isClosed="true". Match context that we did not already match -->
   <rule fpi="RUL-QQQ"
         context="*[hl7:substanceAdministration[hl7:templateId[@root = '1.2.40.0.34.6.0.11.3.72'] and hl7:templateId[@root = '2.16.840.1.113883.10.20.1.24'] and hl7:templateId[@root = '1.3.6.1.4.1.19376.1.5.3.1.4.7'] and hl7:templateId[@root = '1.3.6.1.4.1.19376.1.9.1.3.16'] and hl7:templateId[@root = '1.3.6.1.4.1.19376.1.5.3.1.4.7.1']]]/hl7:substanceAdministration[hl7:templateId[@root = '1.2.40.0.34.6.0.11.3.72'] and hl7:templateId[@root = '2.16.840.1.113883.10.20.1.24'] and hl7:templateId[@root = '1.3.6.1.4.1.19376.1.5.3.1.4.7'] and hl7:templateId[@root = '1.3.6.1.4.1.19376.1.9.1.3.16'] and hl7:templateId[@root = '1.3.6.1.4.1.19376.1.5.3.1.4.7.1']]/hl7:precondition[hl7:criterion]/hl7:criterion[not(@nullFlavor)]/hl7:text[not(@nullFlavor)]/*[not(@xsi:nil = 'true')][not(self::hl7:reference[not(@nullFlavor)])]"
         id="d42e77424-true-d5721851e0">
      <assert role="error"
              see="http://elga.art-decor.org/elgaambbef-html-20230118T144941/tmp-1.2.40.0.34.6.0.11.3.72-2020-10-02T075121.html"
              test="not(.)">(atcdabbr_entry_MedikationsEinnahmeEntry)/d42e77424-true-d5721851e0: '<value-of select="name(..)"/>' ist als geschlossen definiert und dieses Element '<name/>' ist nicht erlaubt oder nicht mit diesem Inhalt erlaubt. Dies kann templateId, code oder id betreffen. Erwartet:  hl7:reference[not(@nullFlavor)] (rule-reference: d42e77424-true-d5721851e0)</assert>
   </rule>
</pattern>
