<?xml version="1.0" encoding="UTF-8"?>
<!-- 
    DTR1 CO.EPSOS - Coded Ordinal
    Status: draft
-->
<rule xmlns="http://purl.oclc.org/dsdl/schematron"
      abstract="true"
      id="CO.EPSOS"
      see="https://docs.art-decor.org/documentation/datatypes/DTr1_CO.EPSOS">
    <extends rule="CO"/>
</rule>
