<?xml version="1.0" encoding="UTF-8"?>
<!-- 
    DTR1 list_int - List of integers
    Status: draft
-->
<rule xmlns="http://purl.oclc.org/dsdl/schematron"
      abstract="true"
      id="list_int"
      see="https://docs.art-decor.org/documentation/datatypes/DTr1_list_int">
    <extends rule="ANY"/>
</rule>
