<?xml version="1.0" encoding="UTF-8"?>
<!-- 
    DTR1 SLIST_TS - Sequence of Timestamp
    Status: draft
-->
<rule xmlns="http://purl.oclc.org/dsdl/schematron"
      abstract="true"
      id="SLIST_TS"
      see="https://docs.art-decor.org/documentation/datatypes/DTr1_SLIST_TS">
    <extends rule="SLIST"/>
</rule>
