<?xml version="1.0" encoding="UTF-8"?>
<!--
:   Structured Document Text (StrucDoc.Text), used in CDA Section.text
    Status: draft
-->
<rule xmlns="http://purl.oclc.org/dsdl/schematron"
      abstract="true"
      id="SD.TEXT"
      see="https://docs.art-decor.org/documentation/datatypes/DTr1_SD.TEXT">
    <!-- SD.TEXT (StrucDoc.Text) does not extend or restrict anything -->
    <extends rule="ANY"/>
</rule>
