<?xml version="1.0" encoding="UTF-8"?>
<!--
Template derived pattern
===========================================
ID: 1.2.40.0.34.6.0.11.9.21
Name: Performer Body - Impfende Person
Description: 
-->
<pattern xmlns="http://purl.oclc.org/dsdl/schematron"
         id="template-1.2.40.0.34.6.0.11.9.21-2021-05-12T073318-closed">
   <title>Performer Body - Impfende Person</title>

   <!-- Checking undefined contents for template/element @isClosed="true". Match context that we did not already match -->
   <rule fpi="RUL-QQQ"
         context="*[hl7:templateId[@root = '1.2.40.0.34.6.0.11.9.21']]/*[not(@xsi:nil = 'true')][not(self::hl7:templateId[@root = '1.2.40.0.34.6.0.11.9.21'] | self::hl7:time | self::hl7:assignedEntity[not(@nullFlavor)])]"
         id="d42e59823-true-d2246192e0">
      <assert role="error"
              see="https://elga.art-decor.org/elgabgd-html-20250116T125424/tmp-1.2.40.0.34.6.0.11.9.21-2021-05-12T073318.html"
              test="not(.)">(atcdabbr_other_PerformerBodyImpfendePerson)/d42e59823-true-d2246192e0: '<value-of select="name(..)"/>' ist als geschlossen definiert und dieses Element '<name/>' ist nicht erlaubt oder nicht mit diesem Inhalt erlaubt. Dies kann templateId, code oder id betreffen. Erwartet:  hl7:templateId[@root = '1.2.40.0.34.6.0.11.9.21'] | hl7:time | hl7:assignedEntity[not(@nullFlavor)] (rule-reference: d42e59823-true-d2246192e0)</assert>
   </rule>

   <!-- Checking undefined contents for template/element @isClosed="true". Match context that we did not already match -->
   <rule fpi="RUL-QQQ"
         context="*[hl7:templateId[@root = '1.2.40.0.34.6.0.11.9.21']]/hl7:assignedEntity[not(@nullFlavor)]/*[not(@xsi:nil = 'true')][not(self::hl7:id[not(@nullFlavor)] | self::hl7:id[@nullFlavor='NI'] | self::hl7:id[@nullFlavor='UNK'] | self::hl7:code[concat(@code, @codeSystem) = doc('include/voc-1.2.40.0.34.6.0.10.11-DYNAMIC.xml')//valueSet[1]/conceptList/concept/concat(@code, @codeSystem)] | self::hl7:code[@nullFlavor='UNK'] | self::hl7:addr[not(@nullFlavor)] | self::hl7:addr[@nullFlavor = 'UNK'] | self::hl7:telecom[not(@nullFlavor)] | self::hl7:assignedPerson | self::hl7:assignedPerson | self::hl7:representedOrganization)]"
         id="d42e59891-true-d2246303e0">
      <assert role="error"
              see="https://elga.art-decor.org/elgabgd-html-20250116T125424/tmp-1.2.40.0.34.6.0.11.9.21-2021-05-12T073318.html"
              test="not(.)">(atcdabbr_other_PerformerBodyImpfendePerson)/d42e59891-true-d2246303e0: '<value-of select="name(..)"/>' ist als geschlossen definiert und dieses Element '<name/>' ist nicht erlaubt oder nicht mit diesem Inhalt erlaubt. Dies kann templateId, code oder id betreffen. Erwartet:  hl7:id[not(@nullFlavor)] | hl7:id[@nullFlavor='NI'] | hl7:id[@nullFlavor='UNK'] | hl7:code[concat(@code, @codeSystem) = doc('include/voc-1.2.40.0.34.6.0.10.11-DYNAMIC.xml')//valueSet[1]/conceptList/concept/concat(@code, @codeSystem)] | hl7:code[@nullFlavor='UNK'] | hl7:addr[not(@nullFlavor)] | hl7:addr[@nullFlavor = 'UNK'] | hl7:telecom[not(@nullFlavor)] | hl7:assignedPerson | hl7:assignedPerson | hl7:representedOrganization (rule-reference: d42e59891-true-d2246303e0)</assert>
   </rule>

   <!-- Checking undefined contents for template/element @isClosed="true". Match context that we did not already match -->
   <rule fpi="RUL-QQQ"
         context="*[hl7:templateId[@root = '1.2.40.0.34.6.0.11.9.21']]/hl7:assignedEntity[not(@nullFlavor)]/hl7:addr[not(@nullFlavor)]/*[not(@xsi:nil = 'true')][not(self::hl7:streetAddressLine | self::hl7:streetName | self::hl7:houseNumber | self::hl7:postalCode | self::hl7:city | self::hl7:state | self::hl7:country | self::hl7:additionalLocator)]"
         id="d42e59981-true-d2246373e0">
      <assert role="error"
              see="https://elga.art-decor.org/elgabgd-html-20250116T125424/tmp-1.2.40.0.34.6.0.11.9.21-2021-05-12T073318.html"
              test="not(.)">(atcdabbr_other_PerformerBodyImpfendePerson)/d42e59981-true-d2246373e0: '<value-of select="name(..)"/>' ist als geschlossen definiert und dieses Element '<name/>' ist nicht erlaubt oder nicht mit diesem Inhalt erlaubt. Dies kann templateId, code oder id betreffen. Erwartet:  hl7:streetAddressLine | hl7:streetName | hl7:houseNumber | hl7:postalCode | hl7:city | hl7:state | hl7:country | hl7:additionalLocator (rule-reference: d42e59981-true-d2246373e0)</assert>
   </rule>

   <!-- Checking undefined contents for template/element @isClosed="true". Match context that we did not already match -->
   <rule fpi="RUL-QQQ"
         context="*[hl7:templateId[@root = '1.2.40.0.34.6.0.11.9.21']]/hl7:assignedEntity[not(@nullFlavor)]/hl7:assignedPerson/*[not(@xsi:nil = 'true')][not(self::hl7:name[not(@nullFlavor)])]"
         id="d42e60055-true-d2246438e0">
      <assert role="error"
              see="https://elga.art-decor.org/elgabgd-html-20250116T125424/tmp-1.2.40.0.34.6.0.11.9.21-2021-05-12T073318.html"
              test="not(.)">(atcdabbr_other_PerformerBodyImpfendePerson)/d42e60055-true-d2246438e0: '<value-of select="name(..)"/>' ist als geschlossen definiert und dieses Element '<name/>' ist nicht erlaubt oder nicht mit diesem Inhalt erlaubt. Dies kann templateId, code oder id betreffen. Erwartet:  hl7:name[not(@nullFlavor)] (rule-reference: d42e60055-true-d2246438e0)</assert>
   </rule>

   <!-- Checking undefined contents for template/element @isClosed="true". Match context that we did not already match -->
   <rule fpi="RUL-QQQ"
         context="*[hl7:templateId[@root = '1.2.40.0.34.6.0.11.9.21']]/hl7:assignedEntity[not(@nullFlavor)]/hl7:assignedPerson/*[not(@xsi:nil = 'true')][not(self::hl7:name[not(@nullFlavor)])]"
         id="d42e60069-true-d2246460e0">
      <assert role="error"
              see="https://elga.art-decor.org/elgabgd-html-20250116T125424/tmp-1.2.40.0.34.6.0.11.9.21-2021-05-12T073318.html"
              test="not(.)">(atcdabbr_other_PerformerBodyImpfendePerson)/d42e60069-true-d2246460e0: '<value-of select="name(..)"/>' ist als geschlossen definiert und dieses Element '<name/>' ist nicht erlaubt oder nicht mit diesem Inhalt erlaubt. Dies kann templateId, code oder id betreffen. Erwartet:  hl7:name[not(@nullFlavor)] (rule-reference: d42e60069-true-d2246460e0)</assert>
   </rule>

   <!-- Checking undefined contents for template/element @isClosed="true". Match context that we did not already match -->
   <rule fpi="RUL-QQQ"
         context="*[hl7:templateId[@root = '1.2.40.0.34.6.0.11.9.21']]/hl7:assignedEntity[not(@nullFlavor)]/hl7:assignedPerson/hl7:name[not(@nullFlavor)]/*[not(@xsi:nil = 'true')][not(self::hl7:prefix | self::hl7:family[not(@nullFlavor)] | self::hl7:given[not(@nullFlavor)] | self::hl7:suffix)]"
         id="d2246448e12-true-d2246489e0">
      <assert role="error"
              see="https://elga.art-decor.org/elgabgd-html-20250116T125424/tmp-1.2.40.0.34.6.0.11.9.21-2021-05-12T073318.html"
              test="not(.)">(atcdabbr_other_PerformerBodyImpfendePerson)/d2246448e12-true-d2246489e0: '<value-of select="name(..)"/>' ist als geschlossen definiert und dieses Element '<name/>' ist nicht erlaubt oder nicht mit diesem Inhalt erlaubt. Dies kann templateId, code oder id betreffen. Erwartet:  hl7:prefix | hl7:family[not(@nullFlavor)] | hl7:given[not(@nullFlavor)] | hl7:suffix (rule-reference: d2246448e12-true-d2246489e0)</assert>
   </rule>

   <!-- Checking undefined contents for template/element @isClosed="true". Match context that we did not already match -->
   <rule fpi="RUL-QQQ"
         context="*[hl7:templateId[@root = '1.2.40.0.34.6.0.11.9.21']]/hl7:assignedEntity[not(@nullFlavor)]/hl7:representedOrganization/*[not(@xsi:nil = 'true')][not(self::hl7:id[not(@nullFlavor)] | self::hl7:name[not(@nullFlavor)] | self::hl7:telecom[not(@nullFlavor)] | self::hl7:addr[not(@nullFlavor)])]"
         id="d42e60081-true-d2246540e0">
      <assert role="error"
              see="https://elga.art-decor.org/elgabgd-html-20250116T125424/tmp-1.2.40.0.34.6.0.11.9.21-2021-05-12T073318.html"
              test="not(.)">(atcdabbr_other_PerformerBodyImpfendePerson)/d42e60081-true-d2246540e0: '<value-of select="name(..)"/>' ist als geschlossen definiert und dieses Element '<name/>' ist nicht erlaubt oder nicht mit diesem Inhalt erlaubt. Dies kann templateId, code oder id betreffen. Erwartet:  hl7:id[not(@nullFlavor)] | hl7:name[not(@nullFlavor)] | hl7:telecom[not(@nullFlavor)] | hl7:addr[not(@nullFlavor)] (rule-reference: d42e60081-true-d2246540e0)</assert>
   </rule>

   <!-- Checking undefined contents for template/element @isClosed="true". Match context that we did not already match -->
   <rule fpi="RUL-QQQ"
         context="*[hl7:templateId[@root = '1.2.40.0.34.6.0.11.9.21']]/hl7:assignedEntity[not(@nullFlavor)]/hl7:representedOrganization/hl7:addr[not(@nullFlavor)]/*[not(@xsi:nil = 'true')][not(self::hl7:streetAddressLine | self::hl7:streetName | self::hl7:houseNumber | self::hl7:postalCode | self::hl7:city | self::hl7:state | self::hl7:country | self::hl7:additionalLocator)]"
         id="d2246514e57-true-d2246601e0">
      <assert role="error"
              see="https://elga.art-decor.org/elgabgd-html-20250116T125424/tmp-1.2.40.0.34.6.0.11.9.21-2021-05-12T073318.html"
              test="not(.)">(atcdabbr_other_PerformerBodyImpfendePerson)/d2246514e57-true-d2246601e0: '<value-of select="name(..)"/>' ist als geschlossen definiert und dieses Element '<name/>' ist nicht erlaubt oder nicht mit diesem Inhalt erlaubt. Dies kann templateId, code oder id betreffen. Erwartet:  hl7:streetAddressLine | hl7:streetName | hl7:houseNumber | hl7:postalCode | hl7:city | hl7:state | hl7:country | hl7:additionalLocator (rule-reference: d2246514e57-true-d2246601e0)</assert>
   </rule>
</pattern>
