<?xml version="1.0" encoding="UTF-8"?>
<!-- 
    DTR1 BXIT IVL PQ - BAG of Interval of PQ
    Status: draft
-->
<rule xmlns="http://purl.oclc.org/dsdl/schematron"
      abstract="true"
      id="BXIT_IVL_PQ"
      see="https://docs.art-decor.org/documentation/datatypes/DTr1_BXIT_IVL_PQ">
    <extends rule="IVL_PQ"/>

</rule>
