<?xml version="1.0" encoding="UTF-8"?>
<!-- 
    DTR1 SLIST_PQ - Sequence of Physical Quantity
    Status: draft
-->
<rule xmlns="http://purl.oclc.org/dsdl/schematron"
      abstract="true"
      id="SLIST_PQ"
      see="https://docs.art-decor.org/documentation/datatypes/DTr1_SLIST_PQ">
    <extends rule="SLIST"/>
</rule>
