<?xml version="1.0" encoding="UTF-8"?>
<!--
Template derived pattern
===========================================
ID: 1.2.40.0.34.6.0.11.3.47
Name: Functional Status Entry
Description: 
-->
<pattern xmlns="http://purl.oclc.org/dsdl/schematron"
         id="template-1.2.40.0.34.6.0.11.3.47-2019-11-26T133351-closed">
   <title>Functional Status Entry</title>

   <!-- Checking undefined contents for template/element @isClosed="true". Match context that we did not already match -->
   <rule fpi="RUL-QQQ"
         context="*[hl7:observation[hl7:templateId[@root = '1.2.40.0.34.6.0.11.3.47'] and hl7:templateId[@root = '2.16.840.1.113883.10.22.4.43']]]/*[not(@xsi:nil = 'true')][not(self::hl7:observation[hl7:templateId[@root = '1.2.40.0.34.6.0.11.3.47'] and hl7:templateId[@root = '2.16.840.1.113883.10.22.4.43']])]"
         id="d42e69536-true-d5539867e0">
      <assert role="error"
              see="http://elga.art-decor.org/elgaambbef-html-20230118T144941/tmp-1.2.40.0.34.6.0.11.3.47-2019-11-26T133351.html"
              test="not(.)">(atcdabbr_entry_FunctionalStatus)/d42e69536-true-d5539867e0: '<value-of select="name(..)"/>' ist als geschlossen definiert und dieses Element '<name/>' ist nicht erlaubt oder nicht mit diesem Inhalt erlaubt. Dies kann templateId, code oder id betreffen. Erwartet:  hl7:observation[hl7:templateId[@root = '1.2.40.0.34.6.0.11.3.47'] and hl7:templateId[@root = '2.16.840.1.113883.10.22.4.43']] (rule-reference: d42e69536-true-d5539867e0)</assert>
   </rule>

   <!-- Checking undefined contents for template/element @isClosed="true". Match context that we did not already match -->
   <rule fpi="RUL-QQQ"
         context="*[hl7:observation[hl7:templateId[@root = '1.2.40.0.34.6.0.11.3.47'] and hl7:templateId[@root = '2.16.840.1.113883.10.22.4.43']]]/hl7:observation[hl7:templateId[@root = '1.2.40.0.34.6.0.11.3.47'] and hl7:templateId[@root = '2.16.840.1.113883.10.22.4.43']]/*[not(@xsi:nil = 'true')][not(self::hl7:templateId[@root = '1.2.40.0.34.6.0.11.3.47'] | self::hl7:templateId[@root = '2.16.840.1.113883.10.22.4.43'] | self::hl7:id | self::hl7:code[(@code = '284773001' and @codeSystem = '2.16.840.1.113883.6.96')] | self::hl7:statusCode[@code = 'completed'] | self::hl7:effectiveTime | self::hl7:value[resolve-QName(@xsi:type, .) = QName('urn:hl7-org:v3', 'CD')][hl7:originalText] | self::hl7:author[hl7:assignedAuthor] | self::hl7:informant | self::hl7:reference[hl7:externalDocument[hl7:templateId[@root = '1.2.40.0.34.6.0.11.3.14']]])]"
         id="d42e69596-true-d5540215e0">
      <assert role="error"
              see="http://elga.art-decor.org/elgaambbef-html-20230118T144941/tmp-1.2.40.0.34.6.0.11.3.47-2019-11-26T133351.html"
              test="not(.)">(atcdabbr_entry_FunctionalStatus)/d42e69596-true-d5540215e0: '<value-of select="name(..)"/>' ist als geschlossen definiert und dieses Element '<name/>' ist nicht erlaubt oder nicht mit diesem Inhalt erlaubt. Dies kann templateId, code oder id betreffen. Erwartet:  hl7:templateId[@root = '1.2.40.0.34.6.0.11.3.47'] | hl7:templateId[@root = '2.16.840.1.113883.10.22.4.43'] | hl7:id | hl7:code[(@code = '284773001' and @codeSystem = '2.16.840.1.113883.6.96')] | hl7:statusCode[@code = 'completed'] | hl7:effectiveTime | hl7:value[resolve-QName(@xsi:type, .) = QName('urn:hl7-org:v3', 'CD')][hl7:originalText] | hl7:author[hl7:assignedAuthor] | hl7:informant | hl7:reference[hl7:externalDocument[hl7:templateId[@root = '1.2.40.0.34.6.0.11.3.14']]] (rule-reference: d42e69596-true-d5540215e0)</assert>
   </rule>

   <!-- Checking undefined contents for template/element @isClosed="true". Match context that we did not already match -->
   <rule fpi="RUL-QQQ"
         context="*[hl7:observation[hl7:templateId[@root = '1.2.40.0.34.6.0.11.3.47'] and hl7:templateId[@root = '2.16.840.1.113883.10.22.4.43']]]/hl7:observation[hl7:templateId[@root = '1.2.40.0.34.6.0.11.3.47'] and hl7:templateId[@root = '2.16.840.1.113883.10.22.4.43']]/hl7:value[resolve-QName(@xsi:type, .) = QName('urn:hl7-org:v3', 'CD')][hl7:originalText]/*[not(@xsi:nil = 'true')][not(self::hl7:originalText)]"
         id="d42e69643-true-d5540263e0">
      <assert role="error"
              see="http://elga.art-decor.org/elgaambbef-html-20230118T144941/tmp-1.2.40.0.34.6.0.11.3.47-2019-11-26T133351.html"
              test="not(.)">(atcdabbr_entry_FunctionalStatus)/d42e69643-true-d5540263e0: '<value-of select="name(..)"/>' ist als geschlossen definiert und dieses Element '<name/>' ist nicht erlaubt oder nicht mit diesem Inhalt erlaubt. Dies kann templateId, code oder id betreffen. Erwartet:  hl7:originalText (rule-reference: d42e69643-true-d5540263e0)</assert>
   </rule>

   <!-- Checking undefined contents for template/element @isClosed="true". Match context that we did not already match -->
   <rule fpi="RUL-QQQ"
         context="*[hl7:observation[hl7:templateId[@root = '1.2.40.0.34.6.0.11.3.47'] and hl7:templateId[@root = '2.16.840.1.113883.10.22.4.43']]]/hl7:observation[hl7:templateId[@root = '1.2.40.0.34.6.0.11.3.47'] and hl7:templateId[@root = '2.16.840.1.113883.10.22.4.43']]/hl7:value[resolve-QName(@xsi:type, .) = QName('urn:hl7-org:v3', 'CD')][hl7:originalText]/hl7:originalText/*[not(@xsi:nil = 'true')][not(self::hl7:reference)]"
         id="d42e69658-true-d5540277e0">
      <assert role="error"
              see="http://elga.art-decor.org/elgaambbef-html-20230118T144941/tmp-1.2.40.0.34.6.0.11.3.47-2019-11-26T133351.html"
              test="not(.)">(atcdabbr_entry_FunctionalStatus)/d42e69658-true-d5540277e0: '<value-of select="name(..)"/>' ist als geschlossen definiert und dieses Element '<name/>' ist nicht erlaubt oder nicht mit diesem Inhalt erlaubt. Dies kann templateId, code oder id betreffen. Erwartet:  hl7:reference (rule-reference: d42e69658-true-d5540277e0)</assert>
   </rule>

   <!-- Checking undefined contents for template/element @isClosed="true". Match context that we did not already match -->
   <rule fpi="RUL-QQQ"
         context="*[hl7:observation[hl7:templateId[@root = '1.2.40.0.34.6.0.11.3.47'] and hl7:templateId[@root = '2.16.840.1.113883.10.22.4.43']]]/hl7:observation[hl7:templateId[@root = '1.2.40.0.34.6.0.11.3.47'] and hl7:templateId[@root = '2.16.840.1.113883.10.22.4.43']]/hl7:author[hl7:assignedAuthor]/*[not(@xsi:nil = 'true')][not(self::hl7:functionCode | self::hl7:time[not(@nullFlavor)] | self::hl7:time[@nullFlavor='UNK'] | self::hl7:assignedAuthor)]"
         id="d42e69682-true-d5540409e0">
      <assert role="error"
              see="http://elga.art-decor.org/elgaambbef-html-20230118T144941/tmp-1.2.40.0.34.6.0.11.3.47-2019-11-26T133351.html"
              test="not(.)">(atcdabbr_entry_FunctionalStatus)/d42e69682-true-d5540409e0: '<value-of select="name(..)"/>' ist als geschlossen definiert und dieses Element '<name/>' ist nicht erlaubt oder nicht mit diesem Inhalt erlaubt. Dies kann templateId, code oder id betreffen. Erwartet:  hl7:functionCode | hl7:time[not(@nullFlavor)] | hl7:time[@nullFlavor='UNK'] | hl7:assignedAuthor (rule-reference: d42e69682-true-d5540409e0)</assert>
   </rule>

   <!-- Checking undefined contents for template/element @isClosed="true". Match context that we did not already match -->
   <rule fpi="RUL-QQQ"
         context="*[hl7:observation[hl7:templateId[@root = '1.2.40.0.34.6.0.11.3.47'] and hl7:templateId[@root = '2.16.840.1.113883.10.22.4.43']]]/hl7:observation[hl7:templateId[@root = '1.2.40.0.34.6.0.11.3.47'] and hl7:templateId[@root = '2.16.840.1.113883.10.22.4.43']]/hl7:author[hl7:assignedAuthor]/hl7:assignedAuthor/*[not(@xsi:nil = 'true')][not(self::hl7:id[not(@nullFlavor)] | self::hl7:id[@nullFlavor='UNK'] | self::hl7:code[not(@nullFlavor)] | self::hl7:addr[not(@nullFlavor)] | self::hl7:telecom[not(@nullFlavor)] | self::hl7:assignedPerson | self::hl7:assignedAuthoringDevice | self::hl7:representedOrganization)]"
         id="d5540287e38-true-d5540517e0">
      <assert role="error"
              see="http://elga.art-decor.org/elgaambbef-html-20230118T144941/tmp-1.2.40.0.34.6.0.11.3.47-2019-11-26T133351.html"
              test="not(.)">(atcdabbr_entry_FunctionalStatus)/d5540287e38-true-d5540517e0: '<value-of select="name(..)"/>' ist als geschlossen definiert und dieses Element '<name/>' ist nicht erlaubt oder nicht mit diesem Inhalt erlaubt. Dies kann templateId, code oder id betreffen. Erwartet:  hl7:id[not(@nullFlavor)] | hl7:id[@nullFlavor='UNK'] | hl7:code[not(@nullFlavor)] | hl7:addr[not(@nullFlavor)] | hl7:telecom[not(@nullFlavor)] | hl7:assignedPerson | hl7:assignedAuthoringDevice | hl7:representedOrganization (rule-reference: d5540287e38-true-d5540517e0)</assert>
   </rule>

   <!-- Checking undefined contents for template/element @isClosed="true". Match context that we did not already match -->
   <rule fpi="RUL-QQQ"
         context="*[hl7:observation[hl7:templateId[@root = '1.2.40.0.34.6.0.11.3.47'] and hl7:templateId[@root = '2.16.840.1.113883.10.22.4.43']]]/hl7:observation[hl7:templateId[@root = '1.2.40.0.34.6.0.11.3.47'] and hl7:templateId[@root = '2.16.840.1.113883.10.22.4.43']]/hl7:author[hl7:assignedAuthor]/hl7:assignedAuthor/hl7:addr[not(@nullFlavor)]/*[not(@xsi:nil = 'true')][not(self::hl7:streetAddressLine | self::hl7:streetName | self::hl7:houseNumber | self::hl7:postalCode[not(@nullFlavor)] | self::hl7:city[not(@nullFlavor)] | self::hl7:state | self::hl7:country[not(@nullFlavor)] | self::hl7:additionalLocator)]"
         id="d5540287e57-true-d5540576e0">
      <assert role="error"
              see="http://elga.art-decor.org/elgaambbef-html-20230118T144941/tmp-1.2.40.0.34.6.0.11.3.47-2019-11-26T133351.html"
              test="not(.)">(atcdabbr_entry_FunctionalStatus)/d5540287e57-true-d5540576e0: '<value-of select="name(..)"/>' ist als geschlossen definiert und dieses Element '<name/>' ist nicht erlaubt oder nicht mit diesem Inhalt erlaubt. Dies kann templateId, code oder id betreffen. Erwartet:  hl7:streetAddressLine | hl7:streetName | hl7:houseNumber | hl7:postalCode[not(@nullFlavor)] | hl7:city[not(@nullFlavor)] | hl7:state | hl7:country[not(@nullFlavor)] | hl7:additionalLocator (rule-reference: d5540287e57-true-d5540576e0)</assert>
   </rule>

   <!-- Checking undefined contents for template/element @isClosed="true". Match context that we did not already match -->
   <rule fpi="RUL-QQQ"
         context="*[hl7:observation[hl7:templateId[@root = '1.2.40.0.34.6.0.11.3.47'] and hl7:templateId[@root = '2.16.840.1.113883.10.22.4.43']]]/hl7:observation[hl7:templateId[@root = '1.2.40.0.34.6.0.11.3.47'] and hl7:templateId[@root = '2.16.840.1.113883.10.22.4.43']]/hl7:author[hl7:assignedAuthor]/hl7:assignedAuthor/hl7:assignedPerson/*[not(@xsi:nil = 'true')][not(self::hl7:name[not(@nullFlavor)] | self::hl7:name[@nullFlavor='UNK'] | self::hl7:name[@nullFlavor='MSK'])]"
         id="d5540287e100-true-d5540633e0">
      <assert role="error"
              see="http://elga.art-decor.org/elgaambbef-html-20230118T144941/tmp-1.2.40.0.34.6.0.11.3.47-2019-11-26T133351.html"
              test="not(.)">(atcdabbr_entry_FunctionalStatus)/d5540287e100-true-d5540633e0: '<value-of select="name(..)"/>' ist als geschlossen definiert und dieses Element '<name/>' ist nicht erlaubt oder nicht mit diesem Inhalt erlaubt. Dies kann templateId, code oder id betreffen. Erwartet:  hl7:name[not(@nullFlavor)] | hl7:name[@nullFlavor='UNK'] | hl7:name[@nullFlavor='MSK'] (rule-reference: d5540287e100-true-d5540633e0)</assert>
   </rule>

   <!-- Checking undefined contents for template/element @isClosed="true". Match context that we did not already match -->
   <rule fpi="RUL-QQQ"
         context="*[hl7:observation[hl7:templateId[@root = '1.2.40.0.34.6.0.11.3.47'] and hl7:templateId[@root = '2.16.840.1.113883.10.22.4.43']]]/hl7:observation[hl7:templateId[@root = '1.2.40.0.34.6.0.11.3.47'] and hl7:templateId[@root = '2.16.840.1.113883.10.22.4.43']]/hl7:author[hl7:assignedAuthor]/hl7:assignedAuthor/hl7:assignedPerson/hl7:name[not(@nullFlavor)]/*[not(@xsi:nil = 'true')][not(self::hl7:prefix | self::hl7:family[not(@nullFlavor)] | self::hl7:given[not(@nullFlavor)] | self::hl7:suffix)]"
         id="d5540637e91-true-d5540667e0">
      <assert role="error"
              see="http://elga.art-decor.org/elgaambbef-html-20230118T144941/tmp-1.2.40.0.34.6.0.11.9.6-2021-02-19T133649.html"
              test="not(.)">(atcdabbr_other_PersonNameCompilationG2)/d5540637e91-true-d5540667e0: '<value-of select="name(..)"/>' ist als geschlossen definiert und dieses Element '<name/>' ist nicht erlaubt oder nicht mit diesem Inhalt erlaubt. Dies kann templateId, code oder id betreffen. Erwartet:  hl7:prefix | hl7:family[not(@nullFlavor)] | hl7:given[not(@nullFlavor)] | hl7:suffix (rule-reference: d5540637e91-true-d5540667e0)</assert>
   </rule>

   <!-- Checking undefined contents for template/element @isClosed="true". Match context that we did not already match -->
   <rule fpi="RUL-QQQ"
         context="*[hl7:observation[hl7:templateId[@root = '1.2.40.0.34.6.0.11.3.47'] and hl7:templateId[@root = '2.16.840.1.113883.10.22.4.43']]]/hl7:observation[hl7:templateId[@root = '1.2.40.0.34.6.0.11.3.47'] and hl7:templateId[@root = '2.16.840.1.113883.10.22.4.43']]/hl7:author[hl7:assignedAuthor]/hl7:assignedAuthor/hl7:assignedAuthoringDevice/*[not(@xsi:nil = 'true')][not(self::hl7:manufacturerModelName[not(@nullFlavor)] | self::hl7:softwareName[not(@nullFlavor)])]"
         id="d5540287e123-true-d5540715e0">
      <assert role="error"
              see="http://elga.art-decor.org/elgaambbef-html-20230118T144941/tmp-1.2.40.0.34.6.0.11.3.47-2019-11-26T133351.html"
              test="not(.)">(atcdabbr_entry_FunctionalStatus)/d5540287e123-true-d5540715e0: '<value-of select="name(..)"/>' ist als geschlossen definiert und dieses Element '<name/>' ist nicht erlaubt oder nicht mit diesem Inhalt erlaubt. Dies kann templateId, code oder id betreffen. Erwartet:  hl7:manufacturerModelName[not(@nullFlavor)] | hl7:softwareName[not(@nullFlavor)] (rule-reference: d5540287e123-true-d5540715e0)</assert>
   </rule>

   <!-- Checking undefined contents for template/element @isClosed="true". Match context that we did not already match -->
   <rule fpi="RUL-QQQ"
         context="*[hl7:observation[hl7:templateId[@root = '1.2.40.0.34.6.0.11.3.47'] and hl7:templateId[@root = '2.16.840.1.113883.10.22.4.43']]]/hl7:observation[hl7:templateId[@root = '1.2.40.0.34.6.0.11.3.47'] and hl7:templateId[@root = '2.16.840.1.113883.10.22.4.43']]/hl7:author[hl7:assignedAuthor]/hl7:assignedAuthor/hl7:representedOrganization/*[not(@xsi:nil = 'true')][not(self::hl7:id[not(@nullFlavor)] | self::hl7:name[not(@nullFlavor)] | self::hl7:telecom[not(@nullFlavor)] | self::hl7:addr[not(@nullFlavor)])]"
         id="d5540287e139-true-d5540760e0">
      <assert role="error"
              see="http://elga.art-decor.org/elgaambbef-html-20230118T144941/tmp-1.2.40.0.34.6.0.11.3.47-2019-11-26T133351.html"
              test="not(.)">(atcdabbr_entry_FunctionalStatus)/d5540287e139-true-d5540760e0: '<value-of select="name(..)"/>' ist als geschlossen definiert und dieses Element '<name/>' ist nicht erlaubt oder nicht mit diesem Inhalt erlaubt. Dies kann templateId, code oder id betreffen. Erwartet:  hl7:id[not(@nullFlavor)] | hl7:name[not(@nullFlavor)] | hl7:telecom[not(@nullFlavor)] | hl7:addr[not(@nullFlavor)] (rule-reference: d5540287e139-true-d5540760e0)</assert>
   </rule>

   <!-- Checking undefined contents for template/element @isClosed="true". Match context that we did not already match -->
   <rule fpi="RUL-QQQ"
         context="*[hl7:observation[hl7:templateId[@root = '1.2.40.0.34.6.0.11.3.47'] and hl7:templateId[@root = '2.16.840.1.113883.10.22.4.43']]]/hl7:observation[hl7:templateId[@root = '1.2.40.0.34.6.0.11.3.47'] and hl7:templateId[@root = '2.16.840.1.113883.10.22.4.43']]/hl7:author[hl7:assignedAuthor]/hl7:assignedAuthor/hl7:representedOrganization/hl7:addr[not(@nullFlavor)]/*[not(@xsi:nil = 'true')][not(self::hl7:streetAddressLine | self::hl7:streetName | self::hl7:houseNumber | self::hl7:postalCode[not(@nullFlavor)] | self::hl7:city[not(@nullFlavor)] | self::hl7:state | self::hl7:country[not(@nullFlavor)] | self::hl7:additionalLocator)]"
         id="d5540730e66-true-d5540823e0">
      <assert role="error"
              see="http://elga.art-decor.org/elgaambbef-html-20230118T144941/tmp-1.2.40.0.34.6.0.11.3.47-2019-11-26T133351.html"
              test="not(.)">(atcdabbr_entry_FunctionalStatus)/d5540730e66-true-d5540823e0: '<value-of select="name(..)"/>' ist als geschlossen definiert und dieses Element '<name/>' ist nicht erlaubt oder nicht mit diesem Inhalt erlaubt. Dies kann templateId, code oder id betreffen. Erwartet:  hl7:streetAddressLine | hl7:streetName | hl7:houseNumber | hl7:postalCode[not(@nullFlavor)] | hl7:city[not(@nullFlavor)] | hl7:state | hl7:country[not(@nullFlavor)] | hl7:additionalLocator (rule-reference: d5540730e66-true-d5540823e0)</assert>
   </rule>

   <!-- Checking undefined contents for template/element @isClosed="true". Match context that we did not already match -->
   <rule fpi="RUL-QQQ"
         context="*[hl7:observation[hl7:templateId[@root = '1.2.40.0.34.6.0.11.3.47'] and hl7:templateId[@root = '2.16.840.1.113883.10.22.4.43']]]/hl7:observation[hl7:templateId[@root = '1.2.40.0.34.6.0.11.3.47'] and hl7:templateId[@root = '2.16.840.1.113883.10.22.4.43']]/hl7:informant/*[not(@xsi:nil = 'true')][not(self::hl7:assignedEntity | self::hl7:relatedEntity[@classCode = 'PRS'])]"
         id="d42e69685-true-d5540991e0">
      <assert role="error"
              see="http://elga.art-decor.org/elgaambbef-html-20230118T144941/tmp-1.2.40.0.34.6.0.11.3.47-2019-11-26T133351.html"
              test="not(.)">(atcdabbr_entry_FunctionalStatus)/d42e69685-true-d5540991e0: '<value-of select="name(..)"/>' ist als geschlossen definiert und dieses Element '<name/>' ist nicht erlaubt oder nicht mit diesem Inhalt erlaubt. Dies kann templateId, code oder id betreffen. Erwartet:  hl7:assignedEntity | hl7:relatedEntity[@classCode = 'PRS'] (rule-reference: d42e69685-true-d5540991e0)</assert>
   </rule>

   <!-- Checking undefined contents for template/element @isClosed="true". Match context that we did not already match -->
   <rule fpi="RUL-QQQ"
         context="*[hl7:observation[hl7:templateId[@root = '1.2.40.0.34.6.0.11.3.47'] and hl7:templateId[@root = '2.16.840.1.113883.10.22.4.43']]]/hl7:observation[hl7:templateId[@root = '1.2.40.0.34.6.0.11.3.47'] and hl7:templateId[@root = '2.16.840.1.113883.10.22.4.43']]/hl7:informant/hl7:assignedEntity/*[not(@xsi:nil = 'true')][not(self::hl7:id[not(@nullFlavor)] | self::hl7:id[@nullFlavor='NI'] | self::hl7:id[@nullFlavor='UNK'] | self::hl7:code | self::hl7:addr | self::hl7:telecom | self::hl7:assignedPerson | self::hl7:assignedPerson | self::hl7:representedOrganization)]"
         id="d5540868e5-true-d5541123e0">
      <assert role="error"
              see="http://elga.art-decor.org/elgaambbef-html-20230118T144941/tmp-1.2.40.0.34.6.0.11.3.47-2019-11-26T133351.html"
              test="not(.)">(atcdabbr_entry_FunctionalStatus)/d5540868e5-true-d5541123e0: '<value-of select="name(..)"/>' ist als geschlossen definiert und dieses Element '<name/>' ist nicht erlaubt oder nicht mit diesem Inhalt erlaubt. Dies kann templateId, code oder id betreffen. Erwartet:  hl7:id[not(@nullFlavor)] | hl7:id[@nullFlavor='NI'] | hl7:id[@nullFlavor='UNK'] | hl7:code | hl7:addr | hl7:telecom | hl7:assignedPerson | hl7:assignedPerson | hl7:representedOrganization (rule-reference: d5540868e5-true-d5541123e0)</assert>
   </rule>

   <!-- Checking undefined contents for template/element @isClosed="true". Match context that we did not already match -->
   <rule fpi="RUL-QQQ"
         context="*[hl7:observation[hl7:templateId[@root = '1.2.40.0.34.6.0.11.3.47'] and hl7:templateId[@root = '2.16.840.1.113883.10.22.4.43']]]/hl7:observation[hl7:templateId[@root = '1.2.40.0.34.6.0.11.3.47'] and hl7:templateId[@root = '2.16.840.1.113883.10.22.4.43']]/hl7:informant/hl7:assignedEntity/hl7:addr/*[not(@xsi:nil = 'true')][not(self::hl7:streetAddressLine | self::hl7:streetName | self::hl7:houseNumber | self::hl7:postalCode | self::hl7:city | self::hl7:state | self::hl7:country | self::hl7:additionalLocator)]"
         id="d5540996e50-true-d5541189e0">
      <assert role="error"
              see="http://elga.art-decor.org/elgaambbef-html-20230118T144941/tmp-1.2.40.0.34.6.0.11.3.47-2019-11-26T133351.html"
              test="not(.)">(atcdabbr_entry_FunctionalStatus)/d5540996e50-true-d5541189e0: '<value-of select="name(..)"/>' ist als geschlossen definiert und dieses Element '<name/>' ist nicht erlaubt oder nicht mit diesem Inhalt erlaubt. Dies kann templateId, code oder id betreffen. Erwartet:  hl7:streetAddressLine | hl7:streetName | hl7:houseNumber | hl7:postalCode | hl7:city | hl7:state | hl7:country | hl7:additionalLocator (rule-reference: d5540996e50-true-d5541189e0)</assert>
   </rule>

   <!-- Checking undefined contents for template/element @isClosed="true". Match context that we did not already match -->
   <rule fpi="RUL-QQQ"
         context="*[hl7:observation[hl7:templateId[@root = '1.2.40.0.34.6.0.11.3.47'] and hl7:templateId[@root = '2.16.840.1.113883.10.22.4.43']]]/hl7:observation[hl7:templateId[@root = '1.2.40.0.34.6.0.11.3.47'] and hl7:templateId[@root = '2.16.840.1.113883.10.22.4.43']]/hl7:informant/hl7:assignedEntity/hl7:assignedPerson/*[not(@xsi:nil = 'true')][not(self::hl7:name[not(@nullFlavor)])]"
         id="d5540996e120-true-d5541251e0">
      <assert role="error"
              see="http://elga.art-decor.org/elgaambbef-html-20230118T144941/tmp-1.2.40.0.34.6.0.11.3.47-2019-11-26T133351.html"
              test="not(.)">(atcdabbr_entry_FunctionalStatus)/d5540996e120-true-d5541251e0: '<value-of select="name(..)"/>' ist als geschlossen definiert und dieses Element '<name/>' ist nicht erlaubt oder nicht mit diesem Inhalt erlaubt. Dies kann templateId, code oder id betreffen. Erwartet:  hl7:name[not(@nullFlavor)] (rule-reference: d5540996e120-true-d5541251e0)</assert>
   </rule>

   <!-- Checking undefined contents for template/element @isClosed="true". Match context that we did not already match -->
   <rule fpi="RUL-QQQ"
         context="*[hl7:observation[hl7:templateId[@root = '1.2.40.0.34.6.0.11.3.47'] and hl7:templateId[@root = '2.16.840.1.113883.10.22.4.43']]]/hl7:observation[hl7:templateId[@root = '1.2.40.0.34.6.0.11.3.47'] and hl7:templateId[@root = '2.16.840.1.113883.10.22.4.43']]/hl7:informant/hl7:assignedEntity/hl7:assignedPerson/*[not(@xsi:nil = 'true')][not(self::hl7:name[not(@nullFlavor)])]"
         id="d5540996e132-true-d5541273e0">
      <assert role="error"
              see="http://elga.art-decor.org/elgaambbef-html-20230118T144941/tmp-1.2.40.0.34.6.0.11.3.47-2019-11-26T133351.html"
              test="not(.)">(atcdabbr_entry_FunctionalStatus)/d5540996e132-true-d5541273e0: '<value-of select="name(..)"/>' ist als geschlossen definiert und dieses Element '<name/>' ist nicht erlaubt oder nicht mit diesem Inhalt erlaubt. Dies kann templateId, code oder id betreffen. Erwartet:  hl7:name[not(@nullFlavor)] (rule-reference: d5540996e132-true-d5541273e0)</assert>
   </rule>

   <!-- Checking undefined contents for template/element @isClosed="true". Match context that we did not already match -->
   <rule fpi="RUL-QQQ"
         context="*[hl7:observation[hl7:templateId[@root = '1.2.40.0.34.6.0.11.3.47'] and hl7:templateId[@root = '2.16.840.1.113883.10.22.4.43']]]/hl7:observation[hl7:templateId[@root = '1.2.40.0.34.6.0.11.3.47'] and hl7:templateId[@root = '2.16.840.1.113883.10.22.4.43']]/hl7:informant/hl7:assignedEntity/hl7:assignedPerson/hl7:name[not(@nullFlavor)]/*[not(@xsi:nil = 'true')][not(self::hl7:prefix | self::hl7:family[not(@nullFlavor)] | self::hl7:given[not(@nullFlavor)] | self::hl7:suffix)]"
         id="d5541261e12-true-d5541302e0">
      <assert role="error"
              see="http://elga.art-decor.org/elgaambbef-html-20230118T144941/tmp-1.2.40.0.34.6.0.11.3.47-2019-11-26T133351.html"
              test="not(.)">(atcdabbr_entry_FunctionalStatus)/d5541261e12-true-d5541302e0: '<value-of select="name(..)"/>' ist als geschlossen definiert und dieses Element '<name/>' ist nicht erlaubt oder nicht mit diesem Inhalt erlaubt. Dies kann templateId, code oder id betreffen. Erwartet:  hl7:prefix | hl7:family[not(@nullFlavor)] | hl7:given[not(@nullFlavor)] | hl7:suffix (rule-reference: d5541261e12-true-d5541302e0)</assert>
   </rule>

   <!-- Checking undefined contents for template/element @isClosed="true". Match context that we did not already match -->
   <rule fpi="RUL-QQQ"
         context="*[hl7:observation[hl7:templateId[@root = '1.2.40.0.34.6.0.11.3.47'] and hl7:templateId[@root = '2.16.840.1.113883.10.22.4.43']]]/hl7:observation[hl7:templateId[@root = '1.2.40.0.34.6.0.11.3.47'] and hl7:templateId[@root = '2.16.840.1.113883.10.22.4.43']]/hl7:informant/hl7:assignedEntity/hl7:representedOrganization/*[not(@xsi:nil = 'true')][not(self::hl7:id[not(@nullFlavor)] | self::hl7:name[not(@nullFlavor)] | self::hl7:telecom[not(@nullFlavor)] | self::hl7:addr[not(@nullFlavor)])]"
         id="d5540996e143-true-d5541353e0">
      <assert role="error"
              see="http://elga.art-decor.org/elgaambbef-html-20230118T144941/tmp-1.2.40.0.34.6.0.11.3.47-2019-11-26T133351.html"
              test="not(.)">(atcdabbr_entry_FunctionalStatus)/d5540996e143-true-d5541353e0: '<value-of select="name(..)"/>' ist als geschlossen definiert und dieses Element '<name/>' ist nicht erlaubt oder nicht mit diesem Inhalt erlaubt. Dies kann templateId, code oder id betreffen. Erwartet:  hl7:id[not(@nullFlavor)] | hl7:name[not(@nullFlavor)] | hl7:telecom[not(@nullFlavor)] | hl7:addr[not(@nullFlavor)] (rule-reference: d5540996e143-true-d5541353e0)</assert>
   </rule>

   <!-- Checking undefined contents for template/element @isClosed="true". Match context that we did not already match -->
   <rule fpi="RUL-QQQ"
         context="*[hl7:observation[hl7:templateId[@root = '1.2.40.0.34.6.0.11.3.47'] and hl7:templateId[@root = '2.16.840.1.113883.10.22.4.43']]]/hl7:observation[hl7:templateId[@root = '1.2.40.0.34.6.0.11.3.47'] and hl7:templateId[@root = '2.16.840.1.113883.10.22.4.43']]/hl7:informant/hl7:assignedEntity/hl7:representedOrganization/hl7:addr[not(@nullFlavor)]/*[not(@xsi:nil = 'true')][not(self::hl7:streetAddressLine | self::hl7:streetName | self::hl7:houseNumber | self::hl7:postalCode | self::hl7:city | self::hl7:state | self::hl7:country | self::hl7:additionalLocator)]"
         id="d5541327e58-true-d5541414e0">
      <assert role="error"
              see="http://elga.art-decor.org/elgaambbef-html-20230118T144941/tmp-1.2.40.0.34.6.0.11.3.47-2019-11-26T133351.html"
              test="not(.)">(atcdabbr_entry_FunctionalStatus)/d5541327e58-true-d5541414e0: '<value-of select="name(..)"/>' ist als geschlossen definiert und dieses Element '<name/>' ist nicht erlaubt oder nicht mit diesem Inhalt erlaubt. Dies kann templateId, code oder id betreffen. Erwartet:  hl7:streetAddressLine | hl7:streetName | hl7:houseNumber | hl7:postalCode | hl7:city | hl7:state | hl7:country | hl7:additionalLocator (rule-reference: d5541327e58-true-d5541414e0)</assert>
   </rule>

   <!-- Checking undefined contents for template/element @isClosed="true". Match context that we did not already match -->
   <rule fpi="RUL-QQQ"
         context="*[hl7:observation[hl7:templateId[@root = '1.2.40.0.34.6.0.11.3.47'] and hl7:templateId[@root = '2.16.840.1.113883.10.22.4.43']]]/hl7:observation[hl7:templateId[@root = '1.2.40.0.34.6.0.11.3.47'] and hl7:templateId[@root = '2.16.840.1.113883.10.22.4.43']]/hl7:informant/hl7:relatedEntity[@classCode = 'PRS']/*[not(@xsi:nil = 'true')][not(self::hl7:code[not(@nullFlavor)] | self::hl7:addr[not(@nullFlavor)] | self::hl7:telecom[not(@nullFlavor)] | self::hl7:relatedPerson)]"
         id="d5540868e7-true-d5541491e0">
      <assert role="error"
              see="http://elga.art-decor.org/elgaambbef-html-20230118T144941/tmp-1.2.40.0.34.6.0.11.3.47-2019-11-26T133351.html"
              test="not(.)">(atcdabbr_entry_FunctionalStatus)/d5540868e7-true-d5541491e0: '<value-of select="name(..)"/>' ist als geschlossen definiert und dieses Element '<name/>' ist nicht erlaubt oder nicht mit diesem Inhalt erlaubt. Dies kann templateId, code oder id betreffen. Erwartet:  hl7:code[not(@nullFlavor)] | hl7:addr[not(@nullFlavor)] | hl7:telecom[not(@nullFlavor)] | hl7:relatedPerson (rule-reference: d5540868e7-true-d5541491e0)</assert>
   </rule>

   <!-- Checking undefined contents for template/element @isClosed="true". Match context that we did not already match -->
   <rule fpi="RUL-QQQ"
         context="*[hl7:observation[hl7:templateId[@root = '1.2.40.0.34.6.0.11.3.47'] and hl7:templateId[@root = '2.16.840.1.113883.10.22.4.43']]]/hl7:observation[hl7:templateId[@root = '1.2.40.0.34.6.0.11.3.47'] and hl7:templateId[@root = '2.16.840.1.113883.10.22.4.43']]/hl7:informant/hl7:relatedEntity[@classCode = 'PRS']/hl7:addr[not(@nullFlavor)]/*[not(@xsi:nil = 'true')][not(self::hl7:streetAddressLine | self::hl7:streetName | self::hl7:houseNumber | self::hl7:postalCode | self::hl7:city | self::hl7:state | self::hl7:country | self::hl7:additionalLocator)]"
         id="d5540868e16-true-d5541544e0">
      <assert role="error"
              see="http://elga.art-decor.org/elgaambbef-html-20230118T144941/tmp-1.2.40.0.34.6.0.11.3.47-2019-11-26T133351.html"
              test="not(.)">(atcdabbr_entry_FunctionalStatus)/d5540868e16-true-d5541544e0: '<value-of select="name(..)"/>' ist als geschlossen definiert und dieses Element '<name/>' ist nicht erlaubt oder nicht mit diesem Inhalt erlaubt. Dies kann templateId, code oder id betreffen. Erwartet:  hl7:streetAddressLine | hl7:streetName | hl7:houseNumber | hl7:postalCode | hl7:city | hl7:state | hl7:country | hl7:additionalLocator (rule-reference: d5540868e16-true-d5541544e0)</assert>
   </rule>

   <!-- Checking undefined contents for template/element @isClosed="true". Match context that we did not already match -->
   <rule fpi="RUL-QQQ"
         context="*[hl7:observation[hl7:templateId[@root = '1.2.40.0.34.6.0.11.3.47'] and hl7:templateId[@root = '2.16.840.1.113883.10.22.4.43']]]/hl7:observation[hl7:templateId[@root = '1.2.40.0.34.6.0.11.3.47'] and hl7:templateId[@root = '2.16.840.1.113883.10.22.4.43']]/hl7:informant/hl7:relatedEntity[@classCode = 'PRS']/hl7:relatedPerson/*[not(@xsi:nil = 'true')][not(self::hl7:name[not(@nullFlavor)] | self::hl7:name[@nullFlavor='UNK'] | self::hl7:name[@nullFlavor='MSK'])]"
         id="d5540868e20-true-d5541599e0">
      <assert role="error"
              see="http://elga.art-decor.org/elgaambbef-html-20230118T144941/tmp-1.2.40.0.34.6.0.11.3.47-2019-11-26T133351.html"
              test="not(.)">(atcdabbr_entry_FunctionalStatus)/d5540868e20-true-d5541599e0: '<value-of select="name(..)"/>' ist als geschlossen definiert und dieses Element '<name/>' ist nicht erlaubt oder nicht mit diesem Inhalt erlaubt. Dies kann templateId, code oder id betreffen. Erwartet:  hl7:name[not(@nullFlavor)] | hl7:name[@nullFlavor='UNK'] | hl7:name[@nullFlavor='MSK'] (rule-reference: d5540868e20-true-d5541599e0)</assert>
   </rule>

   <!-- Checking undefined contents for template/element @isClosed="true". Match context that we did not already match -->
   <rule fpi="RUL-QQQ"
         context="*[hl7:observation[hl7:templateId[@root = '1.2.40.0.34.6.0.11.3.47'] and hl7:templateId[@root = '2.16.840.1.113883.10.22.4.43']]]/hl7:observation[hl7:templateId[@root = '1.2.40.0.34.6.0.11.3.47'] and hl7:templateId[@root = '2.16.840.1.113883.10.22.4.43']]/hl7:informant/hl7:relatedEntity[@classCode = 'PRS']/hl7:relatedPerson/hl7:name[not(@nullFlavor)]/*[not(@xsi:nil = 'true')][not(self::hl7:prefix | self::hl7:family[not(@nullFlavor)] | self::hl7:given[not(@nullFlavor)] | self::hl7:suffix)]"
         id="d5541592e11-true-d5541626e0">
      <assert role="error"
              see="http://elga.art-decor.org/elgaambbef-html-20230118T144941/tmp-1.2.40.0.34.6.0.11.3.47-2019-11-26T133351.html"
              test="not(.)">(atcdabbr_entry_FunctionalStatus)/d5541592e11-true-d5541626e0: '<value-of select="name(..)"/>' ist als geschlossen definiert und dieses Element '<name/>' ist nicht erlaubt oder nicht mit diesem Inhalt erlaubt. Dies kann templateId, code oder id betreffen. Erwartet:  hl7:prefix | hl7:family[not(@nullFlavor)] | hl7:given[not(@nullFlavor)] | hl7:suffix (rule-reference: d5541592e11-true-d5541626e0)</assert>
   </rule>

   <!-- Checking undefined contents for template/element @isClosed="true". Match context that we did not already match -->
   <rule fpi="RUL-QQQ"
         context="*[hl7:observation[hl7:templateId[@root = '1.2.40.0.34.6.0.11.3.47'] and hl7:templateId[@root = '2.16.840.1.113883.10.22.4.43']]]/hl7:observation[hl7:templateId[@root = '1.2.40.0.34.6.0.11.3.47'] and hl7:templateId[@root = '2.16.840.1.113883.10.22.4.43']]/hl7:reference[hl7:externalDocument[hl7:templateId[@root = '1.2.40.0.34.6.0.11.3.14']]]/*[not(@xsi:nil = 'true')][not(self::hl7:externalDocument[hl7:templateId[@root = '1.2.40.0.34.6.0.11.3.14']])]"
         id="d42e69687-true-d5541680e0">
      <assert role="error"
              see="http://elga.art-decor.org/elgaambbef-html-20230118T144941/tmp-1.2.40.0.34.6.0.11.3.47-2019-11-26T133351.html"
              test="not(.)">(atcdabbr_entry_FunctionalStatus)/d42e69687-true-d5541680e0: '<value-of select="name(..)"/>' ist als geschlossen definiert und dieses Element '<name/>' ist nicht erlaubt oder nicht mit diesem Inhalt erlaubt. Dies kann templateId, code oder id betreffen. Erwartet:  hl7:externalDocument[hl7:templateId[@root = '1.2.40.0.34.6.0.11.3.14']] (rule-reference: d42e69687-true-d5541680e0)</assert>
   </rule>

   <!-- Checking undefined contents for template/element @isClosed="true". Match context that we did not already match -->
   <rule fpi="RUL-QQQ"
         context="*[hl7:observation[hl7:templateId[@root = '1.2.40.0.34.6.0.11.3.47'] and hl7:templateId[@root = '2.16.840.1.113883.10.22.4.43']]]/hl7:observation[hl7:templateId[@root = '1.2.40.0.34.6.0.11.3.47'] and hl7:templateId[@root = '2.16.840.1.113883.10.22.4.43']]/hl7:reference[hl7:externalDocument[hl7:templateId[@root = '1.2.40.0.34.6.0.11.3.14']]]/hl7:externalDocument[hl7:templateId[@root = '1.2.40.0.34.6.0.11.3.14']]/*[not(@xsi:nil = 'true')][not(self::hl7:templateId[@root = '1.2.40.0.34.6.0.11.3.14'] | self::hl7:id[not(@nullFlavor)] | self::hl7:code | self::hl7:text | self::hl7:setId[not(@nullFlavor)] | self::hl7:versionNumber[not(@nullFlavor)])]"
         id="d5541664e1-true-d5541713e0">
      <assert role="error"
              see="http://elga.art-decor.org/elgaambbef-html-20230118T144941/tmp-1.2.40.0.34.6.0.11.3.47-2019-11-26T133351.html"
              test="not(.)">(atcdabbr_entry_FunctionalStatus)/d5541664e1-true-d5541713e0: '<value-of select="name(..)"/>' ist als geschlossen definiert und dieses Element '<name/>' ist nicht erlaubt oder nicht mit diesem Inhalt erlaubt. Dies kann templateId, code oder id betreffen. Erwartet:  hl7:templateId[@root = '1.2.40.0.34.6.0.11.3.14'] | hl7:id[not(@nullFlavor)] | hl7:code | hl7:text | hl7:setId[not(@nullFlavor)] | hl7:versionNumber[not(@nullFlavor)] (rule-reference: d5541664e1-true-d5541713e0)</assert>
   </rule>

   <!-- Checking undefined contents for template/element @isClosed="true". Match context that we did not already match -->
   <rule fpi="RUL-QQQ"
         context="*[hl7:observation[hl7:templateId[@root = '1.2.40.0.34.6.0.11.3.47'] and hl7:templateId[@root = '2.16.840.1.113883.10.22.4.43']]]/hl7:observation[hl7:templateId[@root = '1.2.40.0.34.6.0.11.3.47'] and hl7:templateId[@root = '2.16.840.1.113883.10.22.4.43']]/hl7:reference[hl7:externalDocument[hl7:templateId[@root = '1.2.40.0.34.6.0.11.3.14']]]/hl7:externalDocument[hl7:templateId[@root = '1.2.40.0.34.6.0.11.3.14']]/hl7:text/*[not(@xsi:nil = 'true')][not(self::hl7:reference[not(@nullFlavor)])]"
         id="d5541733e54-true-d5541745e0">
      <assert role="error"
              see="http://elga.art-decor.org/elgaambbef-html-20230118T144941/tmp-1.2.40.0.34.6.0.11.9.1-2021-05-06T093820.html"
              test="not(.)">(atcdabrr_other_NarrativeTextReference)/d5541733e54-true-d5541745e0: '<value-of select="name(..)"/>' ist als geschlossen definiert und dieses Element '<name/>' ist nicht erlaubt oder nicht mit diesem Inhalt erlaubt. Dies kann templateId, code oder id betreffen. Erwartet:  hl7:reference[not(@nullFlavor)] (rule-reference: d5541733e54-true-d5541745e0)</assert>
   </rule>
</pattern>
