<?xml version="1.0" encoding="UTF-8"?>
<!--
Template derived pattern
===========================================
ID: 1.2.40.0.34.6.0.11.3.35
Name: Criticality Observation
Description: 
-->
<pattern xmlns="http://purl.oclc.org/dsdl/schematron"
         id="template-1.2.40.0.34.6.0.11.3.35-2021-06-28T134402-closed">
   <title>Criticality Observation</title>

   <!-- Checking undefined contents for template/element @isClosed="true". Match context that we did not already match -->
   <rule fpi="RUL-QQQ"
         context="*[hl7:observation[hl7:templateId[@root = '1.2.40.0.34.6.0.11.3.35'] and hl7:templateId[@root = '2.16.840.1.113883.10.22.4.18']]]/*[not(@xsi:nil = 'true')][not(self::hl7:observation[hl7:templateId[@root = '1.2.40.0.34.6.0.11.3.35'] and hl7:templateId[@root = '2.16.840.1.113883.10.22.4.18']])]"
         id="d42e65098-true-d5431357e0">
      <assert role="error"
              see="http://elga.art-decor.org/elgaambbef-html-20230118T144941/tmp-1.2.40.0.34.6.0.11.3.35-2021-06-28T134402.html"
              test="not(.)">(atcdabbr_entry_CriticalityObservation)/d42e65098-true-d5431357e0: '<value-of select="name(..)"/>' ist als geschlossen definiert und dieses Element '<name/>' ist nicht erlaubt oder nicht mit diesem Inhalt erlaubt. Dies kann templateId, code oder id betreffen. Erwartet:  hl7:observation[hl7:templateId[@root = '1.2.40.0.34.6.0.11.3.35'] and hl7:templateId[@root = '2.16.840.1.113883.10.22.4.18']] (rule-reference: d42e65098-true-d5431357e0)</assert>
   </rule>

   <!-- Checking undefined contents for template/element @isClosed="true". Match context that we did not already match -->
   <rule fpi="RUL-QQQ"
         context="*[hl7:observation[hl7:templateId[@root = '1.2.40.0.34.6.0.11.3.35'] and hl7:templateId[@root = '2.16.840.1.113883.10.22.4.18']]]/hl7:observation[hl7:templateId[@root = '1.2.40.0.34.6.0.11.3.35'] and hl7:templateId[@root = '2.16.840.1.113883.10.22.4.18']]/*[not(@xsi:nil = 'true')][not(self::hl7:templateId[@root = '1.2.40.0.34.6.0.11.3.35'] | self::hl7:templateId[@root = '2.16.840.1.113883.10.22.4.18'] | self::hl7:code[(@code = '82606-5' and @codeSystem = '2.16.840.1.113883.6.1')] | self::hl7:text | self::hl7:statusCode[@code = 'completed'] | self::hl7:value[concat(@code, @codeSystem) = doc('include/voc-1.2.40.0.34.10.182-DYNAMIC.xml')//valueSet[1]/conceptList/concept/concat(@code, @codeSystem)])]"
         id="d42e65137-true-d5431413e0">
      <assert role="error"
              see="http://elga.art-decor.org/elgaambbef-html-20230118T144941/tmp-1.2.40.0.34.6.0.11.3.35-2021-06-28T134402.html"
              test="not(.)">(atcdabbr_entry_CriticalityObservation)/d42e65137-true-d5431413e0: '<value-of select="name(..)"/>' ist als geschlossen definiert und dieses Element '<name/>' ist nicht erlaubt oder nicht mit diesem Inhalt erlaubt. Dies kann templateId, code oder id betreffen. Erwartet:  hl7:templateId[@root = '1.2.40.0.34.6.0.11.3.35'] | hl7:templateId[@root = '2.16.840.1.113883.10.22.4.18'] | hl7:code[(@code = '82606-5' and @codeSystem = '2.16.840.1.113883.6.1')] | hl7:text | hl7:statusCode[@code = 'completed'] | hl7:value[concat(@code, @codeSystem) = doc('include/voc-1.2.40.0.34.10.182-DYNAMIC.xml')//valueSet[1]/conceptList/concept/concat(@code, @codeSystem)] (rule-reference: d42e65137-true-d5431413e0)</assert>
   </rule>

   <!-- Checking undefined contents for template/element @isClosed="true". Match context that we did not already match -->
   <rule fpi="RUL-QQQ"
         context="*[hl7:observation[hl7:templateId[@root = '1.2.40.0.34.6.0.11.3.35'] and hl7:templateId[@root = '2.16.840.1.113883.10.22.4.18']]]/hl7:observation[hl7:templateId[@root = '1.2.40.0.34.6.0.11.3.35'] and hl7:templateId[@root = '2.16.840.1.113883.10.22.4.18']]/hl7:text/*[not(@xsi:nil = 'true')][not(self::hl7:reference[not(@nullFlavor)])]"
         id="d5431435e54-true-d5431447e0">
      <assert role="error"
              see="http://elga.art-decor.org/elgaambbef-html-20230118T144941/tmp-1.2.40.0.34.6.0.11.9.1-2021-05-06T093820.html"
              test="not(.)">(atcdabrr_other_NarrativeTextReference)/d5431435e54-true-d5431447e0: '<value-of select="name(..)"/>' ist als geschlossen definiert und dieses Element '<name/>' ist nicht erlaubt oder nicht mit diesem Inhalt erlaubt. Dies kann templateId, code oder id betreffen. Erwartet:  hl7:reference[not(@nullFlavor)] (rule-reference: d5431435e54-true-d5431447e0)</assert>
   </rule>
</pattern>
