<?xml version="1.0" encoding="UTF-8"?>
<!--
Template derived pattern
===========================================
ID: 1.2.40.0.34.11.13.3.7
Name: abgeschlossenes Gesundheitsproblem Entry
Description: Entry zur Dokumentation von abgeschlossenen Gesundheitsproblemen
-->
<pattern xmlns="http://purl.oclc.org/dsdl/schematron"
         id="template-1.2.40.0.34.11.13.3.7-2017-01-26T143515">
   <title>abgeschlossenes Gesundheitsproblem Entry</title>
   <!--
Template derived rules for ID: 1.2.40.0.34.11.13.3.7
Context: *[hl7:act[hl7:templateId[@root = '1.2.40.0.34.11.13.3.7'] and hl7:templateId[@root = '1.2.40.0.34.11.2.3.1'] and hl7:templateId[@root = '1.2.40.0.34.11.1.3.5'] and hl7:templateId[@root = '1.3.6.1.4.1.19376.1.5.3.1.4.5.1'] and hl7:templateId[@root = '1.3.6.1.4.1.19376.1.5.3.1.4.5.2'] and hl7:templateId[@root = '2.16.840.1.113883.10.20.1.27']]]
Item: (ProblemEntryGesundheitsproblem)
-->

   <!--
Template derived rules for ID: 1.2.40.0.34.11.13.3.7
Context: *[hl7:act[hl7:templateId[@root = '1.2.40.0.34.11.13.3.7'] and hl7:templateId[@root = '1.2.40.0.34.11.2.3.1'] and hl7:templateId[@root = '1.2.40.0.34.11.1.3.5'] and hl7:templateId[@root = '1.3.6.1.4.1.19376.1.5.3.1.4.5.1'] and hl7:templateId[@root = '1.3.6.1.4.1.19376.1.5.3.1.4.5.2'] and hl7:templateId[@root = '2.16.840.1.113883.10.20.1.27']]]/hl7:act[hl7:templateId[@root = '1.2.40.0.34.11.13.3.7'] and hl7:templateId[@root = '1.2.40.0.34.11.2.3.1'] and hl7:templateId[@root = '1.2.40.0.34.11.1.3.5'] and hl7:templateId[@root = '1.3.6.1.4.1.19376.1.5.3.1.4.5.1'] and hl7:templateId[@root = '1.3.6.1.4.1.19376.1.5.3.1.4.5.2'] and hl7:templateId[@root = '2.16.840.1.113883.10.20.1.27']]
Item: (ProblemEntryGesundheitsproblem)
-->

   <rule fpi="RULC-1"
         context="*[hl7:act[hl7:templateId[@root = '1.2.40.0.34.11.13.3.7'] and hl7:templateId[@root = '1.2.40.0.34.11.2.3.1'] and hl7:templateId[@root = '1.2.40.0.34.11.1.3.5'] and hl7:templateId[@root = '1.3.6.1.4.1.19376.1.5.3.1.4.5.1'] and hl7:templateId[@root = '1.3.6.1.4.1.19376.1.5.3.1.4.5.2'] and hl7:templateId[@root = '2.16.840.1.113883.10.20.1.27']]]/hl7:act[hl7:templateId[@root = '1.2.40.0.34.11.13.3.7'] and hl7:templateId[@root = '1.2.40.0.34.11.2.3.1'] and hl7:templateId[@root = '1.2.40.0.34.11.1.3.5'] and hl7:templateId[@root = '1.3.6.1.4.1.19376.1.5.3.1.4.5.1'] and hl7:templateId[@root = '1.3.6.1.4.1.19376.1.5.3.1.4.5.2'] and hl7:templateId[@root = '2.16.840.1.113883.10.20.1.27']]"
         id="d42e1661-false-d7812e0">
      <assert role="error"
              see="http://elga.art-decor.org/elgaambbef-html-20230118T144941/tmp-1.2.40.0.34.11.13.3.7-2017-01-26T143515.html"
              test="string(@classCode) = ('ACT')">(ProblemEntryGesundheitsproblem): Der Wert von classCode MUSS 'ACT' sein. Gefunden: "<value-of select="@classCode"/>"</assert>
      <assert role="error"
              see="http://elga.art-decor.org/elgaambbef-html-20230118T144941/tmp-1.2.40.0.34.11.13.3.7-2017-01-26T143515.html"
              test="string(@moodCode) = ('EVN')">(ProblemEntryGesundheitsproblem): Der Wert von moodCode MUSS 'EVN' sein. Gefunden: "<value-of select="@moodCode"/>"</assert>
      <assert role="error"
              see="http://elga.art-decor.org/elgaambbef-html-20230118T144941/tmp-1.2.40.0.34.11.13.3.7-2017-01-26T143515.html"
              test="count(hl7:templateId[@root = '1.2.40.0.34.11.13.3.7']) &gt;= 1">(ProblemEntryGesundheitsproblem): Element hl7:templateId[@root = '1.2.40.0.34.11.13.3.7'] ist mandatory [min 1x].</assert>
      <assert role="error"
              see="http://elga.art-decor.org/elgaambbef-html-20230118T144941/tmp-1.2.40.0.34.11.13.3.7-2017-01-26T143515.html"
              test="count(hl7:templateId[@root = '1.2.40.0.34.11.13.3.7']) &lt;= 1">(ProblemEntryGesundheitsproblem): Element hl7:templateId[@root = '1.2.40.0.34.11.13.3.7'] kommt zu häufig vor [max 1x].</assert>
      <assert role="error"
              see="http://elga.art-decor.org/elgaambbef-html-20230118T144941/tmp-1.2.40.0.34.11.13.3.7-2017-01-26T143515.html"
              test="count(hl7:templateId[@root = '1.2.40.0.34.11.2.3.1']) &gt;= 1">(ProblemEntryGesundheitsproblem): Element hl7:templateId[@root = '1.2.40.0.34.11.2.3.1'] ist required [min 1x].</assert>
      <assert role="error"
              see="http://elga.art-decor.org/elgaambbef-html-20230118T144941/tmp-1.2.40.0.34.11.13.3.7-2017-01-26T143515.html"
              test="count(hl7:templateId[@root = '1.2.40.0.34.11.2.3.1']) &lt;= 1">(ProblemEntryGesundheitsproblem): Element hl7:templateId[@root = '1.2.40.0.34.11.2.3.1'] kommt zu häufig vor [max 1x].</assert>
      <assert role="error"
              see="http://elga.art-decor.org/elgaambbef-html-20230118T144941/tmp-1.2.40.0.34.11.13.3.7-2017-01-26T143515.html"
              test="count(hl7:templateId[@root = '1.2.40.0.34.11.1.3.5']) &gt;= 1">(ProblemEntryGesundheitsproblem): Element hl7:templateId[@root = '1.2.40.0.34.11.1.3.5'] ist required [min 1x].</assert>
      <assert role="error"
              see="http://elga.art-decor.org/elgaambbef-html-20230118T144941/tmp-1.2.40.0.34.11.13.3.7-2017-01-26T143515.html"
              test="count(hl7:templateId[@root = '1.2.40.0.34.11.1.3.5']) &lt;= 1">(ProblemEntryGesundheitsproblem): Element hl7:templateId[@root = '1.2.40.0.34.11.1.3.5'] kommt zu häufig vor [max 1x].</assert>
      <assert role="error"
              see="http://elga.art-decor.org/elgaambbef-html-20230118T144941/tmp-1.2.40.0.34.11.13.3.7-2017-01-26T143515.html"
              test="count(hl7:templateId[@root = '1.3.6.1.4.1.19376.1.5.3.1.4.5.1']) &gt;= 1">(ProblemEntryGesundheitsproblem): Element hl7:templateId[@root = '1.3.6.1.4.1.19376.1.5.3.1.4.5.1'] ist required [min 1x].</assert>
      <assert role="error"
              see="http://elga.art-decor.org/elgaambbef-html-20230118T144941/tmp-1.2.40.0.34.11.13.3.7-2017-01-26T143515.html"
              test="count(hl7:templateId[@root = '1.3.6.1.4.1.19376.1.5.3.1.4.5.1']) &lt;= 1">(ProblemEntryGesundheitsproblem): Element hl7:templateId[@root = '1.3.6.1.4.1.19376.1.5.3.1.4.5.1'] kommt zu häufig vor [max 1x].</assert>
      <assert role="error"
              see="http://elga.art-decor.org/elgaambbef-html-20230118T144941/tmp-1.2.40.0.34.11.13.3.7-2017-01-26T143515.html"
              test="count(hl7:templateId[@root = '1.3.6.1.4.1.19376.1.5.3.1.4.5.2']) &gt;= 1">(ProblemEntryGesundheitsproblem): Element hl7:templateId[@root = '1.3.6.1.4.1.19376.1.5.3.1.4.5.2'] ist required [min 1x].</assert>
      <assert role="error"
              see="http://elga.art-decor.org/elgaambbef-html-20230118T144941/tmp-1.2.40.0.34.11.13.3.7-2017-01-26T143515.html"
              test="count(hl7:templateId[@root = '1.3.6.1.4.1.19376.1.5.3.1.4.5.2']) &lt;= 1">(ProblemEntryGesundheitsproblem): Element hl7:templateId[@root = '1.3.6.1.4.1.19376.1.5.3.1.4.5.2'] kommt zu häufig vor [max 1x].</assert>
      <assert role="error"
              see="http://elga.art-decor.org/elgaambbef-html-20230118T144941/tmp-1.2.40.0.34.11.13.3.7-2017-01-26T143515.html"
              test="count(hl7:templateId[@root = '2.16.840.1.113883.10.20.1.27']) &gt;= 1">(ProblemEntryGesundheitsproblem): Element hl7:templateId[@root = '2.16.840.1.113883.10.20.1.27'] ist required [min 1x].</assert>
      <assert role="error"
              see="http://elga.art-decor.org/elgaambbef-html-20230118T144941/tmp-1.2.40.0.34.11.13.3.7-2017-01-26T143515.html"
              test="count(hl7:templateId[@root = '2.16.840.1.113883.10.20.1.27']) &lt;= 1">(ProblemEntryGesundheitsproblem): Element hl7:templateId[@root = '2.16.840.1.113883.10.20.1.27'] kommt zu häufig vor [max 1x].</assert>
      <assert role="error"
              see="http://elga.art-decor.org/elgaambbef-html-20230118T144941/tmp-1.2.40.0.34.11.13.3.7-2017-01-26T143515.html"
              test="count(hl7:id) &gt;= 1">(ProblemEntryGesundheitsproblem): Element hl7:id ist required [min 1x].</assert>
      <assert role="error"
              see="http://elga.art-decor.org/elgaambbef-html-20230118T144941/tmp-1.2.40.0.34.11.13.3.7-2017-01-26T143515.html"
              test="count(hl7:id) &lt;= 1">(ProblemEntryGesundheitsproblem): Element hl7:id kommt zu häufig vor [max 1x].</assert>
      <assert role="error"
              see="http://elga.art-decor.org/elgaambbef-html-20230118T144941/tmp-1.2.40.0.34.11.13.3.7-2017-01-26T143515.html"
              test="count(hl7:code[@nullFlavor = 'NA']) &gt;= 1">(ProblemEntryGesundheitsproblem): Element hl7:code[@nullFlavor = 'NA'] ist required [min 1x].</assert>
      <assert role="error"
              see="http://elga.art-decor.org/elgaambbef-html-20230118T144941/tmp-1.2.40.0.34.11.13.3.7-2017-01-26T143515.html"
              test="count(hl7:code[@nullFlavor = 'NA']) &lt;= 1">(ProblemEntryGesundheitsproblem): Element hl7:code[@nullFlavor = 'NA'] kommt zu häufig vor [max 1x].</assert>
      <assert role="error"
              see="http://elga.art-decor.org/elgaambbef-html-20230118T144941/tmp-1.2.40.0.34.11.13.3.7-2017-01-26T143515.html"
              test="count(hl7:statusCode[@code = 'completed']) &gt;= 1">(ProblemEntryGesundheitsproblem): Element hl7:statusCode[@code = 'completed'] ist mandatory [min 1x].</assert>
      <assert role="error"
              see="http://elga.art-decor.org/elgaambbef-html-20230118T144941/tmp-1.2.40.0.34.11.13.3.7-2017-01-26T143515.html"
              test="count(hl7:statusCode[@code = 'completed']) &lt;= 1">(ProblemEntryGesundheitsproblem): Element hl7:statusCode[@code = 'completed'] kommt zu häufig vor [max 1x].</assert>
      <assert role="error"
              see="http://elga.art-decor.org/elgaambbef-html-20230118T144941/tmp-1.2.40.0.34.11.13.3.7-2017-01-26T143515.html"
              test="count(hl7:effectiveTime[hl7:low]) &gt;= 1">(ProblemEntryGesundheitsproblem): Element hl7:effectiveTime[hl7:low] ist required [min 1x].</assert>
      <assert role="error"
              see="http://elga.art-decor.org/elgaambbef-html-20230118T144941/tmp-1.2.40.0.34.11.13.3.7-2017-01-26T143515.html"
              test="count(hl7:effectiveTime[hl7:low]) &lt;= 1">(ProblemEntryGesundheitsproblem): Element hl7:effectiveTime[hl7:low] kommt zu häufig vor [max 1x].</assert>
      <assert role="error"
              see="http://elga.art-decor.org/elgaambbef-html-20230118T144941/tmp-1.2.40.0.34.11.13.3.7-2017-01-26T143515.html"
              test="count(hl7:entryRelationship[hl7:observation[hl7:templateId[@root = '1.2.40.0.34.11.1.3.6'] and hl7:templateId[@root = '1.3.6.1.4.1.19376.1.5.3.1.4.5'] and hl7:templateId[@root = '2.16.840.1.113883.10.20.1.28']]]) &gt;= 1">(ProblemEntryGesundheitsproblem): Element hl7:entryRelationship[hl7:observation[hl7:templateId[@root = '1.2.40.0.34.11.1.3.6'] and hl7:templateId[@root = '1.3.6.1.4.1.19376.1.5.3.1.4.5'] and hl7:templateId[@root = '2.16.840.1.113883.10.20.1.28']]] ist mandatory [min 1x].</assert>
      <assert role="error"
              see="http://elga.art-decor.org/elgaambbef-html-20230118T144941/tmp-1.2.40.0.34.11.13.3.7-2017-01-26T143515.html"
              test="count(hl7:entryRelationship[hl7:observation[hl7:templateId[@root = '1.2.40.0.34.11.1.3.6'] and hl7:templateId[@root = '1.3.6.1.4.1.19376.1.5.3.1.4.5'] and hl7:templateId[@root = '2.16.840.1.113883.10.20.1.28']]]) &lt;= 1">(ProblemEntryGesundheitsproblem): Element hl7:entryRelationship[hl7:observation[hl7:templateId[@root = '1.2.40.0.34.11.1.3.6'] and hl7:templateId[@root = '1.3.6.1.4.1.19376.1.5.3.1.4.5'] and hl7:templateId[@root = '2.16.840.1.113883.10.20.1.28']]] kommt zu häufig vor [max 1x].</assert>
   </rule>
   <!--
Template derived rules for ID: 1.2.40.0.34.11.13.3.7
Context: *[hl7:act[hl7:templateId[@root = '1.2.40.0.34.11.13.3.7'] and hl7:templateId[@root = '1.2.40.0.34.11.2.3.1'] and hl7:templateId[@root = '1.2.40.0.34.11.1.3.5'] and hl7:templateId[@root = '1.3.6.1.4.1.19376.1.5.3.1.4.5.1'] and hl7:templateId[@root = '1.3.6.1.4.1.19376.1.5.3.1.4.5.2'] and hl7:templateId[@root = '2.16.840.1.113883.10.20.1.27']]]/hl7:act[hl7:templateId[@root = '1.2.40.0.34.11.13.3.7'] and hl7:templateId[@root = '1.2.40.0.34.11.2.3.1'] and hl7:templateId[@root = '1.2.40.0.34.11.1.3.5'] and hl7:templateId[@root = '1.3.6.1.4.1.19376.1.5.3.1.4.5.1'] and hl7:templateId[@root = '1.3.6.1.4.1.19376.1.5.3.1.4.5.2'] and hl7:templateId[@root = '2.16.840.1.113883.10.20.1.27']]/hl7:templateId[@root = '1.2.40.0.34.11.13.3.7']
Item: (ProblemEntryGesundheitsproblem)
-->

   <rule fpi="RULC-1"
         context="*[hl7:act[hl7:templateId[@root = '1.2.40.0.34.11.13.3.7'] and hl7:templateId[@root = '1.2.40.0.34.11.2.3.1'] and hl7:templateId[@root = '1.2.40.0.34.11.1.3.5'] and hl7:templateId[@root = '1.3.6.1.4.1.19376.1.5.3.1.4.5.1'] and hl7:templateId[@root = '1.3.6.1.4.1.19376.1.5.3.1.4.5.2'] and hl7:templateId[@root = '2.16.840.1.113883.10.20.1.27']]]/hl7:act[hl7:templateId[@root = '1.2.40.0.34.11.13.3.7'] and hl7:templateId[@root = '1.2.40.0.34.11.2.3.1'] and hl7:templateId[@root = '1.2.40.0.34.11.1.3.5'] and hl7:templateId[@root = '1.3.6.1.4.1.19376.1.5.3.1.4.5.1'] and hl7:templateId[@root = '1.3.6.1.4.1.19376.1.5.3.1.4.5.2'] and hl7:templateId[@root = '2.16.840.1.113883.10.20.1.27']]/hl7:templateId[@root = '1.2.40.0.34.11.13.3.7']"
         id="d42e1667-false-d7930e0">
      <extends rule="II"/>
      <assert role="error"
              see="http://elga.art-decor.org/elgaambbef-html-20230118T144941/tmp-1.2.40.0.34.11.13.3.7-2017-01-26T143515.html"
              test="empty(@xsi:type) or resolve-QName(@xsi:type, .) = QName('urn:hl7-org:v3', 'II')">(ProblemEntryGesundheitsproblem): Wenn eine @xsi:type Instruktion anwesend ist MUSS diese den Wert "{urn:hl7-org:v3}:II" haben. Gefunden "{<value-of select="namespace-uri-from-QName(resolve-QName(@xsi:type,.))"/>}:<value-of select="local-name-from-QName(resolve-QName(@xsi:type,.))"/>"</assert>
      <assert role="error"
              see="http://elga.art-decor.org/elgaambbef-html-20230118T144941/tmp-1.2.40.0.34.11.13.3.7-2017-01-26T143515.html"
              test="string(@root) = ('1.2.40.0.34.11.13.3.7')">(ProblemEntryGesundheitsproblem): Der Wert von root MUSS '1.2.40.0.34.11.13.3.7' sein. Gefunden: "<value-of select="@root"/>"</assert>
   </rule>
   <!--
Template derived rules for ID: 1.2.40.0.34.11.13.3.7
Context: *[hl7:act[hl7:templateId[@root = '1.2.40.0.34.11.13.3.7'] and hl7:templateId[@root = '1.2.40.0.34.11.2.3.1'] and hl7:templateId[@root = '1.2.40.0.34.11.1.3.5'] and hl7:templateId[@root = '1.3.6.1.4.1.19376.1.5.3.1.4.5.1'] and hl7:templateId[@root = '1.3.6.1.4.1.19376.1.5.3.1.4.5.2'] and hl7:templateId[@root = '2.16.840.1.113883.10.20.1.27']]]/hl7:act[hl7:templateId[@root = '1.2.40.0.34.11.13.3.7'] and hl7:templateId[@root = '1.2.40.0.34.11.2.3.1'] and hl7:templateId[@root = '1.2.40.0.34.11.1.3.5'] and hl7:templateId[@root = '1.3.6.1.4.1.19376.1.5.3.1.4.5.1'] and hl7:templateId[@root = '1.3.6.1.4.1.19376.1.5.3.1.4.5.2'] and hl7:templateId[@root = '2.16.840.1.113883.10.20.1.27']]/hl7:templateId[@root = '1.2.40.0.34.11.2.3.1']
Item: (ProblemEntryGesundheitsproblem)
-->

   <rule fpi="RULC-1"
         context="*[hl7:act[hl7:templateId[@root = '1.2.40.0.34.11.13.3.7'] and hl7:templateId[@root = '1.2.40.0.34.11.2.3.1'] and hl7:templateId[@root = '1.2.40.0.34.11.1.3.5'] and hl7:templateId[@root = '1.3.6.1.4.1.19376.1.5.3.1.4.5.1'] and hl7:templateId[@root = '1.3.6.1.4.1.19376.1.5.3.1.4.5.2'] and hl7:templateId[@root = '2.16.840.1.113883.10.20.1.27']]]/hl7:act[hl7:templateId[@root = '1.2.40.0.34.11.13.3.7'] and hl7:templateId[@root = '1.2.40.0.34.11.2.3.1'] and hl7:templateId[@root = '1.2.40.0.34.11.1.3.5'] and hl7:templateId[@root = '1.3.6.1.4.1.19376.1.5.3.1.4.5.1'] and hl7:templateId[@root = '1.3.6.1.4.1.19376.1.5.3.1.4.5.2'] and hl7:templateId[@root = '2.16.840.1.113883.10.20.1.27']]/hl7:templateId[@root = '1.2.40.0.34.11.2.3.1']"
         id="d42e1672-false-d7945e0">
      <extends rule="II"/>
      <assert role="error"
              see="http://elga.art-decor.org/elgaambbef-html-20230118T144941/tmp-1.2.40.0.34.11.13.3.7-2017-01-26T143515.html"
              test="empty(@xsi:type) or resolve-QName(@xsi:type, .) = QName('urn:hl7-org:v3', 'II')">(ProblemEntryGesundheitsproblem): Wenn eine @xsi:type Instruktion anwesend ist MUSS diese den Wert "{urn:hl7-org:v3}:II" haben. Gefunden "{<value-of select="namespace-uri-from-QName(resolve-QName(@xsi:type,.))"/>}:<value-of select="local-name-from-QName(resolve-QName(@xsi:type,.))"/>"</assert>
      <assert role="error"
              see="http://elga.art-decor.org/elgaambbef-html-20230118T144941/tmp-1.2.40.0.34.11.13.3.7-2017-01-26T143515.html"
              test="string(@root) = ('1.2.40.0.34.11.2.3.1')">(ProblemEntryGesundheitsproblem): Der Wert von root MUSS '1.2.40.0.34.11.2.3.1' sein. Gefunden: "<value-of select="@root"/>"</assert>
   </rule>
   <!--
Template derived rules for ID: 1.2.40.0.34.11.13.3.7
Context: *[hl7:act[hl7:templateId[@root = '1.2.40.0.34.11.13.3.7'] and hl7:templateId[@root = '1.2.40.0.34.11.2.3.1'] and hl7:templateId[@root = '1.2.40.0.34.11.1.3.5'] and hl7:templateId[@root = '1.3.6.1.4.1.19376.1.5.3.1.4.5.1'] and hl7:templateId[@root = '1.3.6.1.4.1.19376.1.5.3.1.4.5.2'] and hl7:templateId[@root = '2.16.840.1.113883.10.20.1.27']]]/hl7:act[hl7:templateId[@root = '1.2.40.0.34.11.13.3.7'] and hl7:templateId[@root = '1.2.40.0.34.11.2.3.1'] and hl7:templateId[@root = '1.2.40.0.34.11.1.3.5'] and hl7:templateId[@root = '1.3.6.1.4.1.19376.1.5.3.1.4.5.1'] and hl7:templateId[@root = '1.3.6.1.4.1.19376.1.5.3.1.4.5.2'] and hl7:templateId[@root = '2.16.840.1.113883.10.20.1.27']]/hl7:templateId[@root = '1.2.40.0.34.11.1.3.5']
Item: (ProblemEntryGesundheitsproblem)
-->

   <rule fpi="RULC-1"
         context="*[hl7:act[hl7:templateId[@root = '1.2.40.0.34.11.13.3.7'] and hl7:templateId[@root = '1.2.40.0.34.11.2.3.1'] and hl7:templateId[@root = '1.2.40.0.34.11.1.3.5'] and hl7:templateId[@root = '1.3.6.1.4.1.19376.1.5.3.1.4.5.1'] and hl7:templateId[@root = '1.3.6.1.4.1.19376.1.5.3.1.4.5.2'] and hl7:templateId[@root = '2.16.840.1.113883.10.20.1.27']]]/hl7:act[hl7:templateId[@root = '1.2.40.0.34.11.13.3.7'] and hl7:templateId[@root = '1.2.40.0.34.11.2.3.1'] and hl7:templateId[@root = '1.2.40.0.34.11.1.3.5'] and hl7:templateId[@root = '1.3.6.1.4.1.19376.1.5.3.1.4.5.1'] and hl7:templateId[@root = '1.3.6.1.4.1.19376.1.5.3.1.4.5.2'] and hl7:templateId[@root = '2.16.840.1.113883.10.20.1.27']]/hl7:templateId[@root = '1.2.40.0.34.11.1.3.5']"
         id="d42e1677-false-d7960e0">
      <extends rule="II"/>
      <assert role="error"
              see="http://elga.art-decor.org/elgaambbef-html-20230118T144941/tmp-1.2.40.0.34.11.13.3.7-2017-01-26T143515.html"
              test="empty(@xsi:type) or resolve-QName(@xsi:type, .) = QName('urn:hl7-org:v3', 'II')">(ProblemEntryGesundheitsproblem): Wenn eine @xsi:type Instruktion anwesend ist MUSS diese den Wert "{urn:hl7-org:v3}:II" haben. Gefunden "{<value-of select="namespace-uri-from-QName(resolve-QName(@xsi:type,.))"/>}:<value-of select="local-name-from-QName(resolve-QName(@xsi:type,.))"/>"</assert>
      <assert role="error"
              see="http://elga.art-decor.org/elgaambbef-html-20230118T144941/tmp-1.2.40.0.34.11.13.3.7-2017-01-26T143515.html"
              test="string(@root) = ('1.2.40.0.34.11.1.3.5')">(ProblemEntryGesundheitsproblem): Der Wert von root MUSS '1.2.40.0.34.11.1.3.5' sein. Gefunden: "<value-of select="@root"/>"</assert>
   </rule>
   <!--
Template derived rules for ID: 1.2.40.0.34.11.13.3.7
Context: *[hl7:act[hl7:templateId[@root = '1.2.40.0.34.11.13.3.7'] and hl7:templateId[@root = '1.2.40.0.34.11.2.3.1'] and hl7:templateId[@root = '1.2.40.0.34.11.1.3.5'] and hl7:templateId[@root = '1.3.6.1.4.1.19376.1.5.3.1.4.5.1'] and hl7:templateId[@root = '1.3.6.1.4.1.19376.1.5.3.1.4.5.2'] and hl7:templateId[@root = '2.16.840.1.113883.10.20.1.27']]]/hl7:act[hl7:templateId[@root = '1.2.40.0.34.11.13.3.7'] and hl7:templateId[@root = '1.2.40.0.34.11.2.3.1'] and hl7:templateId[@root = '1.2.40.0.34.11.1.3.5'] and hl7:templateId[@root = '1.3.6.1.4.1.19376.1.5.3.1.4.5.1'] and hl7:templateId[@root = '1.3.6.1.4.1.19376.1.5.3.1.4.5.2'] and hl7:templateId[@root = '2.16.840.1.113883.10.20.1.27']]/hl7:templateId[@root = '1.3.6.1.4.1.19376.1.5.3.1.4.5.1']
Item: (ProblemEntryGesundheitsproblem)
-->

   <rule fpi="RULC-1"
         context="*[hl7:act[hl7:templateId[@root = '1.2.40.0.34.11.13.3.7'] and hl7:templateId[@root = '1.2.40.0.34.11.2.3.1'] and hl7:templateId[@root = '1.2.40.0.34.11.1.3.5'] and hl7:templateId[@root = '1.3.6.1.4.1.19376.1.5.3.1.4.5.1'] and hl7:templateId[@root = '1.3.6.1.4.1.19376.1.5.3.1.4.5.2'] and hl7:templateId[@root = '2.16.840.1.113883.10.20.1.27']]]/hl7:act[hl7:templateId[@root = '1.2.40.0.34.11.13.3.7'] and hl7:templateId[@root = '1.2.40.0.34.11.2.3.1'] and hl7:templateId[@root = '1.2.40.0.34.11.1.3.5'] and hl7:templateId[@root = '1.3.6.1.4.1.19376.1.5.3.1.4.5.1'] and hl7:templateId[@root = '1.3.6.1.4.1.19376.1.5.3.1.4.5.2'] and hl7:templateId[@root = '2.16.840.1.113883.10.20.1.27']]/hl7:templateId[@root = '1.3.6.1.4.1.19376.1.5.3.1.4.5.1']"
         id="d42e1683-false-d7975e0">
      <extends rule="II"/>
      <assert role="error"
              see="http://elga.art-decor.org/elgaambbef-html-20230118T144941/tmp-1.2.40.0.34.11.13.3.7-2017-01-26T143515.html"
              test="empty(@xsi:type) or resolve-QName(@xsi:type, .) = QName('urn:hl7-org:v3', 'II')">(ProblemEntryGesundheitsproblem): Wenn eine @xsi:type Instruktion anwesend ist MUSS diese den Wert "{urn:hl7-org:v3}:II" haben. Gefunden "{<value-of select="namespace-uri-from-QName(resolve-QName(@xsi:type,.))"/>}:<value-of select="local-name-from-QName(resolve-QName(@xsi:type,.))"/>"</assert>
      <assert role="error"
              see="http://elga.art-decor.org/elgaambbef-html-20230118T144941/tmp-1.2.40.0.34.11.13.3.7-2017-01-26T143515.html"
              test="string(@root) = ('1.3.6.1.4.1.19376.1.5.3.1.4.5.1')">(ProblemEntryGesundheitsproblem): Der Wert von root MUSS '1.3.6.1.4.1.19376.1.5.3.1.4.5.1' sein. Gefunden: "<value-of select="@root"/>"</assert>
   </rule>
   <!--
Template derived rules for ID: 1.2.40.0.34.11.13.3.7
Context: *[hl7:act[hl7:templateId[@root = '1.2.40.0.34.11.13.3.7'] and hl7:templateId[@root = '1.2.40.0.34.11.2.3.1'] and hl7:templateId[@root = '1.2.40.0.34.11.1.3.5'] and hl7:templateId[@root = '1.3.6.1.4.1.19376.1.5.3.1.4.5.1'] and hl7:templateId[@root = '1.3.6.1.4.1.19376.1.5.3.1.4.5.2'] and hl7:templateId[@root = '2.16.840.1.113883.10.20.1.27']]]/hl7:act[hl7:templateId[@root = '1.2.40.0.34.11.13.3.7'] and hl7:templateId[@root = '1.2.40.0.34.11.2.3.1'] and hl7:templateId[@root = '1.2.40.0.34.11.1.3.5'] and hl7:templateId[@root = '1.3.6.1.4.1.19376.1.5.3.1.4.5.1'] and hl7:templateId[@root = '1.3.6.1.4.1.19376.1.5.3.1.4.5.2'] and hl7:templateId[@root = '2.16.840.1.113883.10.20.1.27']]/hl7:templateId[@root = '1.3.6.1.4.1.19376.1.5.3.1.4.5.2']
Item: (ProblemEntryGesundheitsproblem)
-->

   <rule fpi="RULC-1"
         context="*[hl7:act[hl7:templateId[@root = '1.2.40.0.34.11.13.3.7'] and hl7:templateId[@root = '1.2.40.0.34.11.2.3.1'] and hl7:templateId[@root = '1.2.40.0.34.11.1.3.5'] and hl7:templateId[@root = '1.3.6.1.4.1.19376.1.5.3.1.4.5.1'] and hl7:templateId[@root = '1.3.6.1.4.1.19376.1.5.3.1.4.5.2'] and hl7:templateId[@root = '2.16.840.1.113883.10.20.1.27']]]/hl7:act[hl7:templateId[@root = '1.2.40.0.34.11.13.3.7'] and hl7:templateId[@root = '1.2.40.0.34.11.2.3.1'] and hl7:templateId[@root = '1.2.40.0.34.11.1.3.5'] and hl7:templateId[@root = '1.3.6.1.4.1.19376.1.5.3.1.4.5.1'] and hl7:templateId[@root = '1.3.6.1.4.1.19376.1.5.3.1.4.5.2'] and hl7:templateId[@root = '2.16.840.1.113883.10.20.1.27']]/hl7:templateId[@root = '1.3.6.1.4.1.19376.1.5.3.1.4.5.2']"
         id="d42e1688-false-d7990e0">
      <extends rule="II"/>
      <assert role="error"
              see="http://elga.art-decor.org/elgaambbef-html-20230118T144941/tmp-1.2.40.0.34.11.13.3.7-2017-01-26T143515.html"
              test="empty(@xsi:type) or resolve-QName(@xsi:type, .) = QName('urn:hl7-org:v3', 'II')">(ProblemEntryGesundheitsproblem): Wenn eine @xsi:type Instruktion anwesend ist MUSS diese den Wert "{urn:hl7-org:v3}:II" haben. Gefunden "{<value-of select="namespace-uri-from-QName(resolve-QName(@xsi:type,.))"/>}:<value-of select="local-name-from-QName(resolve-QName(@xsi:type,.))"/>"</assert>
      <assert role="error"
              see="http://elga.art-decor.org/elgaambbef-html-20230118T144941/tmp-1.2.40.0.34.11.13.3.7-2017-01-26T143515.html"
              test="string(@root) = ('1.3.6.1.4.1.19376.1.5.3.1.4.5.2')">(ProblemEntryGesundheitsproblem): Der Wert von root MUSS '1.3.6.1.4.1.19376.1.5.3.1.4.5.2' sein. Gefunden: "<value-of select="@root"/>"</assert>
   </rule>
   <!--
Template derived rules for ID: 1.2.40.0.34.11.13.3.7
Context: *[hl7:act[hl7:templateId[@root = '1.2.40.0.34.11.13.3.7'] and hl7:templateId[@root = '1.2.40.0.34.11.2.3.1'] and hl7:templateId[@root = '1.2.40.0.34.11.1.3.5'] and hl7:templateId[@root = '1.3.6.1.4.1.19376.1.5.3.1.4.5.1'] and hl7:templateId[@root = '1.3.6.1.4.1.19376.1.5.3.1.4.5.2'] and hl7:templateId[@root = '2.16.840.1.113883.10.20.1.27']]]/hl7:act[hl7:templateId[@root = '1.2.40.0.34.11.13.3.7'] and hl7:templateId[@root = '1.2.40.0.34.11.2.3.1'] and hl7:templateId[@root = '1.2.40.0.34.11.1.3.5'] and hl7:templateId[@root = '1.3.6.1.4.1.19376.1.5.3.1.4.5.1'] and hl7:templateId[@root = '1.3.6.1.4.1.19376.1.5.3.1.4.5.2'] and hl7:templateId[@root = '2.16.840.1.113883.10.20.1.27']]/hl7:templateId[@root = '2.16.840.1.113883.10.20.1.27']
Item: (ProblemEntryGesundheitsproblem)
-->

   <rule fpi="RULC-1"
         context="*[hl7:act[hl7:templateId[@root = '1.2.40.0.34.11.13.3.7'] and hl7:templateId[@root = '1.2.40.0.34.11.2.3.1'] and hl7:templateId[@root = '1.2.40.0.34.11.1.3.5'] and hl7:templateId[@root = '1.3.6.1.4.1.19376.1.5.3.1.4.5.1'] and hl7:templateId[@root = '1.3.6.1.4.1.19376.1.5.3.1.4.5.2'] and hl7:templateId[@root = '2.16.840.1.113883.10.20.1.27']]]/hl7:act[hl7:templateId[@root = '1.2.40.0.34.11.13.3.7'] and hl7:templateId[@root = '1.2.40.0.34.11.2.3.1'] and hl7:templateId[@root = '1.2.40.0.34.11.1.3.5'] and hl7:templateId[@root = '1.3.6.1.4.1.19376.1.5.3.1.4.5.1'] and hl7:templateId[@root = '1.3.6.1.4.1.19376.1.5.3.1.4.5.2'] and hl7:templateId[@root = '2.16.840.1.113883.10.20.1.27']]/hl7:templateId[@root = '2.16.840.1.113883.10.20.1.27']"
         id="d42e1693-false-d8005e0">
      <extends rule="II"/>
      <assert role="error"
              see="http://elga.art-decor.org/elgaambbef-html-20230118T144941/tmp-1.2.40.0.34.11.13.3.7-2017-01-26T143515.html"
              test="empty(@xsi:type) or resolve-QName(@xsi:type, .) = QName('urn:hl7-org:v3', 'II')">(ProblemEntryGesundheitsproblem): Wenn eine @xsi:type Instruktion anwesend ist MUSS diese den Wert "{urn:hl7-org:v3}:II" haben. Gefunden "{<value-of select="namespace-uri-from-QName(resolve-QName(@xsi:type,.))"/>}:<value-of select="local-name-from-QName(resolve-QName(@xsi:type,.))"/>"</assert>
      <assert role="error"
              see="http://elga.art-decor.org/elgaambbef-html-20230118T144941/tmp-1.2.40.0.34.11.13.3.7-2017-01-26T143515.html"
              test="string(@root) = ('2.16.840.1.113883.10.20.1.27')">(ProblemEntryGesundheitsproblem): Der Wert von root MUSS '2.16.840.1.113883.10.20.1.27' sein. Gefunden: "<value-of select="@root"/>"</assert>
   </rule>
   <!--
Template derived rules for ID: 1.2.40.0.34.11.13.3.7
Context: *[hl7:act[hl7:templateId[@root = '1.2.40.0.34.11.13.3.7'] and hl7:templateId[@root = '1.2.40.0.34.11.2.3.1'] and hl7:templateId[@root = '1.2.40.0.34.11.1.3.5'] and hl7:templateId[@root = '1.3.6.1.4.1.19376.1.5.3.1.4.5.1'] and hl7:templateId[@root = '1.3.6.1.4.1.19376.1.5.3.1.4.5.2'] and hl7:templateId[@root = '2.16.840.1.113883.10.20.1.27']]]/hl7:act[hl7:templateId[@root = '1.2.40.0.34.11.13.3.7'] and hl7:templateId[@root = '1.2.40.0.34.11.2.3.1'] and hl7:templateId[@root = '1.2.40.0.34.11.1.3.5'] and hl7:templateId[@root = '1.3.6.1.4.1.19376.1.5.3.1.4.5.1'] and hl7:templateId[@root = '1.3.6.1.4.1.19376.1.5.3.1.4.5.2'] and hl7:templateId[@root = '2.16.840.1.113883.10.20.1.27']]/hl7:id
Item: (ProblemEntryGesundheitsproblem)
-->

   <!--
Template derived rules for ID: 1.2.40.0.34.11.13.3.7
Context: *[hl7:act[hl7:templateId[@root = '1.2.40.0.34.11.13.3.7'] and hl7:templateId[@root = '1.2.40.0.34.11.2.3.1'] and hl7:templateId[@root = '1.2.40.0.34.11.1.3.5'] and hl7:templateId[@root = '1.3.6.1.4.1.19376.1.5.3.1.4.5.1'] and hl7:templateId[@root = '1.3.6.1.4.1.19376.1.5.3.1.4.5.2'] and hl7:templateId[@root = '2.16.840.1.113883.10.20.1.27']]]/hl7:act[hl7:templateId[@root = '1.2.40.0.34.11.13.3.7'] and hl7:templateId[@root = '1.2.40.0.34.11.2.3.1'] and hl7:templateId[@root = '1.2.40.0.34.11.1.3.5'] and hl7:templateId[@root = '1.3.6.1.4.1.19376.1.5.3.1.4.5.1'] and hl7:templateId[@root = '1.3.6.1.4.1.19376.1.5.3.1.4.5.2'] and hl7:templateId[@root = '2.16.840.1.113883.10.20.1.27']]/hl7:code[@nullFlavor = 'NA']
Item: (ProblemEntryGesundheitsproblem)
-->

   <rule fpi="RULC-1"
         context="*[hl7:act[hl7:templateId[@root = '1.2.40.0.34.11.13.3.7'] and hl7:templateId[@root = '1.2.40.0.34.11.2.3.1'] and hl7:templateId[@root = '1.2.40.0.34.11.1.3.5'] and hl7:templateId[@root = '1.3.6.1.4.1.19376.1.5.3.1.4.5.1'] and hl7:templateId[@root = '1.3.6.1.4.1.19376.1.5.3.1.4.5.2'] and hl7:templateId[@root = '2.16.840.1.113883.10.20.1.27']]]/hl7:act[hl7:templateId[@root = '1.2.40.0.34.11.13.3.7'] and hl7:templateId[@root = '1.2.40.0.34.11.2.3.1'] and hl7:templateId[@root = '1.2.40.0.34.11.1.3.5'] and hl7:templateId[@root = '1.3.6.1.4.1.19376.1.5.3.1.4.5.1'] and hl7:templateId[@root = '1.3.6.1.4.1.19376.1.5.3.1.4.5.2'] and hl7:templateId[@root = '2.16.840.1.113883.10.20.1.27']]/hl7:code[@nullFlavor = 'NA']"
         id="d42e1700-false-d8027e0">
      <extends rule="CE"/>
      <assert role="error"
              see="http://elga.art-decor.org/elgaambbef-html-20230118T144941/tmp-1.2.40.0.34.11.13.3.7-2017-01-26T143515.html"
              test="empty(@xsi:type) or resolve-QName(@xsi:type, .) = QName('urn:hl7-org:v3', 'CE')">(ProblemEntryGesundheitsproblem): Wenn eine @xsi:type Instruktion anwesend ist MUSS diese den Wert "{urn:hl7-org:v3}:CE" haben. Gefunden "{<value-of select="namespace-uri-from-QName(resolve-QName(@xsi:type,.))"/>}:<value-of select="local-name-from-QName(resolve-QName(@xsi:type,.))"/>"</assert>
      <assert role="error"
              see="http://elga.art-decor.org/elgaambbef-html-20230118T144941/tmp-1.2.40.0.34.11.13.3.7-2017-01-26T143515.html"
              test="string(@nullFlavor) = ('NA')">(ProblemEntryGesundheitsproblem): Der Wert von nullFlavor MUSS 'NA' sein. Gefunden: "<value-of select="@nullFlavor"/>"</assert>
   </rule>
   <!--
Template derived rules for ID: 1.2.40.0.34.11.13.3.7
Context: *[hl7:act[hl7:templateId[@root = '1.2.40.0.34.11.13.3.7'] and hl7:templateId[@root = '1.2.40.0.34.11.2.3.1'] and hl7:templateId[@root = '1.2.40.0.34.11.1.3.5'] and hl7:templateId[@root = '1.3.6.1.4.1.19376.1.5.3.1.4.5.1'] and hl7:templateId[@root = '1.3.6.1.4.1.19376.1.5.3.1.4.5.2'] and hl7:templateId[@root = '2.16.840.1.113883.10.20.1.27']]]/hl7:act[hl7:templateId[@root = '1.2.40.0.34.11.13.3.7'] and hl7:templateId[@root = '1.2.40.0.34.11.2.3.1'] and hl7:templateId[@root = '1.2.40.0.34.11.1.3.5'] and hl7:templateId[@root = '1.3.6.1.4.1.19376.1.5.3.1.4.5.1'] and hl7:templateId[@root = '1.3.6.1.4.1.19376.1.5.3.1.4.5.2'] and hl7:templateId[@root = '2.16.840.1.113883.10.20.1.27']]/hl7:statusCode[@code = 'completed']
Item: (ProblemEntryGesundheitsproblem)
-->

   <rule fpi="RULC-1"
         context="*[hl7:act[hl7:templateId[@root = '1.2.40.0.34.11.13.3.7'] and hl7:templateId[@root = '1.2.40.0.34.11.2.3.1'] and hl7:templateId[@root = '1.2.40.0.34.11.1.3.5'] and hl7:templateId[@root = '1.3.6.1.4.1.19376.1.5.3.1.4.5.1'] and hl7:templateId[@root = '1.3.6.1.4.1.19376.1.5.3.1.4.5.2'] and hl7:templateId[@root = '2.16.840.1.113883.10.20.1.27']]]/hl7:act[hl7:templateId[@root = '1.2.40.0.34.11.13.3.7'] and hl7:templateId[@root = '1.2.40.0.34.11.2.3.1'] and hl7:templateId[@root = '1.2.40.0.34.11.1.3.5'] and hl7:templateId[@root = '1.3.6.1.4.1.19376.1.5.3.1.4.5.1'] and hl7:templateId[@root = '1.3.6.1.4.1.19376.1.5.3.1.4.5.2'] and hl7:templateId[@root = '2.16.840.1.113883.10.20.1.27']]/hl7:statusCode[@code = 'completed']"
         id="d42e1705-false-d8042e0">
      <extends rule="CS"/>
      <assert role="error"
              see="http://elga.art-decor.org/elgaambbef-html-20230118T144941/tmp-1.2.40.0.34.11.13.3.7-2017-01-26T143515.html"
              test="empty(@xsi:type) or resolve-QName(@xsi:type, .) = QName('urn:hl7-org:v3', 'CS')">(ProblemEntryGesundheitsproblem): Wenn eine @xsi:type Instruktion anwesend ist MUSS diese den Wert "{urn:hl7-org:v3}:CS" haben. Gefunden "{<value-of select="namespace-uri-from-QName(resolve-QName(@xsi:type,.))"/>}:<value-of select="local-name-from-QName(resolve-QName(@xsi:type,.))"/>"</assert>
      <assert role="error"
              see="http://elga.art-decor.org/elgaambbef-html-20230118T144941/tmp-1.2.40.0.34.11.13.3.7-2017-01-26T143515.html"
              test="@nullFlavor or (@code='completed')">(ProblemEntryGesundheitsproblem): Der Elementinhalt MUSS einer von 'code 'completed'' sein.</assert>
   </rule>
   <!--
Template derived rules for ID: 1.2.40.0.34.11.13.3.7
Context: *[hl7:act[hl7:templateId[@root = '1.2.40.0.34.11.13.3.7'] and hl7:templateId[@root = '1.2.40.0.34.11.2.3.1'] and hl7:templateId[@root = '1.2.40.0.34.11.1.3.5'] and hl7:templateId[@root = '1.3.6.1.4.1.19376.1.5.3.1.4.5.1'] and hl7:templateId[@root = '1.3.6.1.4.1.19376.1.5.3.1.4.5.2'] and hl7:templateId[@root = '2.16.840.1.113883.10.20.1.27']]]/hl7:act[hl7:templateId[@root = '1.2.40.0.34.11.13.3.7'] and hl7:templateId[@root = '1.2.40.0.34.11.2.3.1'] and hl7:templateId[@root = '1.2.40.0.34.11.1.3.5'] and hl7:templateId[@root = '1.3.6.1.4.1.19376.1.5.3.1.4.5.1'] and hl7:templateId[@root = '1.3.6.1.4.1.19376.1.5.3.1.4.5.2'] and hl7:templateId[@root = '2.16.840.1.113883.10.20.1.27']]/hl7:effectiveTime[hl7:low]
Item: (ProblemEntryGesundheitsproblem)
-->

   <rule fpi="RULC-1"
         context="*[hl7:act[hl7:templateId[@root = '1.2.40.0.34.11.13.3.7'] and hl7:templateId[@root = '1.2.40.0.34.11.2.3.1'] and hl7:templateId[@root = '1.2.40.0.34.11.1.3.5'] and hl7:templateId[@root = '1.3.6.1.4.1.19376.1.5.3.1.4.5.1'] and hl7:templateId[@root = '1.3.6.1.4.1.19376.1.5.3.1.4.5.2'] and hl7:templateId[@root = '2.16.840.1.113883.10.20.1.27']]]/hl7:act[hl7:templateId[@root = '1.2.40.0.34.11.13.3.7'] and hl7:templateId[@root = '1.2.40.0.34.11.2.3.1'] and hl7:templateId[@root = '1.2.40.0.34.11.1.3.5'] and hl7:templateId[@root = '1.3.6.1.4.1.19376.1.5.3.1.4.5.1'] and hl7:templateId[@root = '1.3.6.1.4.1.19376.1.5.3.1.4.5.2'] and hl7:templateId[@root = '2.16.840.1.113883.10.20.1.27']]/hl7:effectiveTime[hl7:low]"
         id="d42e1716-false-d8058e0">
      <assert role="error"
              see="http://elga.art-decor.org/elgaambbef-html-20230118T144941/tmp-1.2.40.0.34.11.13.3.7-2017-01-26T143515.html"
              test="count(hl7:low) &gt;= 1">(ProblemEntryGesundheitsproblem): Element hl7:low ist required [min 1x].</assert>
      <assert role="error"
              see="http://elga.art-decor.org/elgaambbef-html-20230118T144941/tmp-1.2.40.0.34.11.13.3.7-2017-01-26T143515.html"
              test="count(hl7:low) &lt;= 1">(ProblemEntryGesundheitsproblem): Element hl7:low kommt zu häufig vor [max 1x].</assert>
      <assert role="error"
              see="http://elga.art-decor.org/elgaambbef-html-20230118T144941/tmp-1.2.40.0.34.11.13.3.7-2017-01-26T143515.html"
              test="count(hl7:high) &lt;= 1">(ProblemEntryGesundheitsproblem): Element hl7:high kommt zu häufig vor [max 1x].</assert>
   </rule>
   <!--
Template derived rules for ID: 1.2.40.0.34.11.13.3.7
Context: *[hl7:act[hl7:templateId[@root = '1.2.40.0.34.11.13.3.7'] and hl7:templateId[@root = '1.2.40.0.34.11.2.3.1'] and hl7:templateId[@root = '1.2.40.0.34.11.1.3.5'] and hl7:templateId[@root = '1.3.6.1.4.1.19376.1.5.3.1.4.5.1'] and hl7:templateId[@root = '1.3.6.1.4.1.19376.1.5.3.1.4.5.2'] and hl7:templateId[@root = '2.16.840.1.113883.10.20.1.27']]]/hl7:act[hl7:templateId[@root = '1.2.40.0.34.11.13.3.7'] and hl7:templateId[@root = '1.2.40.0.34.11.2.3.1'] and hl7:templateId[@root = '1.2.40.0.34.11.1.3.5'] and hl7:templateId[@root = '1.3.6.1.4.1.19376.1.5.3.1.4.5.1'] and hl7:templateId[@root = '1.3.6.1.4.1.19376.1.5.3.1.4.5.2'] and hl7:templateId[@root = '2.16.840.1.113883.10.20.1.27']]/hl7:effectiveTime[hl7:low]/hl7:low
Item: (ProblemEntryGesundheitsproblem)
-->

   <!--
Template derived rules for ID: 1.2.40.0.34.11.13.3.7
Context: *[hl7:act[hl7:templateId[@root = '1.2.40.0.34.11.13.3.7'] and hl7:templateId[@root = '1.2.40.0.34.11.2.3.1'] and hl7:templateId[@root = '1.2.40.0.34.11.1.3.5'] and hl7:templateId[@root = '1.3.6.1.4.1.19376.1.5.3.1.4.5.1'] and hl7:templateId[@root = '1.3.6.1.4.1.19376.1.5.3.1.4.5.2'] and hl7:templateId[@root = '2.16.840.1.113883.10.20.1.27']]]/hl7:act[hl7:templateId[@root = '1.2.40.0.34.11.13.3.7'] and hl7:templateId[@root = '1.2.40.0.34.11.2.3.1'] and hl7:templateId[@root = '1.2.40.0.34.11.1.3.5'] and hl7:templateId[@root = '1.3.6.1.4.1.19376.1.5.3.1.4.5.1'] and hl7:templateId[@root = '1.3.6.1.4.1.19376.1.5.3.1.4.5.2'] and hl7:templateId[@root = '2.16.840.1.113883.10.20.1.27']]/hl7:effectiveTime[hl7:low]/hl7:high
Item: (ProblemEntryGesundheitsproblem)
-->


   <!--
Template derived rules for ID: 1.2.40.0.34.11.13.3.7
Context: *[hl7:act[hl7:templateId[@root = '1.2.40.0.34.11.13.3.7'] and hl7:templateId[@root = '1.2.40.0.34.11.2.3.1'] and hl7:templateId[@root = '1.2.40.0.34.11.1.3.5'] and hl7:templateId[@root = '1.3.6.1.4.1.19376.1.5.3.1.4.5.1'] and hl7:templateId[@root = '1.3.6.1.4.1.19376.1.5.3.1.4.5.2'] and hl7:templateId[@root = '2.16.840.1.113883.10.20.1.27']]]/hl7:act[hl7:templateId[@root = '1.2.40.0.34.11.13.3.7'] and hl7:templateId[@root = '1.2.40.0.34.11.2.3.1'] and hl7:templateId[@root = '1.2.40.0.34.11.1.3.5'] and hl7:templateId[@root = '1.3.6.1.4.1.19376.1.5.3.1.4.5.1'] and hl7:templateId[@root = '1.3.6.1.4.1.19376.1.5.3.1.4.5.2'] and hl7:templateId[@root = '2.16.840.1.113883.10.20.1.27']]/hl7:entryRelationship[hl7:observation[hl7:templateId[@root = '1.2.40.0.34.11.1.3.6'] and hl7:templateId[@root = '1.3.6.1.4.1.19376.1.5.3.1.4.5'] and hl7:templateId[@root = '2.16.840.1.113883.10.20.1.28']]]
Item: (ProblemEntryGesundheitsproblem)
-->
   <rule fpi="RULC-1"
         context="*[hl7:act[hl7:templateId[@root = '1.2.40.0.34.11.13.3.7'] and hl7:templateId[@root = '1.2.40.0.34.11.2.3.1'] and hl7:templateId[@root = '1.2.40.0.34.11.1.3.5'] and hl7:templateId[@root = '1.3.6.1.4.1.19376.1.5.3.1.4.5.1'] and hl7:templateId[@root = '1.3.6.1.4.1.19376.1.5.3.1.4.5.2'] and hl7:templateId[@root = '2.16.840.1.113883.10.20.1.27']]]/hl7:act[hl7:templateId[@root = '1.2.40.0.34.11.13.3.7'] and hl7:templateId[@root = '1.2.40.0.34.11.2.3.1'] and hl7:templateId[@root = '1.2.40.0.34.11.1.3.5'] and hl7:templateId[@root = '1.3.6.1.4.1.19376.1.5.3.1.4.5.1'] and hl7:templateId[@root = '1.3.6.1.4.1.19376.1.5.3.1.4.5.2'] and hl7:templateId[@root = '2.16.840.1.113883.10.20.1.27']]/hl7:entryRelationship[hl7:observation[hl7:templateId[@root = '1.2.40.0.34.11.1.3.6'] and hl7:templateId[@root = '1.3.6.1.4.1.19376.1.5.3.1.4.5'] and hl7:templateId[@root = '2.16.840.1.113883.10.20.1.28']]]">
      <assert role="error"
              see="http://elga.art-decor.org/elgaambbef-html-20230118T144941/tmp-1.2.40.0.34.11.13.3.7-2017-01-26T143515.html"
              test="string(@typeCode) = ('SUBJ')">(ProblemEntryGesundheitsproblem): Der Wert von typeCode MUSS 'SUBJ' sein. Gefunden: "<value-of select="@typeCode"/>"</assert>
      <assert role="error"
              see="http://elga.art-decor.org/elgaambbef-html-20230118T144941/tmp-1.2.40.0.34.11.13.3.7-2017-01-26T143515.html"
              test="string(@inversionInd) = ('false')">(ProblemEntryGesundheitsproblem): Der Wert von inversionInd MUSS 'false' sein. Gefunden: "<value-of select="@inversionInd"/>"</assert>
      <assert role="error"
              see="http://elga.art-decor.org/elgaambbef-html-20230118T144941/tmp-1.2.40.0.34.11.13.3.7-2017-01-26T143515.html"
              test="hl7:observation/hl7:code[@code='282291009' and @codeSystem='2.16.840.1.113883.6.96']">(ProblemEntryGesundheitsproblem): Observation.code (ProblemEntry) MUSS 282291009 aus Snomed-CT sein</assert>
      <assert role="error"
              see="http://elga.art-decor.org/elgaambbef-html-20230118T144941/tmp-1.2.40.0.34.11.13.3.7-2017-01-26T143515.html"
              test="hl7:observation/hl7:value[starts-with(@codeSystem,'1.2.40.0.34.5.')] or hl7:observation/hl7:value[@code='160245001'][@codeSystem='2.16.840.1.113883.6.96']">(ProblemEntryGesundheitsproblem): Observation.value (ProblemEntry) MUSS aus dem Codesystem-Zweig 1.2.40.0.34.5. gewählt werden (die aktuell gültige und vom BMG herausgegebene Version des ICD-10) oder als "No current problems or
                        disability" code 160245001 aus SNOMED CT (2.16.840.1.113883.6.96) kodiert sein.</assert>
   </rule>
</pattern>
