<?xml version="1.0" encoding="UTF-8"?>
<!--
Template derived pattern
===========================================
ID: 1.2.40.0.34.6.0.11.3.45
Name: Erwartetes Geburtsdatum Entry
Description: 
                 Voraussichtlicher Geburtstermin. Schätzung oder Berechnung nach letzter Regelblutung oder Eisprung, sowie das Datum der Schätzung/Berechnung. 
            
-->
<pattern xmlns="http://purl.oclc.org/dsdl/schematron"
         id="template-1.2.40.0.34.6.0.11.3.45-2019-11-25T131854-closed">
   <title>Erwartetes Geburtsdatum Entry</title>

   <!-- Checking undefined contents for template/element @isClosed="true". Match context that we did not already match -->
   <rule fpi="RUL-QQQ"
         context="*[hl7:observation[hl7:templateId[@root = '1.2.40.0.34.6.0.11.3.45'] and hl7:templateId[@root = '2.16.840.1.113883.10.20.1.33'] and hl7:templateId[@root = '1.3.6.1.4.1.19376.1.5.3.1.4.13.5']]]/*[not(@xsi:nil = 'true')][not(self::hl7:observation[hl7:templateId[@root = '1.2.40.0.34.6.0.11.3.45'] and hl7:templateId[@root = '2.16.840.1.113883.10.20.1.33'] and hl7:templateId[@root = '1.3.6.1.4.1.19376.1.5.3.1.4.13.5']])]"
         id="d42e68940-true-d5521653e0">
      <assert role="error"
              see="http://elga.art-decor.org/elgaambbef-html-20230118T144941/tmp-1.2.40.0.34.6.0.11.3.45-2019-11-25T131854.html"
              test="not(.)">(atcdabbr_entry_ErwartetesGeburtsdatum)/d42e68940-true-d5521653e0: '<value-of select="name(..)"/>' ist als geschlossen definiert und dieses Element '<name/>' ist nicht erlaubt oder nicht mit diesem Inhalt erlaubt. Dies kann templateId, code oder id betreffen. Erwartet:  hl7:observation[hl7:templateId[@root = '1.2.40.0.34.6.0.11.3.45'] and hl7:templateId[@root = '2.16.840.1.113883.10.20.1.33'] and hl7:templateId[@root = '1.3.6.1.4.1.19376.1.5.3.1.4.13.5']] (rule-reference: d42e68940-true-d5521653e0)</assert>
   </rule>

   <!-- Checking undefined contents for template/element @isClosed="true". Match context that we did not already match -->
   <rule fpi="RUL-QQQ"
         context="*[hl7:observation[hl7:templateId[@root = '1.2.40.0.34.6.0.11.3.45'] and hl7:templateId[@root = '2.16.840.1.113883.10.20.1.33'] and hl7:templateId[@root = '1.3.6.1.4.1.19376.1.5.3.1.4.13.5']]]/hl7:observation[hl7:templateId[@root = '1.2.40.0.34.6.0.11.3.45'] and hl7:templateId[@root = '2.16.840.1.113883.10.20.1.33'] and hl7:templateId[@root = '1.3.6.1.4.1.19376.1.5.3.1.4.13.5']]/*[not(@xsi:nil = 'true')][not(self::hl7:templateId[@root = '1.2.40.0.34.6.0.11.3.45'] | self::hl7:templateId[@root = '2.16.840.1.113883.10.20.1.33'] | self::hl7:templateId[@root = '1.3.6.1.4.1.19376.1.5.3.1.4.13.5'] | self::hl7:code[concat(@code, @codeSystem) = doc('include/voc-1.2.40.0.34.10.202-DYNAMIC.xml')//valueSet[1]/conceptList/concept/concat(@code, @codeSystem)] | self::hl7:text | self::hl7:statusCode[@code = 'completed' or @nullFlavor] | self::hl7:effectiveTime | self::hl7:value | self::hl7:reference[hl7:externalDocument[hl7:templateId[@root = '1.2.40.0.34.6.0.11.3.14']]])]"
         id="d42e68996-true-d5521740e0">
      <assert role="error"
              see="http://elga.art-decor.org/elgaambbef-html-20230118T144941/tmp-1.2.40.0.34.6.0.11.3.45-2019-11-25T131854.html"
              test="not(.)">(atcdabbr_entry_ErwartetesGeburtsdatum)/d42e68996-true-d5521740e0: '<value-of select="name(..)"/>' ist als geschlossen definiert und dieses Element '<name/>' ist nicht erlaubt oder nicht mit diesem Inhalt erlaubt. Dies kann templateId, code oder id betreffen. Erwartet:  hl7:templateId[@root = '1.2.40.0.34.6.0.11.3.45'] | hl7:templateId[@root = '2.16.840.1.113883.10.20.1.33'] | hl7:templateId[@root = '1.3.6.1.4.1.19376.1.5.3.1.4.13.5'] | hl7:code[concat(@code, @codeSystem) = doc('include/voc-1.2.40.0.34.10.202-DYNAMIC.xml')//valueSet[1]/conceptList/concept/concat(@code, @codeSystem)] | hl7:text | hl7:statusCode[@code = 'completed' or @nullFlavor] | hl7:effectiveTime | hl7:value | hl7:reference[hl7:externalDocument[hl7:templateId[@root = '1.2.40.0.34.6.0.11.3.14']]] (rule-reference: d42e68996-true-d5521740e0)</assert>
   </rule>

   <!-- Checking undefined contents for template/element @isClosed="true". Match context that we did not already match -->
   <rule fpi="RUL-QQQ"
         context="*[hl7:observation[hl7:templateId[@root = '1.2.40.0.34.6.0.11.3.45'] and hl7:templateId[@root = '2.16.840.1.113883.10.20.1.33'] and hl7:templateId[@root = '1.3.6.1.4.1.19376.1.5.3.1.4.13.5']]]/hl7:observation[hl7:templateId[@root = '1.2.40.0.34.6.0.11.3.45'] and hl7:templateId[@root = '2.16.840.1.113883.10.20.1.33'] and hl7:templateId[@root = '1.3.6.1.4.1.19376.1.5.3.1.4.13.5']]/hl7:text/*[not(@xsi:nil = 'true')][not(self::hl7:reference[not(@nullFlavor)])]"
         id="d5521770e54-true-d5521782e0">
      <assert role="error"
              see="http://elga.art-decor.org/elgaambbef-html-20230118T144941/tmp-1.2.40.0.34.6.0.11.9.1-2021-05-06T093820.html"
              test="not(.)">(atcdabrr_other_NarrativeTextReference)/d5521770e54-true-d5521782e0: '<value-of select="name(..)"/>' ist als geschlossen definiert und dieses Element '<name/>' ist nicht erlaubt oder nicht mit diesem Inhalt erlaubt. Dies kann templateId, code oder id betreffen. Erwartet:  hl7:reference[not(@nullFlavor)] (rule-reference: d5521770e54-true-d5521782e0)</assert>
   </rule>

   <!-- Checking undefined contents for template/element @isClosed="true". Match context that we did not already match -->
   <rule fpi="RUL-QQQ"
         context="*[hl7:observation[hl7:templateId[@root = '1.2.40.0.34.6.0.11.3.45'] and hl7:templateId[@root = '2.16.840.1.113883.10.20.1.33'] and hl7:templateId[@root = '1.3.6.1.4.1.19376.1.5.3.1.4.13.5']]]/hl7:observation[hl7:templateId[@root = '1.2.40.0.34.6.0.11.3.45'] and hl7:templateId[@root = '2.16.840.1.113883.10.20.1.33'] and hl7:templateId[@root = '1.3.6.1.4.1.19376.1.5.3.1.4.13.5']]/hl7:reference[hl7:externalDocument[hl7:templateId[@root = '1.2.40.0.34.6.0.11.3.14']]]/*[not(@xsi:nil = 'true')][not(self::hl7:externalDocument[hl7:templateId[@root = '1.2.40.0.34.6.0.11.3.14']])]"
         id="d42e69062-true-d5521831e0">
      <assert role="error"
              see="http://elga.art-decor.org/elgaambbef-html-20230118T144941/tmp-1.2.40.0.34.6.0.11.3.45-2019-11-25T131854.html"
              test="not(.)">(atcdabbr_entry_ErwartetesGeburtsdatum)/d42e69062-true-d5521831e0: '<value-of select="name(..)"/>' ist als geschlossen definiert und dieses Element '<name/>' ist nicht erlaubt oder nicht mit diesem Inhalt erlaubt. Dies kann templateId, code oder id betreffen. Erwartet:  hl7:externalDocument[hl7:templateId[@root = '1.2.40.0.34.6.0.11.3.14']] (rule-reference: d42e69062-true-d5521831e0)</assert>
   </rule>

   <!-- Checking undefined contents for template/element @isClosed="true". Match context that we did not already match -->
   <rule fpi="RUL-QQQ"
         context="*[hl7:observation[hl7:templateId[@root = '1.2.40.0.34.6.0.11.3.45'] and hl7:templateId[@root = '2.16.840.1.113883.10.20.1.33'] and hl7:templateId[@root = '1.3.6.1.4.1.19376.1.5.3.1.4.13.5']]]/hl7:observation[hl7:templateId[@root = '1.2.40.0.34.6.0.11.3.45'] and hl7:templateId[@root = '2.16.840.1.113883.10.20.1.33'] and hl7:templateId[@root = '1.3.6.1.4.1.19376.1.5.3.1.4.13.5']]/hl7:reference[hl7:externalDocument[hl7:templateId[@root = '1.2.40.0.34.6.0.11.3.14']]]/hl7:externalDocument[hl7:templateId[@root = '1.2.40.0.34.6.0.11.3.14']]/*[not(@xsi:nil = 'true')][not(self::hl7:templateId[@root = '1.2.40.0.34.6.0.11.3.14'] | self::hl7:id[not(@nullFlavor)] | self::hl7:code | self::hl7:text | self::hl7:setId[not(@nullFlavor)] | self::hl7:versionNumber[not(@nullFlavor)])]"
         id="d5521808e6-true-d5521864e0">
      <assert role="error"
              see="http://elga.art-decor.org/elgaambbef-html-20230118T144941/tmp-1.2.40.0.34.6.0.11.3.45-2019-11-25T131854.html"
              test="not(.)">(atcdabbr_entry_ErwartetesGeburtsdatum)/d5521808e6-true-d5521864e0: '<value-of select="name(..)"/>' ist als geschlossen definiert und dieses Element '<name/>' ist nicht erlaubt oder nicht mit diesem Inhalt erlaubt. Dies kann templateId, code oder id betreffen. Erwartet:  hl7:templateId[@root = '1.2.40.0.34.6.0.11.3.14'] | hl7:id[not(@nullFlavor)] | hl7:code | hl7:text | hl7:setId[not(@nullFlavor)] | hl7:versionNumber[not(@nullFlavor)] (rule-reference: d5521808e6-true-d5521864e0)</assert>
   </rule>

   <!-- Checking undefined contents for template/element @isClosed="true". Match context that we did not already match -->
   <rule fpi="RUL-QQQ"
         context="*[hl7:observation[hl7:templateId[@root = '1.2.40.0.34.6.0.11.3.45'] and hl7:templateId[@root = '2.16.840.1.113883.10.20.1.33'] and hl7:templateId[@root = '1.3.6.1.4.1.19376.1.5.3.1.4.13.5']]]/hl7:observation[hl7:templateId[@root = '1.2.40.0.34.6.0.11.3.45'] and hl7:templateId[@root = '2.16.840.1.113883.10.20.1.33'] and hl7:templateId[@root = '1.3.6.1.4.1.19376.1.5.3.1.4.13.5']]/hl7:reference[hl7:externalDocument[hl7:templateId[@root = '1.2.40.0.34.6.0.11.3.14']]]/hl7:externalDocument[hl7:templateId[@root = '1.2.40.0.34.6.0.11.3.14']]/hl7:text/*[not(@xsi:nil = 'true')][not(self::hl7:reference[not(@nullFlavor)])]"
         id="d5521884e54-true-d5521896e0">
      <assert role="error"
              see="http://elga.art-decor.org/elgaambbef-html-20230118T144941/tmp-1.2.40.0.34.6.0.11.9.1-2021-05-06T093820.html"
              test="not(.)">(atcdabrr_other_NarrativeTextReference)/d5521884e54-true-d5521896e0: '<value-of select="name(..)"/>' ist als geschlossen definiert und dieses Element '<name/>' ist nicht erlaubt oder nicht mit diesem Inhalt erlaubt. Dies kann templateId, code oder id betreffen. Erwartet:  hl7:reference[not(@nullFlavor)] (rule-reference: d5521884e54-true-d5521896e0)</assert>
   </rule>
</pattern>
