<?xml version="1.0" encoding="UTF-8"?>
<!--
Template derived pattern
===========================================
ID: 1.2.40.0.34.6.0.11.9.14
Name: Participant Body - Transcriber
Description: 
-->
<pattern xmlns="http://purl.oclc.org/dsdl/schematron"
         id="template-1.2.40.0.34.6.0.11.9.14-2021-05-25T112752-closed">
   <title>Participant Body - Transcriber</title>

   <!-- Checking undefined contents for template/element @isClosed="true". Match context that we did not already match -->
   <rule fpi="RUL-QQQ"
         context="*[hl7:templateId[@root = '1.2.40.0.34.6.0.11.9.14']]/*[not(@xsi:nil = 'true')][not(self::hl7:templateId[@root = '1.2.40.0.34.6.0.11.9.14'] | self::hl7:time | self::hl7:participantRole[not(@nullFlavor)])]"
         id="d42e80430-true-d5729165e0">
      <assert role="error"
              see="http://elga.art-decor.org/elgaambbef-html-20230118T144941/tmp-1.2.40.0.34.6.0.11.9.14-2021-05-25T112752.html"
              test="not(.)">(atcdabbr_other_ParticipantBodyTranscriber)/d42e80430-true-d5729165e0: '<value-of select="name(..)"/>' ist als geschlossen definiert und dieses Element '<name/>' ist nicht erlaubt oder nicht mit diesem Inhalt erlaubt. Dies kann templateId, code oder id betreffen. Erwartet:  hl7:templateId[@root = '1.2.40.0.34.6.0.11.9.14'] | hl7:time | hl7:participantRole[not(@nullFlavor)] (rule-reference: d42e80430-true-d5729165e0)</assert>
   </rule>

   <!-- Checking undefined contents for template/element @isClosed="true". Match context that we did not already match -->
   <rule fpi="RUL-QQQ"
         context="*[hl7:templateId[@root = '1.2.40.0.34.6.0.11.9.14']]/hl7:participantRole[not(@nullFlavor)]/*[not(@xsi:nil = 'true')][not(self::hl7:id[not(@nullFlavor)] | self::hl7:id[@nullFlavor='NI'] | self::hl7:id[@nullFlavor='UNK'] | self::hl7:addr[not(@nullFlavor)] | self::hl7:telecom[not(@nullFlavor)] | self::hl7:playingDevice | self::hl7:playingEntity)]"
         id="d42e80533-true-d5729210e0">
      <assert role="error"
              see="http://elga.art-decor.org/elgaambbef-html-20230118T144941/tmp-1.2.40.0.34.6.0.11.9.14-2021-05-25T112752.html"
              test="not(.)">(atcdabbr_other_ParticipantBodyTranscriber)/d42e80533-true-d5729210e0: '<value-of select="name(..)"/>' ist als geschlossen definiert und dieses Element '<name/>' ist nicht erlaubt oder nicht mit diesem Inhalt erlaubt. Dies kann templateId, code oder id betreffen. Erwartet:  hl7:id[not(@nullFlavor)] | hl7:id[@nullFlavor='NI'] | hl7:id[@nullFlavor='UNK'] | hl7:addr[not(@nullFlavor)] | hl7:telecom[not(@nullFlavor)] | hl7:playingDevice | hl7:playingEntity (rule-reference: d42e80533-true-d5729210e0)</assert>
   </rule>

   <!-- Checking undefined contents for template/element @isClosed="true". Match context that we did not already match -->
   <rule fpi="RUL-QQQ"
         context="*[hl7:templateId[@root = '1.2.40.0.34.6.0.11.9.14']]/hl7:participantRole[not(@nullFlavor)]/hl7:addr[not(@nullFlavor)]/*[not(@xsi:nil = 'true')][not(self::hl7:streetAddressLine | self::hl7:streetName | self::hl7:houseNumber | self::hl7:postalCode[not(@nullFlavor)] | self::hl7:city[not(@nullFlavor)] | self::hl7:state | self::hl7:country[not(@nullFlavor)] | self::hl7:additionalLocator)]"
         id="d42e80561-true-d5729269e0">
      <assert role="error"
              see="http://elga.art-decor.org/elgaambbef-html-20230118T144941/tmp-1.2.40.0.34.6.0.11.9.14-2021-05-25T112752.html"
              test="not(.)">(atcdabbr_other_ParticipantBodyTranscriber)/d42e80561-true-d5729269e0: '<value-of select="name(..)"/>' ist als geschlossen definiert und dieses Element '<name/>' ist nicht erlaubt oder nicht mit diesem Inhalt erlaubt. Dies kann templateId, code oder id betreffen. Erwartet:  hl7:streetAddressLine | hl7:streetName | hl7:houseNumber | hl7:postalCode[not(@nullFlavor)] | hl7:city[not(@nullFlavor)] | hl7:state | hl7:country[not(@nullFlavor)] | hl7:additionalLocator (rule-reference: d42e80561-true-d5729269e0)</assert>
   </rule>

   <!-- Checking undefined contents for template/element @isClosed="true". Match context that we did not already match -->
   <rule fpi="RUL-QQQ"
         context="*[hl7:templateId[@root = '1.2.40.0.34.6.0.11.9.14']]/hl7:participantRole[not(@nullFlavor)]/hl7:playingDevice/*[not(@xsi:nil = 'true')][not(self::hl7:manufacturerModelName[not(@nullFlavor)] | self::hl7:softwareName[not(@nullFlavor)])]"
         id="d42e80590-true-d5729334e0">
      <assert role="error"
              see="http://elga.art-decor.org/elgaambbef-html-20230118T144941/tmp-1.2.40.0.34.6.0.11.9.14-2021-05-25T112752.html"
              test="not(.)">(atcdabbr_other_ParticipantBodyTranscriber)/d42e80590-true-d5729334e0: '<value-of select="name(..)"/>' ist als geschlossen definiert und dieses Element '<name/>' ist nicht erlaubt oder nicht mit diesem Inhalt erlaubt. Dies kann templateId, code oder id betreffen. Erwartet:  hl7:manufacturerModelName[not(@nullFlavor)] | hl7:softwareName[not(@nullFlavor)] (rule-reference: d42e80590-true-d5729334e0)</assert>
   </rule>

   <!-- Checking undefined contents for template/element @isClosed="true". Match context that we did not already match -->
   <rule fpi="RUL-QQQ"
         context="*[hl7:templateId[@root = '1.2.40.0.34.6.0.11.9.14']]/hl7:participantRole[not(@nullFlavor)]/hl7:playingEntity/*[not(@xsi:nil = 'true')][not(self::hl7:name[not(@nullFlavor)])]"
         id="d42e80592-true-d5729358e0">
      <assert role="error"
              see="http://elga.art-decor.org/elgaambbef-html-20230118T144941/tmp-1.2.40.0.34.6.0.11.9.14-2021-05-25T112752.html"
              test="not(.)">(atcdabbr_other_ParticipantBodyTranscriber)/d42e80592-true-d5729358e0: '<value-of select="name(..)"/>' ist als geschlossen definiert und dieses Element '<name/>' ist nicht erlaubt oder nicht mit diesem Inhalt erlaubt. Dies kann templateId, code oder id betreffen. Erwartet:  hl7:name[not(@nullFlavor)] (rule-reference: d42e80592-true-d5729358e0)</assert>
   </rule>

   <!-- Checking undefined contents for template/element @isClosed="true". Match context that we did not already match -->
   <rule fpi="RUL-QQQ"
         context="*[hl7:templateId[@root = '1.2.40.0.34.6.0.11.9.14']]/hl7:participantRole[not(@nullFlavor)]/hl7:playingEntity/hl7:name[not(@nullFlavor)]/*[not(@xsi:nil = 'true')][not(self::hl7:prefix | self::hl7:family[not(@nullFlavor)] | self::hl7:given[not(@nullFlavor)] | self::hl7:suffix)]"
         id="d42e80598-true-d5729387e0">
      <assert role="error"
              see="http://elga.art-decor.org/elgaambbef-html-20230118T144941/tmp-1.2.40.0.34.6.0.11.9.14-2021-05-25T112752.html"
              test="not(.)">(atcdabbr_other_ParticipantBodyTranscriber)/d42e80598-true-d5729387e0: '<value-of select="name(..)"/>' ist als geschlossen definiert und dieses Element '<name/>' ist nicht erlaubt oder nicht mit diesem Inhalt erlaubt. Dies kann templateId, code oder id betreffen. Erwartet:  hl7:prefix | hl7:family[not(@nullFlavor)] | hl7:given[not(@nullFlavor)] | hl7:suffix (rule-reference: d42e80598-true-d5729387e0)</assert>
   </rule>
</pattern>
