<?xml version="1.0" encoding="UTF-8"?>
<!--
Template derived pattern
===========================================
ID: 1.2.40.0.34.6.0.11.3.28
Name: Immunization Entry Impfung nicht angegeben
Description: Dokumentiert, dass keine Impfung verabreicht wurde. Dieses Entry wird weder im Stylesheet angezeigt, noch in der zentralen e-Impfpass-Anwendung gespeichert  - ist aber für IHE PCC-Konformität notwendig.
-->
<pattern xmlns="http://purl.oclc.org/dsdl/schematron"
         id="template-1.2.40.0.34.6.0.11.3.28-2022-03-10T141321-closed">
   <title>Immunization Entry Impfung nicht angegeben</title>

   <!-- Checking undefined contents for template/element @isClosed="true". Match context that we did not already match -->
   <rule fpi="RUL-QQQ"
         context="*[hl7:substanceAdministration[hl7:templateId[@root = '1.2.40.0.34.6.0.11.3.28']]]/*[not(@xsi:nil = 'true')][not(self::hl7:substanceAdministration[hl7:templateId[@root = '1.2.40.0.34.6.0.11.3.28']])]"
         id="d42e60340-true-d5306023e0">
      <assert role="error"
              see="http://elga.art-decor.org/elgaambbef-html-20230118T144941/tmp-1.2.40.0.34.6.0.11.3.28-2022-03-10T141321.html"
              test="not(.)">(atcdabbr_entry_ImmunizationImpfungNichtAngegeben)/d42e60340-true-d5306023e0: '<value-of select="name(..)"/>' ist als geschlossen definiert und dieses Element '<name/>' ist nicht erlaubt oder nicht mit diesem Inhalt erlaubt. Dies kann templateId, code oder id betreffen. Erwartet:  hl7:substanceAdministration[hl7:templateId[@root = '1.2.40.0.34.6.0.11.3.28']] (rule-reference: d42e60340-true-d5306023e0)</assert>
   </rule>

   <!-- Checking undefined contents for template/element @isClosed="true". Match context that we did not already match -->
   <rule fpi="RUL-QQQ"
         context="*[hl7:substanceAdministration[hl7:templateId[@root = '1.2.40.0.34.6.0.11.3.28']]]/hl7:substanceAdministration[hl7:templateId[@root = '1.2.40.0.34.6.0.11.3.28']]/*[not(@xsi:nil = 'true')][not(self::hl7:templateId[@root = '1.2.40.0.34.6.0.11.3.28'] | self::hl7:templateId[@root='2.16.840.1.113883.10.20.1.24'][not(@nullFlavor)] | self::hl7:templateId[@root='1.3.6.1.4.1.19376.1.5.3.1.4.12'][not(@nullFlavor)] | self::hl7:id[not(@nullFlavor)] | self::hl7:code[(@code = '90351000119108' and @codeSystem = '2.16.840.1.113883.6.96')] | self::hl7:text | self::hl7:statusCode[@code = 'completed'] | self::hl7:effectiveTime[@nullFlavor = 'UNK'] | self::hl7:routeCode[@nullFlavor = 'NA'] | self::hl7:approachSiteCode[@nullFlavor = 'NA'] | self::hl7:consumable[hl7:manufacturedProduct[hl7:templateId[@root = '1.2.40.0.34.6.0.11.9.31'] and hl7:templateId[@root = '2.16.840.1.113883.10.20.1.53'] and hl7:templateId[@root = '1.3.6.1.4.1.19376.1.5.3.1.4.7.2']]])]"
         id="d42e60396-true-d5306102e0">
      <assert role="error"
              see="http://elga.art-decor.org/elgaambbef-html-20230118T144941/tmp-1.2.40.0.34.6.0.11.3.28-2022-03-10T141321.html"
              test="not(.)">(atcdabbr_entry_ImmunizationImpfungNichtAngegeben)/d42e60396-true-d5306102e0: '<value-of select="name(..)"/>' ist als geschlossen definiert und dieses Element '<name/>' ist nicht erlaubt oder nicht mit diesem Inhalt erlaubt. Dies kann templateId, code oder id betreffen. Erwartet:  hl7:templateId[@root = '1.2.40.0.34.6.0.11.3.28'] | hl7:templateId[@root='2.16.840.1.113883.10.20.1.24'][not(@nullFlavor)] | hl7:templateId[@root='1.3.6.1.4.1.19376.1.5.3.1.4.12'][not(@nullFlavor)] | hl7:id[not(@nullFlavor)] | hl7:code[(@code = '90351000119108' and @codeSystem = '2.16.840.1.113883.6.96')] | hl7:text | hl7:statusCode[@code = 'completed'] | hl7:effectiveTime[@nullFlavor = 'UNK'] | hl7:routeCode[@nullFlavor = 'NA'] | hl7:approachSiteCode[@nullFlavor = 'NA'] | hl7:consumable[hl7:manufacturedProduct[hl7:templateId[@root = '1.2.40.0.34.6.0.11.9.31'] and hl7:templateId[@root = '2.16.840.1.113883.10.20.1.53'] and hl7:templateId[@root = '1.3.6.1.4.1.19376.1.5.3.1.4.7.2']]] (rule-reference: d42e60396-true-d5306102e0)</assert>
   </rule>

   <!-- Checking undefined contents for template/element @isClosed="true". Match context that we did not already match -->
   <rule fpi="RUL-QQQ"
         context="*[hl7:substanceAdministration[hl7:templateId[@root = '1.2.40.0.34.6.0.11.3.28']]]/hl7:substanceAdministration[hl7:templateId[@root = '1.2.40.0.34.6.0.11.3.28']]/hl7:text/*[not(@xsi:nil = 'true')][not(self::hl7:reference[not(@nullFlavor)])]"
         id="d5306129e54-true-d5306141e0">
      <assert role="error"
              see="http://elga.art-decor.org/elgaambbef-html-20230118T144941/tmp-1.2.40.0.34.6.0.11.9.1-2021-05-06T093820.html"
              test="not(.)">(atcdabrr_other_NarrativeTextReference)/d5306129e54-true-d5306141e0: '<value-of select="name(..)"/>' ist als geschlossen definiert und dieses Element '<name/>' ist nicht erlaubt oder nicht mit diesem Inhalt erlaubt. Dies kann templateId, code oder id betreffen. Erwartet:  hl7:reference[not(@nullFlavor)] (rule-reference: d5306129e54-true-d5306141e0)</assert>
   </rule>

   <!-- Checking undefined contents for template/element @isClosed="true". Match context that we did not already match -->
   <rule fpi="RUL-QQQ"
         context="*[hl7:substanceAdministration[hl7:templateId[@root = '1.2.40.0.34.6.0.11.3.28']]]/hl7:substanceAdministration[hl7:templateId[@root = '1.2.40.0.34.6.0.11.3.28']]/hl7:consumable[hl7:manufacturedProduct[hl7:templateId[@root = '1.2.40.0.34.6.0.11.9.31'] and hl7:templateId[@root = '2.16.840.1.113883.10.20.1.53'] and hl7:templateId[@root = '1.3.6.1.4.1.19376.1.5.3.1.4.7.2']]]/*[not(@xsi:nil = 'true')][not(self::hl7:manufacturedProduct[hl7:templateId[@root = '1.2.40.0.34.6.0.11.9.31'] and hl7:templateId[@root = '2.16.840.1.113883.10.20.1.53'] and hl7:templateId[@root = '1.3.6.1.4.1.19376.1.5.3.1.4.7.2']])]"
         id="d42e60519-true-d5306193e0">
      <assert role="error"
              see="http://elga.art-decor.org/elgaambbef-html-20230118T144941/tmp-1.2.40.0.34.6.0.11.3.28-2022-03-10T141321.html"
              test="not(.)">(atcdabbr_entry_ImmunizationImpfungNichtAngegeben)/d42e60519-true-d5306193e0: '<value-of select="name(..)"/>' ist als geschlossen definiert und dieses Element '<name/>' ist nicht erlaubt oder nicht mit diesem Inhalt erlaubt. Dies kann templateId, code oder id betreffen. Erwartet:  hl7:manufacturedProduct[hl7:templateId[@root = '1.2.40.0.34.6.0.11.9.31'] and hl7:templateId[@root = '2.16.840.1.113883.10.20.1.53'] and hl7:templateId[@root = '1.3.6.1.4.1.19376.1.5.3.1.4.7.2']] (rule-reference: d42e60519-true-d5306193e0)</assert>
   </rule>

   <!-- Checking undefined contents for template/element @isClosed="true". Match context that we did not already match -->
   <rule fpi="RUL-QQQ"
         context="*[hl7:substanceAdministration[hl7:templateId[@root = '1.2.40.0.34.6.0.11.3.28']]]/hl7:substanceAdministration[hl7:templateId[@root = '1.2.40.0.34.6.0.11.3.28']]/hl7:consumable[hl7:manufacturedProduct[hl7:templateId[@root = '1.2.40.0.34.6.0.11.9.31'] and hl7:templateId[@root = '2.16.840.1.113883.10.20.1.53'] and hl7:templateId[@root = '1.3.6.1.4.1.19376.1.5.3.1.4.7.2']]]/hl7:manufacturedProduct[hl7:templateId[@root = '1.2.40.0.34.6.0.11.9.31'] and hl7:templateId[@root = '2.16.840.1.113883.10.20.1.53'] and hl7:templateId[@root = '1.3.6.1.4.1.19376.1.5.3.1.4.7.2']]/*[not(@xsi:nil = 'true')][not(self::hl7:templateId[@root = '1.2.40.0.34.6.0.11.9.31'] | self::hl7:templateId[@root = '2.16.840.1.113883.10.20.1.53'] | self::hl7:templateId[@root = '1.3.6.1.4.1.19376.1.5.3.1.4.7.2'] | self::hl7:manufacturedMaterial[not(@nullFlavor)][hl7:code[@nullFlavor = 'NA']])]"
         id="d5306172e3-true-d5306231e0">
      <assert role="error"
              see="http://elga.art-decor.org/elgaambbef-html-20230118T144941/tmp-1.2.40.0.34.6.0.11.3.28-2022-03-10T141321.html"
              test="not(.)">(atcdabbr_entry_ImmunizationImpfungNichtAngegeben)/d5306172e3-true-d5306231e0: '<value-of select="name(..)"/>' ist als geschlossen definiert und dieses Element '<name/>' ist nicht erlaubt oder nicht mit diesem Inhalt erlaubt. Dies kann templateId, code oder id betreffen. Erwartet:  hl7:templateId[@root = '1.2.40.0.34.6.0.11.9.31'] | hl7:templateId[@root = '2.16.840.1.113883.10.20.1.53'] | hl7:templateId[@root = '1.3.6.1.4.1.19376.1.5.3.1.4.7.2'] | hl7:manufacturedMaterial[not(@nullFlavor)][hl7:code[@nullFlavor = 'NA']] (rule-reference: d5306172e3-true-d5306231e0)</assert>
   </rule>

   <!-- Checking undefined contents for template/element @isClosed="true". Match context that we did not already match -->
   <rule fpi="RUL-QQQ"
         context="*[hl7:substanceAdministration[hl7:templateId[@root = '1.2.40.0.34.6.0.11.3.28']]]/hl7:substanceAdministration[hl7:templateId[@root = '1.2.40.0.34.6.0.11.3.28']]/hl7:consumable[hl7:manufacturedProduct[hl7:templateId[@root = '1.2.40.0.34.6.0.11.9.31'] and hl7:templateId[@root = '2.16.840.1.113883.10.20.1.53'] and hl7:templateId[@root = '1.3.6.1.4.1.19376.1.5.3.1.4.7.2']]]/hl7:manufacturedProduct[hl7:templateId[@root = '1.2.40.0.34.6.0.11.9.31'] and hl7:templateId[@root = '2.16.840.1.113883.10.20.1.53'] and hl7:templateId[@root = '1.3.6.1.4.1.19376.1.5.3.1.4.7.2']]/hl7:manufacturedMaterial[not(@nullFlavor)][hl7:code[@nullFlavor = 'NA']]/*[not(@xsi:nil = 'true')][not(self::hl7:code[@nullFlavor = 'NA'])]"
         id="d5306172e31-true-d5306263e0">
      <assert role="error"
              see="http://elga.art-decor.org/elgaambbef-html-20230118T144941/tmp-1.2.40.0.34.6.0.11.3.28-2022-03-10T141321.html"
              test="not(.)">(atcdabbr_entry_ImmunizationImpfungNichtAngegeben)/d5306172e31-true-d5306263e0: '<value-of select="name(..)"/>' ist als geschlossen definiert und dieses Element '<name/>' ist nicht erlaubt oder nicht mit diesem Inhalt erlaubt. Dies kann templateId, code oder id betreffen. Erwartet:  hl7:code[@nullFlavor = 'NA'] (rule-reference: d5306172e31-true-d5306263e0)</assert>
   </rule>
</pattern>
