<?xml version="1.0" encoding="UTF-8"?>
<!--
Template derived pattern
===========================================
ID: 1.2.40.0.34.6.0.11.3.36
Name: Certainty Observation
Description: 
-->
<pattern xmlns="http://purl.oclc.org/dsdl/schematron"
         id="template-1.2.40.0.34.6.0.11.3.36-2021-02-19T124249">
   <title>Certainty Observation</title>
   <!--
Template derived rules for ID: 1.2.40.0.34.6.0.11.3.36
Context: *[hl7:observation[hl7:templateId[@root = '1.2.40.0.34.6.0.11.3.36'] and hl7:templateId[@root = '2.16.840.1.113883.10.22.10']]]
Item: (atcdabbr_entry_CertaintyObservation)
-->

   <!--
Template derived rules for ID: 1.2.40.0.34.6.0.11.3.36
Context: *[hl7:observation[hl7:templateId[@root = '1.2.40.0.34.6.0.11.3.36'] and hl7:templateId[@root = '2.16.840.1.113883.10.22.10']]]/hl7:observation[hl7:templateId[@root = '1.2.40.0.34.6.0.11.3.36'] and hl7:templateId[@root = '2.16.840.1.113883.10.22.10']]
Item: (atcdabbr_entry_CertaintyObservation)
-->

   <rule fpi="RULC-1"
         context="*[hl7:observation[hl7:templateId[@root = '1.2.40.0.34.6.0.11.3.36'] and hl7:templateId[@root = '2.16.840.1.113883.10.22.10']]]/hl7:observation[hl7:templateId[@root = '1.2.40.0.34.6.0.11.3.36'] and hl7:templateId[@root = '2.16.840.1.113883.10.22.10']]"
         id="d42e65390-false-d5431966e0">
      <assert role="error"
              see="http://elga.art-decor.org/elgaambbef-html-20230118T144941/tmp-1.2.40.0.34.6.0.11.3.36-2021-02-19T124249.html"
              test="string(@classCode) = ('OBS')">(atcdabbr_entry_CertaintyObservation): Der Wert von classCode MUSS 'OBS' sein. Gefunden: "<value-of select="@classCode"/>"</assert>
      <assert role="error"
              see="http://elga.art-decor.org/elgaambbef-html-20230118T144941/tmp-1.2.40.0.34.6.0.11.3.36-2021-02-19T124249.html"
              test="string(@moodCode) = ('EVN')">(atcdabbr_entry_CertaintyObservation): Der Wert von moodCode MUSS 'EVN' sein. Gefunden: "<value-of select="@moodCode"/>"</assert>
      <assert role="error"
              see="http://elga.art-decor.org/elgaambbef-html-20230118T144941/tmp-1.2.40.0.34.6.0.11.3.36-2021-02-19T124249.html"
              test="count(hl7:templateId[@root = '1.2.40.0.34.6.0.11.3.36']) &gt;= 1">(atcdabbr_entry_CertaintyObservation): Element hl7:templateId[@root = '1.2.40.0.34.6.0.11.3.36'] ist mandatory [min 1x].</assert>
      <assert role="error"
              see="http://elga.art-decor.org/elgaambbef-html-20230118T144941/tmp-1.2.40.0.34.6.0.11.3.36-2021-02-19T124249.html"
              test="count(hl7:templateId[@root = '1.2.40.0.34.6.0.11.3.36']) &lt;= 1">(atcdabbr_entry_CertaintyObservation): Element hl7:templateId[@root = '1.2.40.0.34.6.0.11.3.36'] kommt zu häufig vor [max 1x].</assert>
      <assert role="error"
              see="http://elga.art-decor.org/elgaambbef-html-20230118T144941/tmp-1.2.40.0.34.6.0.11.3.36-2021-02-19T124249.html"
              test="count(hl7:templateId[@root = '2.16.840.1.113883.10.22.10']) &gt;= 1">(atcdabbr_entry_CertaintyObservation): Element hl7:templateId[@root = '2.16.840.1.113883.10.22.10'] ist mandatory [min 1x].</assert>
      <assert role="error"
              see="http://elga.art-decor.org/elgaambbef-html-20230118T144941/tmp-1.2.40.0.34.6.0.11.3.36-2021-02-19T124249.html"
              test="count(hl7:templateId[@root = '2.16.840.1.113883.10.22.10']) &lt;= 1">(atcdabbr_entry_CertaintyObservation): Element hl7:templateId[@root = '2.16.840.1.113883.10.22.10'] kommt zu häufig vor [max 1x].</assert>
      <assert role="error"
              see="http://elga.art-decor.org/elgaambbef-html-20230118T144941/tmp-1.2.40.0.34.6.0.11.3.36-2021-02-19T124249.html"
              test="count(hl7:code[(@code = '66455-7' and @codeSystem = '2.16.840.1.113883.6.1')]) &gt;= 1">(atcdabbr_entry_CertaintyObservation): Element hl7:code[(@code = '66455-7' and @codeSystem = '2.16.840.1.113883.6.1')] ist mandatory [min 1x].</assert>
      <assert role="error"
              see="http://elga.art-decor.org/elgaambbef-html-20230118T144941/tmp-1.2.40.0.34.6.0.11.3.36-2021-02-19T124249.html"
              test="count(hl7:code[(@code = '66455-7' and @codeSystem = '2.16.840.1.113883.6.1')]) &lt;= 1">(atcdabbr_entry_CertaintyObservation): Element hl7:code[(@code = '66455-7' and @codeSystem = '2.16.840.1.113883.6.1')] kommt zu häufig vor [max 1x].</assert>
      <assert role="error"
              see="http://elga.art-decor.org/elgaambbef-html-20230118T144941/tmp-1.2.40.0.34.6.0.11.3.36-2021-02-19T124249.html"
              test="count(hl7:text[not(@nullFlavor)]) &gt;= 1">(atcdabbr_entry_CertaintyObservation): Element hl7:text[not(@nullFlavor)] ist mandatory [min 1x].</assert>
      <assert role="error"
              see="http://elga.art-decor.org/elgaambbef-html-20230118T144941/tmp-1.2.40.0.34.6.0.11.3.36-2021-02-19T124249.html"
              test="count(hl7:text[not(@nullFlavor)]) &lt;= 1">(atcdabbr_entry_CertaintyObservation): Element hl7:text[not(@nullFlavor)] kommt zu häufig vor [max 1x].</assert>
      <assert role="error"
              see="http://elga.art-decor.org/elgaambbef-html-20230118T144941/tmp-1.2.40.0.34.6.0.11.3.36-2021-02-19T124249.html"
              test="count(hl7:statusCode[@code = 'completed']) &gt;= 1">(atcdabbr_entry_CertaintyObservation): Element hl7:statusCode[@code = 'completed'] ist mandatory [min 1x].</assert>
      <assert role="error"
              see="http://elga.art-decor.org/elgaambbef-html-20230118T144941/tmp-1.2.40.0.34.6.0.11.3.36-2021-02-19T124249.html"
              test="count(hl7:statusCode[@code = 'completed']) &lt;= 1">(atcdabbr_entry_CertaintyObservation): Element hl7:statusCode[@code = 'completed'] kommt zu häufig vor [max 1x].</assert>
      <assert role="error"
              see="http://elga.art-decor.org/elgaambbef-html-20230118T144941/tmp-1.2.40.0.34.6.0.11.3.36-2021-02-19T124249.html"
              test="count(hl7:value[concat(@code, @codeSystem) = doc('include/voc-1.2.40.0.34.10.184-DYNAMIC.xml')//valueSet[1]/conceptList/concept/concat(@code, @codeSystem)]) &gt;= 1">(atcdabbr_entry_CertaintyObservation): Element hl7:value[concat(@code, @codeSystem) = doc('include/voc-1.2.40.0.34.10.184-DYNAMIC.xml')//valueSet[1]/conceptList/concept/concat(@code, @codeSystem)] ist mandatory [min 1x].</assert>
      <assert role="error"
              see="http://elga.art-decor.org/elgaambbef-html-20230118T144941/tmp-1.2.40.0.34.6.0.11.3.36-2021-02-19T124249.html"
              test="count(hl7:value[concat(@code, @codeSystem) = doc('include/voc-1.2.40.0.34.10.184-DYNAMIC.xml')//valueSet[1]/conceptList/concept/concat(@code, @codeSystem)]) &lt;= 1">(atcdabbr_entry_CertaintyObservation): Element hl7:value[concat(@code, @codeSystem) = doc('include/voc-1.2.40.0.34.10.184-DYNAMIC.xml')//valueSet[1]/conceptList/concept/concat(@code, @codeSystem)] kommt zu häufig vor [max 1x].</assert>
   </rule>
   <!--
Template derived rules for ID: 1.2.40.0.34.6.0.11.3.36
Context: *[hl7:observation[hl7:templateId[@root = '1.2.40.0.34.6.0.11.3.36'] and hl7:templateId[@root = '2.16.840.1.113883.10.22.10']]]/hl7:observation[hl7:templateId[@root = '1.2.40.0.34.6.0.11.3.36'] and hl7:templateId[@root = '2.16.840.1.113883.10.22.10']]/hl7:templateId[@root = '1.2.40.0.34.6.0.11.3.36']
Item: (atcdabbr_entry_CertaintyObservation)
-->

   <rule fpi="RULC-1"
         context="*[hl7:observation[hl7:templateId[@root = '1.2.40.0.34.6.0.11.3.36'] and hl7:templateId[@root = '2.16.840.1.113883.10.22.10']]]/hl7:observation[hl7:templateId[@root = '1.2.40.0.34.6.0.11.3.36'] and hl7:templateId[@root = '2.16.840.1.113883.10.22.10']]/hl7:templateId[@root = '1.2.40.0.34.6.0.11.3.36']"
         id="d42e65396-false-d5432044e0">
      <extends rule="II"/>
      <assert role="error"
              see="http://elga.art-decor.org/elgaambbef-html-20230118T144941/tmp-1.2.40.0.34.6.0.11.3.36-2021-02-19T124249.html"
              test="empty(@xsi:type) or resolve-QName(@xsi:type, .) = QName('urn:hl7-org:v3', 'II')">(atcdabbr_entry_CertaintyObservation): Wenn eine @xsi:type Instruktion anwesend ist MUSS diese den Wert "{urn:hl7-org:v3}:II" haben. Gefunden "{<value-of select="namespace-uri-from-QName(resolve-QName(@xsi:type,.))"/>}:<value-of select="local-name-from-QName(resolve-QName(@xsi:type,.))"/>"</assert>
      <assert role="error"
              see="http://elga.art-decor.org/elgaambbef-html-20230118T144941/tmp-1.2.40.0.34.6.0.11.3.36-2021-02-19T124249.html"
              test="string(@root) = ('1.2.40.0.34.6.0.11.3.36')">(atcdabbr_entry_CertaintyObservation): Der Wert von root MUSS '1.2.40.0.34.6.0.11.3.36' sein. Gefunden: "<value-of select="@root"/>"</assert>
   </rule>
   <!--
Template derived rules for ID: 1.2.40.0.34.6.0.11.3.36
Context: *[hl7:observation[hl7:templateId[@root = '1.2.40.0.34.6.0.11.3.36'] and hl7:templateId[@root = '2.16.840.1.113883.10.22.10']]]/hl7:observation[hl7:templateId[@root = '1.2.40.0.34.6.0.11.3.36'] and hl7:templateId[@root = '2.16.840.1.113883.10.22.10']]/hl7:templateId[@root = '2.16.840.1.113883.10.22.10']
Item: (atcdabbr_entry_CertaintyObservation)
-->

   <rule fpi="RULC-1"
         context="*[hl7:observation[hl7:templateId[@root = '1.2.40.0.34.6.0.11.3.36'] and hl7:templateId[@root = '2.16.840.1.113883.10.22.10']]]/hl7:observation[hl7:templateId[@root = '1.2.40.0.34.6.0.11.3.36'] and hl7:templateId[@root = '2.16.840.1.113883.10.22.10']]/hl7:templateId[@root = '2.16.840.1.113883.10.22.10']"
         id="d42e65404-false-d5432059e0">
      <extends rule="II"/>
      <assert role="error"
              see="http://elga.art-decor.org/elgaambbef-html-20230118T144941/tmp-1.2.40.0.34.6.0.11.3.36-2021-02-19T124249.html"
              test="empty(@xsi:type) or resolve-QName(@xsi:type, .) = QName('urn:hl7-org:v3', 'II')">(atcdabbr_entry_CertaintyObservation): Wenn eine @xsi:type Instruktion anwesend ist MUSS diese den Wert "{urn:hl7-org:v3}:II" haben. Gefunden "{<value-of select="namespace-uri-from-QName(resolve-QName(@xsi:type,.))"/>}:<value-of select="local-name-from-QName(resolve-QName(@xsi:type,.))"/>"</assert>
      <assert role="error"
              see="http://elga.art-decor.org/elgaambbef-html-20230118T144941/tmp-1.2.40.0.34.6.0.11.3.36-2021-02-19T124249.html"
              test="string(@root) = ('2.16.840.1.113883.10.22.10')">(atcdabbr_entry_CertaintyObservation): Der Wert von root MUSS '2.16.840.1.113883.10.22.10' sein. Gefunden: "<value-of select="@root"/>"</assert>
   </rule>
   <!--
Template derived rules for ID: 1.2.40.0.34.6.0.11.3.36
Context: *[hl7:observation[hl7:templateId[@root = '1.2.40.0.34.6.0.11.3.36'] and hl7:templateId[@root = '2.16.840.1.113883.10.22.10']]]/hl7:observation[hl7:templateId[@root = '1.2.40.0.34.6.0.11.3.36'] and hl7:templateId[@root = '2.16.840.1.113883.10.22.10']]/hl7:code[(@code = '66455-7' and @codeSystem = '2.16.840.1.113883.6.1')]
Item: (atcdabbr_entry_CertaintyObservation)
-->

   <rule fpi="RULC-1"
         context="*[hl7:observation[hl7:templateId[@root = '1.2.40.0.34.6.0.11.3.36'] and hl7:templateId[@root = '2.16.840.1.113883.10.22.10']]]/hl7:observation[hl7:templateId[@root = '1.2.40.0.34.6.0.11.3.36'] and hl7:templateId[@root = '2.16.840.1.113883.10.22.10']]/hl7:code[(@code = '66455-7' and @codeSystem = '2.16.840.1.113883.6.1')]"
         id="d42e65412-false-d5432074e0">
      <extends rule="CE"/>
      <assert role="error"
              see="http://elga.art-decor.org/elgaambbef-html-20230118T144941/tmp-1.2.40.0.34.6.0.11.3.36-2021-02-19T124249.html"
              test="empty(@xsi:type) or resolve-QName(@xsi:type, .) = QName('urn:hl7-org:v3', 'CE')">(atcdabbr_entry_CertaintyObservation): Wenn eine @xsi:type Instruktion anwesend ist MUSS diese den Wert "{urn:hl7-org:v3}:CE" haben. Gefunden "{<value-of select="namespace-uri-from-QName(resolve-QName(@xsi:type,.))"/>}:<value-of select="local-name-from-QName(resolve-QName(@xsi:type,.))"/>"</assert>
      <assert role="error"
              see="http://elga.art-decor.org/elgaambbef-html-20230118T144941/tmp-1.2.40.0.34.6.0.11.3.36-2021-02-19T124249.html"
              test="@nullFlavor or (@code='66455-7' and @codeSystem='2.16.840.1.113883.6.1' and @displayName='Condition status' and @codeSystemName='LOINC')">(atcdabbr_entry_CertaintyObservation): Der Elementinhalt MUSS einer von 'code '66455-7' codeSystem '2.16.840.1.113883.6.1' displayName='Condition status' codeSystemName='LOINC'' sein.</assert>
   </rule>
   <!--
Template derived rules for ID: 1.2.40.0.34.6.0.11.9.1
Context: *[hl7:observation[hl7:templateId[@root = '1.2.40.0.34.6.0.11.3.36'] and hl7:templateId[@root = '2.16.840.1.113883.10.22.10']]]/hl7:observation[hl7:templateId[@root = '1.2.40.0.34.6.0.11.3.36'] and hl7:templateId[@root = '2.16.840.1.113883.10.22.10']]/hl7:text
Item: (atcdabrr_other_NarrativeTextReference)
-->

   <rule fpi="RULC-1"
         context="*[hl7:observation[hl7:templateId[@root = '1.2.40.0.34.6.0.11.3.36'] and hl7:templateId[@root = '2.16.840.1.113883.10.22.10']]]/hl7:observation[hl7:templateId[@root = '1.2.40.0.34.6.0.11.3.36'] and hl7:templateId[@root = '2.16.840.1.113883.10.22.10']]/hl7:text"
         id="d5432075e67-false-d5432091e0">
      <extends rule="ED"/>
      <assert role="error"
              see="http://elga.art-decor.org/elgaambbef-html-20230118T144941/tmp-1.2.40.0.34.6.0.11.9.1-2021-05-06T093820.html"
              test="empty(@xsi:type) or resolve-QName(@xsi:type, .) = QName('urn:hl7-org:v3', 'ED')">(atcdabrr_other_NarrativeTextReference): Wenn eine @xsi:type Instruktion anwesend ist MUSS diese den Wert "{urn:hl7-org:v3}:ED" haben. Gefunden "{<value-of select="namespace-uri-from-QName(resolve-QName(@xsi:type,.))"/>}:<value-of select="local-name-from-QName(resolve-QName(@xsi:type,.))"/>"</assert>
      <assert role="error"
              see="http://elga.art-decor.org/elgaambbef-html-20230118T144941/tmp-1.2.40.0.34.6.0.11.9.1-2021-05-06T093820.html"
              test="count(hl7:reference[not(@nullFlavor)]) &gt;= 1">(atcdabrr_other_NarrativeTextReference): Element hl7:reference[not(@nullFlavor)] ist mandatory [min 1x].</assert>
      <assert role="error"
              see="http://elga.art-decor.org/elgaambbef-html-20230118T144941/tmp-1.2.40.0.34.6.0.11.9.1-2021-05-06T093820.html"
              test="count(hl7:reference[not(@nullFlavor)]) &lt;= 1">(atcdabrr_other_NarrativeTextReference): Element hl7:reference[not(@nullFlavor)] kommt zu häufig vor [max 1x].</assert>
   </rule>
   <!--
Template derived rules for ID: 1.2.40.0.34.6.0.11.9.1
Context: *[hl7:observation[hl7:templateId[@root = '1.2.40.0.34.6.0.11.3.36'] and hl7:templateId[@root = '2.16.840.1.113883.10.22.10']]]/hl7:observation[hl7:templateId[@root = '1.2.40.0.34.6.0.11.3.36'] and hl7:templateId[@root = '2.16.840.1.113883.10.22.10']]/hl7:text/hl7:reference[not(@nullFlavor)]
Item: (atcdabrr_other_NarrativeTextReference)
-->

   <rule fpi="RULC-1"
         context="*[hl7:observation[hl7:templateId[@root = '1.2.40.0.34.6.0.11.3.36'] and hl7:templateId[@root = '2.16.840.1.113883.10.22.10']]]/hl7:observation[hl7:templateId[@root = '1.2.40.0.34.6.0.11.3.36'] and hl7:templateId[@root = '2.16.840.1.113883.10.22.10']]/hl7:text/hl7:reference[not(@nullFlavor)]"
         id="d5432075e69-false-d5432110e0">
      <extends rule="TEL"/>
      <assert role="error"
              see="http://elga.art-decor.org/elgaambbef-html-20230118T144941/tmp-1.2.40.0.34.6.0.11.9.1-2021-05-06T093820.html"
              test="empty(@xsi:type) or resolve-QName(@xsi:type, .) = QName('urn:hl7-org:v3', 'TEL')">(atcdabrr_other_NarrativeTextReference): Wenn eine @xsi:type Instruktion anwesend ist MUSS diese den Wert "{urn:hl7-org:v3}:TEL" haben. Gefunden "{<value-of select="namespace-uri-from-QName(resolve-QName(@xsi:type,.))"/>}:<value-of select="local-name-from-QName(resolve-QName(@xsi:type,.))"/>"</assert>
      <assert role="error"
              see="http://elga.art-decor.org/elgaambbef-html-20230118T144941/tmp-1.2.40.0.34.6.0.11.9.1-2021-05-06T093820.html"
              test="@value">(atcdabrr_other_NarrativeTextReference): Attribut @value MUSS vorkommen.</assert>
      <assert role="error"
              see="http://elga.art-decor.org/elgaambbef-html-20230118T144941/tmp-1.2.40.0.34.6.0.11.9.1-2021-05-06T093820.html"
              test="starts-with(@value,'#') or starts-with(@value,'http')">(atcdabrr_other_NarrativeTextReference): The @value attribute content MUST conform to the format '#xxx', where xxx is the ID of the corresponding 'content'-element, or begin with the 'http' or 'https' url-scheme.</assert>
   </rule>
   <!--
Template derived rules for ID: 1.2.40.0.34.6.0.11.3.36
Context: *[hl7:observation[hl7:templateId[@root = '1.2.40.0.34.6.0.11.3.36'] and hl7:templateId[@root = '2.16.840.1.113883.10.22.10']]]/hl7:observation[hl7:templateId[@root = '1.2.40.0.34.6.0.11.3.36'] and hl7:templateId[@root = '2.16.840.1.113883.10.22.10']]/hl7:statusCode[@code = 'completed']
Item: (atcdabbr_entry_CertaintyObservation)
-->

   <rule fpi="RULC-1"
         context="*[hl7:observation[hl7:templateId[@root = '1.2.40.0.34.6.0.11.3.36'] and hl7:templateId[@root = '2.16.840.1.113883.10.22.10']]]/hl7:observation[hl7:templateId[@root = '1.2.40.0.34.6.0.11.3.36'] and hl7:templateId[@root = '2.16.840.1.113883.10.22.10']]/hl7:statusCode[@code = 'completed']"
         id="d42e65424-false-d5432125e0">
      <extends rule="CS"/>
      <assert role="error"
              see="http://elga.art-decor.org/elgaambbef-html-20230118T144941/tmp-1.2.40.0.34.6.0.11.3.36-2021-02-19T124249.html"
              test="empty(@xsi:type) or resolve-QName(@xsi:type, .) = QName('urn:hl7-org:v3', 'CS')">(atcdabbr_entry_CertaintyObservation): Wenn eine @xsi:type Instruktion anwesend ist MUSS diese den Wert "{urn:hl7-org:v3}:CS" haben. Gefunden "{<value-of select="namespace-uri-from-QName(resolve-QName(@xsi:type,.))"/>}:<value-of select="local-name-from-QName(resolve-QName(@xsi:type,.))"/>"</assert>
      <assert role="error"
              see="http://elga.art-decor.org/elgaambbef-html-20230118T144941/tmp-1.2.40.0.34.6.0.11.3.36-2021-02-19T124249.html"
              test="@nullFlavor or (@code='completed')">(atcdabbr_entry_CertaintyObservation): Der Elementinhalt MUSS einer von 'code 'completed'' sein.</assert>
   </rule>
   <!--
Template derived rules for ID: 1.2.40.0.34.6.0.11.3.36
Context: *[hl7:observation[hl7:templateId[@root = '1.2.40.0.34.6.0.11.3.36'] and hl7:templateId[@root = '2.16.840.1.113883.10.22.10']]]/hl7:observation[hl7:templateId[@root = '1.2.40.0.34.6.0.11.3.36'] and hl7:templateId[@root = '2.16.840.1.113883.10.22.10']]/hl7:value[concat(@code, @codeSystem) = doc('include/voc-1.2.40.0.34.10.184-DYNAMIC.xml')//valueSet[1]/conceptList/concept/concat(@code, @codeSystem)]
Item: (atcdabbr_entry_CertaintyObservation)
-->

   <rule fpi="RULC-1"
         context="*[hl7:observation[hl7:templateId[@root = '1.2.40.0.34.6.0.11.3.36'] and hl7:templateId[@root = '2.16.840.1.113883.10.22.10']]]/hl7:observation[hl7:templateId[@root = '1.2.40.0.34.6.0.11.3.36'] and hl7:templateId[@root = '2.16.840.1.113883.10.22.10']]/hl7:value[concat(@code, @codeSystem) = doc('include/voc-1.2.40.0.34.10.184-DYNAMIC.xml')//valueSet[1]/conceptList/concept/concat(@code, @codeSystem)]"
         id="d42e65433-false-d5432144e0">
      <extends rule="CD"/>
      <let name="theCode" value="@code"/>
      <let name="theCodeSystem" value="@codeSystem"/>
      <assert role="error"
              see="http://elga.art-decor.org/elgaambbef-html-20230118T144941/tmp-1.2.40.0.34.6.0.11.3.36-2021-02-19T124249.html"
              test="@nullFlavor or exists(doc('include/voc-1.2.40.0.34.10.184-DYNAMIC.xml')//valueSet[1][conceptList/concept[@code = $theCode][@codeSystem = $theCodeSystem]])">(atcdabbr_entry_CertaintyObservation): Der Elementinhalt MUSS einer von '1.2.40.0.34.10.184 ELGA_ConditionVerificationStatus (DYNAMIC)' sein.</assert>
      <let name="xsiLocalName"
           value="if (contains(@xsi:type, ':')) then substring-after(@xsi:type,':') else @xsi:type"/>
      <let name="xsiLocalNS"
           value="if (contains(@xsi:type, ':')) then namespace-uri-for-prefix(substring-before(@xsi:type,':'),.) else namespace-uri-for-prefix('',.)"/>
      <assert role="error"
              see="http://elga.art-decor.org/elgaambbef-html-20230118T144941/tmp-1.2.40.0.34.6.0.11.3.36-2021-02-19T124249.html"
              test="@nullFlavor or ($xsiLocalName='CD' and $xsiLocalNS='urn:hl7-org:v3')">(atcdabbr_entry_CertaintyObservation): Wenn eine @xsi:type Instruktion anwesend ist MUSS diese den Wert "{urn:hl7-org:v3}:CD" haben. Gefunden "{<value-of select="namespace-uri-from-QName(resolve-QName(@xsi:type,.))"/>}:<value-of select="local-name-from-QName(resolve-QName(@xsi:type,.))"/>"</assert>
   </rule>
</pattern>
