<?xml version="1.0" encoding="UTF-8"?>
<!--
Template derived pattern
===========================================
ID: 1.2.40.0.34.6.0.11.3.14
Name: External Document Entry
Description: 
-->
<pattern xmlns="http://purl.oclc.org/dsdl/schematron"
         id="template-1.2.40.0.34.6.0.11.3.14-2019-05-06T140033">
   <title>External Document Entry</title>
   <!--
Template derived rules for ID: 1.2.40.0.34.6.0.11.3.14
Context: *[hl7:externalDocument[hl7:templateId[@root = '1.2.40.0.34.6.0.11.3.14']]]
Item: (atcdabbr_entry_externalDocument)
-->

   <!--
Template derived rules for ID: 1.2.40.0.34.6.0.11.3.14
Context: *[hl7:externalDocument[hl7:templateId[@root = '1.2.40.0.34.6.0.11.3.14']]]/hl7:externalDocument[hl7:templateId[@root = '1.2.40.0.34.6.0.11.3.14']]
Item: (atcdabbr_entry_externalDocument)
-->

   <rule fpi="RULC-1"
         context="*[hl7:externalDocument[hl7:templateId[@root = '1.2.40.0.34.6.0.11.3.14']]]/hl7:externalDocument[hl7:templateId[@root = '1.2.40.0.34.6.0.11.3.14']]"
         id="d42e57294-false-d5193916e0">
      <assert role="error"
              see="http://elga.art-decor.org/elgaambbef-html-20230118T144941/tmp-1.2.40.0.34.6.0.11.3.14-2019-05-06T140033.html"
              test="string(@classCode) = ('DOC') or not(@classCode)">(atcdabbr_entry_externalDocument): Der Wert von classCode MUSS 'DOC' sein. Gefunden: "<value-of select="@classCode"/>"</assert>
      <assert role="error"
              see="http://elga.art-decor.org/elgaambbef-html-20230118T144941/tmp-1.2.40.0.34.6.0.11.3.14-2019-05-06T140033.html"
              test="string(@moodCode) = ('EVN') or not(@moodCode)">(atcdabbr_entry_externalDocument): Der Wert von moodCode MUSS 'EVN' sein. Gefunden: "<value-of select="@moodCode"/>"</assert>
      <assert role="error"
              see="http://elga.art-decor.org/elgaambbef-html-20230118T144941/tmp-1.2.40.0.34.6.0.11.3.14-2019-05-06T140033.html"
              test="count(hl7:templateId[@root = '1.2.40.0.34.6.0.11.3.14']) &gt;= 1">(atcdabbr_entry_externalDocument): Element hl7:templateId[@root = '1.2.40.0.34.6.0.11.3.14'] ist mandatory [min 1x].</assert>
      <assert role="error"
              see="http://elga.art-decor.org/elgaambbef-html-20230118T144941/tmp-1.2.40.0.34.6.0.11.3.14-2019-05-06T140033.html"
              test="count(hl7:templateId[@root = '1.2.40.0.34.6.0.11.3.14']) &lt;= 1">(atcdabbr_entry_externalDocument): Element hl7:templateId[@root = '1.2.40.0.34.6.0.11.3.14'] kommt zu häufig vor [max 1x].</assert>
      <assert role="error"
              see="http://elga.art-decor.org/elgaambbef-html-20230118T144941/tmp-1.2.40.0.34.6.0.11.3.14-2019-05-06T140033.html"
              test="count(hl7:id[not(@nullFlavor)]) &gt;= 1">(atcdabbr_entry_externalDocument): Element hl7:id[not(@nullFlavor)] ist mandatory [min 1x].</assert>
      <assert role="error"
              see="http://elga.art-decor.org/elgaambbef-html-20230118T144941/tmp-1.2.40.0.34.6.0.11.3.14-2019-05-06T140033.html"
              test="count(hl7:id[not(@nullFlavor)]) &lt;= 1">(atcdabbr_entry_externalDocument): Element hl7:id[not(@nullFlavor)] kommt zu häufig vor [max 1x].</assert>
      <assert role="error"
              see="http://elga.art-decor.org/elgaambbef-html-20230118T144941/tmp-1.2.40.0.34.6.0.11.3.14-2019-05-06T140033.html"
              test="count(hl7:code) &lt;= 1">(atcdabbr_entry_externalDocument): Element hl7:code kommt zu häufig vor [max 1x].</assert>
      <assert role="error"
              see="http://elga.art-decor.org/elgaambbef-html-20230118T144941/tmp-1.2.40.0.34.6.0.11.3.14-2019-05-06T140033.html"
              test="count(hl7:text[not(@nullFlavor)]) &gt;= 1">(atcdabbr_entry_externalDocument): Element hl7:text[not(@nullFlavor)] ist mandatory [min 1x].</assert>
      <assert role="error"
              see="http://elga.art-decor.org/elgaambbef-html-20230118T144941/tmp-1.2.40.0.34.6.0.11.3.14-2019-05-06T140033.html"
              test="count(hl7:text[not(@nullFlavor)]) &lt;= 1">(atcdabbr_entry_externalDocument): Element hl7:text[not(@nullFlavor)] kommt zu häufig vor [max 1x].</assert>
      <assert role="error"
              see="http://elga.art-decor.org/elgaambbef-html-20230118T144941/tmp-1.2.40.0.34.6.0.11.3.14-2019-05-06T140033.html"
              test="count(hl7:setId[not(@nullFlavor)]) &lt;= 1">(atcdabbr_entry_externalDocument): Element hl7:setId[not(@nullFlavor)] kommt zu häufig vor [max 1x].</assert>
      <assert role="error"
              see="http://elga.art-decor.org/elgaambbef-html-20230118T144941/tmp-1.2.40.0.34.6.0.11.3.14-2019-05-06T140033.html"
              test="count(hl7:versionNumber[not(@nullFlavor)]) &lt;= 1">(atcdabbr_entry_externalDocument): Element hl7:versionNumber[not(@nullFlavor)] kommt zu häufig vor [max 1x].</assert>
   </rule>
   <!--
Template derived rules for ID: 1.2.40.0.34.6.0.11.3.14
Context: *[hl7:externalDocument[hl7:templateId[@root = '1.2.40.0.34.6.0.11.3.14']]]/hl7:externalDocument[hl7:templateId[@root = '1.2.40.0.34.6.0.11.3.14']]/hl7:templateId[@root = '1.2.40.0.34.6.0.11.3.14']
Item: (atcdabbr_entry_externalDocument)
-->

   <rule fpi="RULC-1"
         context="*[hl7:externalDocument[hl7:templateId[@root = '1.2.40.0.34.6.0.11.3.14']]]/hl7:externalDocument[hl7:templateId[@root = '1.2.40.0.34.6.0.11.3.14']]/hl7:templateId[@root = '1.2.40.0.34.6.0.11.3.14']"
         id="d42e57300-false-d5193978e0">
      <extends rule="II"/>
      <assert role="error"
              see="http://elga.art-decor.org/elgaambbef-html-20230118T144941/tmp-1.2.40.0.34.6.0.11.3.14-2019-05-06T140033.html"
              test="empty(@xsi:type) or resolve-QName(@xsi:type, .) = QName('urn:hl7-org:v3', 'II')">(atcdabbr_entry_externalDocument): Wenn eine @xsi:type Instruktion anwesend ist MUSS diese den Wert "{urn:hl7-org:v3}:II" haben. Gefunden "{<value-of select="namespace-uri-from-QName(resolve-QName(@xsi:type,.))"/>}:<value-of select="local-name-from-QName(resolve-QName(@xsi:type,.))"/>"</assert>
      <assert role="error"
              see="http://elga.art-decor.org/elgaambbef-html-20230118T144941/tmp-1.2.40.0.34.6.0.11.3.14-2019-05-06T140033.html"
              test="string(@root) = ('1.2.40.0.34.6.0.11.3.14')">(atcdabbr_entry_externalDocument): Der Wert von root MUSS '1.2.40.0.34.6.0.11.3.14' sein. Gefunden: "<value-of select="@root"/>"</assert>
   </rule>
   <!--
Template derived rules for ID: 1.2.40.0.34.6.0.11.3.14
Context: *[hl7:externalDocument[hl7:templateId[@root = '1.2.40.0.34.6.0.11.3.14']]]/hl7:externalDocument[hl7:templateId[@root = '1.2.40.0.34.6.0.11.3.14']]/hl7:id[not(@nullFlavor)]
Item: (atcdabbr_entry_externalDocument)
-->

   <rule fpi="RULC-1"
         context="*[hl7:externalDocument[hl7:templateId[@root = '1.2.40.0.34.6.0.11.3.14']]]/hl7:externalDocument[hl7:templateId[@root = '1.2.40.0.34.6.0.11.3.14']]/hl7:id[not(@nullFlavor)]"
         id="d42e57309-false-d5193992e0">
      <extends rule="II"/>
      <assert role="error"
              see="http://elga.art-decor.org/elgaambbef-html-20230118T144941/tmp-1.2.40.0.34.6.0.11.3.14-2019-05-06T140033.html"
              test="empty(@xsi:type) or resolve-QName(@xsi:type, .) = QName('urn:hl7-org:v3', 'II')">(atcdabbr_entry_externalDocument): Wenn eine @xsi:type Instruktion anwesend ist MUSS diese den Wert "{urn:hl7-org:v3}:II" haben. Gefunden "{<value-of select="namespace-uri-from-QName(resolve-QName(@xsi:type,.))"/>}:<value-of select="local-name-from-QName(resolve-QName(@xsi:type,.))"/>"</assert>
   </rule>
   <!--
Template derived rules for ID: 1.2.40.0.34.6.0.11.3.14
Context: *[hl7:externalDocument[hl7:templateId[@root = '1.2.40.0.34.6.0.11.3.14']]]/hl7:externalDocument[hl7:templateId[@root = '1.2.40.0.34.6.0.11.3.14']]/hl7:code
Item: (atcdabbr_entry_externalDocument)
-->

   <rule fpi="RULC-1"
         context="*[hl7:externalDocument[hl7:templateId[@root = '1.2.40.0.34.6.0.11.3.14']]]/hl7:externalDocument[hl7:templateId[@root = '1.2.40.0.34.6.0.11.3.14']]/hl7:code"
         id="d42e57320-false-d5194002e0">
      <extends rule="CD"/>
      <assert role="error"
              see="http://elga.art-decor.org/elgaambbef-html-20230118T144941/tmp-1.2.40.0.34.6.0.11.3.14-2019-05-06T140033.html"
              test="empty(@xsi:type) or resolve-QName(@xsi:type, .) = QName('urn:hl7-org:v3', 'CD')">(atcdabbr_entry_externalDocument): Wenn eine @xsi:type Instruktion anwesend ist MUSS diese den Wert "{urn:hl7-org:v3}:CD" haben. Gefunden "{<value-of select="namespace-uri-from-QName(resolve-QName(@xsi:type,.))"/>}:<value-of select="local-name-from-QName(resolve-QName(@xsi:type,.))"/>"</assert>
      <assert role="error"
              see="http://elga.art-decor.org/elgaambbef-html-20230118T144941/tmp-1.2.40.0.34.6.0.11.3.14-2019-05-06T140033.html"
              test="@codeSystem">(atcdabbr_entry_externalDocument): Attribut @codeSystem MUSS vorkommen.</assert>
      <assert role="error"
              see="http://elga.art-decor.org/elgaambbef-html-20230118T144941/tmp-1.2.40.0.34.6.0.11.3.14-2019-05-06T140033.html"
              test="not(@codeSystem) or matches(@codeSystem,'^[0-2](\.(0|[1-9]\d*))*$')">(atcdabbr_entry_externalDocument): Attribute @codeSystem MUSS vom Datentyp 'oid' sein  - '<value-of select="@codeSystem"/>'</assert>
      <assert role="error"
              see="http://elga.art-decor.org/elgaambbef-html-20230118T144941/tmp-1.2.40.0.34.6.0.11.3.14-2019-05-06T140033.html"
              test="@code">(atcdabbr_entry_externalDocument): Attribut @code MUSS vorkommen.</assert>
      <assert role="error"
              see="http://elga.art-decor.org/elgaambbef-html-20230118T144941/tmp-1.2.40.0.34.6.0.11.3.14-2019-05-06T140033.html"
              test="not(@code) or (string-length(@code) &gt; 0 and not(matches(@code,'\s')))">(atcdabbr_entry_externalDocument): Attribute @code MUSS vom Datentyp 'cs' sein  - '<value-of select="@code"/>'</assert>
   </rule>
   <!--
Template derived rules for ID: 1.2.40.0.34.6.0.11.9.1
Context: *[hl7:externalDocument[hl7:templateId[@root = '1.2.40.0.34.6.0.11.3.14']]]/hl7:externalDocument[hl7:templateId[@root = '1.2.40.0.34.6.0.11.3.14']]/hl7:text
Item: (atcdabrr_other_NarrativeTextReference)
-->

   <rule fpi="RULC-1"
         context="*[hl7:externalDocument[hl7:templateId[@root = '1.2.40.0.34.6.0.11.3.14']]]/hl7:externalDocument[hl7:templateId[@root = '1.2.40.0.34.6.0.11.3.14']]/hl7:text"
         id="d5194003e77-false-d5194024e0">
      <extends rule="ED"/>
      <assert role="error"
              see="http://elga.art-decor.org/elgaambbef-html-20230118T144941/tmp-1.2.40.0.34.6.0.11.9.1-2021-05-06T093820.html"
              test="empty(@xsi:type) or resolve-QName(@xsi:type, .) = QName('urn:hl7-org:v3', 'ED')">(atcdabrr_other_NarrativeTextReference): Wenn eine @xsi:type Instruktion anwesend ist MUSS diese den Wert "{urn:hl7-org:v3}:ED" haben. Gefunden "{<value-of select="namespace-uri-from-QName(resolve-QName(@xsi:type,.))"/>}:<value-of select="local-name-from-QName(resolve-QName(@xsi:type,.))"/>"</assert>
      <assert role="error"
              see="http://elga.art-decor.org/elgaambbef-html-20230118T144941/tmp-1.2.40.0.34.6.0.11.9.1-2021-05-06T093820.html"
              test="count(hl7:reference[not(@nullFlavor)]) &gt;= 1">(atcdabrr_other_NarrativeTextReference): Element hl7:reference[not(@nullFlavor)] ist mandatory [min 1x].</assert>
      <assert role="error"
              see="http://elga.art-decor.org/elgaambbef-html-20230118T144941/tmp-1.2.40.0.34.6.0.11.9.1-2021-05-06T093820.html"
              test="count(hl7:reference[not(@nullFlavor)]) &lt;= 1">(atcdabrr_other_NarrativeTextReference): Element hl7:reference[not(@nullFlavor)] kommt zu häufig vor [max 1x].</assert>
   </rule>
   <!--
Template derived rules for ID: 1.2.40.0.34.6.0.11.9.1
Context: *[hl7:externalDocument[hl7:templateId[@root = '1.2.40.0.34.6.0.11.3.14']]]/hl7:externalDocument[hl7:templateId[@root = '1.2.40.0.34.6.0.11.3.14']]/hl7:text/hl7:reference[not(@nullFlavor)]
Item: (atcdabrr_other_NarrativeTextReference)
-->

   <rule fpi="RULC-1"
         context="*[hl7:externalDocument[hl7:templateId[@root = '1.2.40.0.34.6.0.11.3.14']]]/hl7:externalDocument[hl7:templateId[@root = '1.2.40.0.34.6.0.11.3.14']]/hl7:text/hl7:reference[not(@nullFlavor)]"
         id="d5194003e79-false-d5194043e0">
      <extends rule="TEL"/>
      <assert role="error"
              see="http://elga.art-decor.org/elgaambbef-html-20230118T144941/tmp-1.2.40.0.34.6.0.11.9.1-2021-05-06T093820.html"
              test="empty(@xsi:type) or resolve-QName(@xsi:type, .) = QName('urn:hl7-org:v3', 'TEL')">(atcdabrr_other_NarrativeTextReference): Wenn eine @xsi:type Instruktion anwesend ist MUSS diese den Wert "{urn:hl7-org:v3}:TEL" haben. Gefunden "{<value-of select="namespace-uri-from-QName(resolve-QName(@xsi:type,.))"/>}:<value-of select="local-name-from-QName(resolve-QName(@xsi:type,.))"/>"</assert>
      <assert role="error"
              see="http://elga.art-decor.org/elgaambbef-html-20230118T144941/tmp-1.2.40.0.34.6.0.11.9.1-2021-05-06T093820.html"
              test="@value">(atcdabrr_other_NarrativeTextReference): Attribut @value MUSS vorkommen.</assert>
      <assert role="error"
              see="http://elga.art-decor.org/elgaambbef-html-20230118T144941/tmp-1.2.40.0.34.6.0.11.9.1-2021-05-06T093820.html"
              test="starts-with(@value,'#') or starts-with(@value,'http')">(atcdabrr_other_NarrativeTextReference): The @value attribute content MUST conform to the format '#xxx', where xxx is the ID of the corresponding 'content'-element, or begin with the 'http' or 'https' url-scheme.</assert>
   </rule>
   <!--
Template derived rules for ID: 1.2.40.0.34.6.0.11.3.14
Context: *[hl7:externalDocument[hl7:templateId[@root = '1.2.40.0.34.6.0.11.3.14']]]/hl7:externalDocument[hl7:templateId[@root = '1.2.40.0.34.6.0.11.3.14']]/hl7:setId[not(@nullFlavor)]
Item: (atcdabbr_entry_externalDocument)
-->

   <rule fpi="RULC-1"
         context="*[hl7:externalDocument[hl7:templateId[@root = '1.2.40.0.34.6.0.11.3.14']]]/hl7:externalDocument[hl7:templateId[@root = '1.2.40.0.34.6.0.11.3.14']]/hl7:setId[not(@nullFlavor)]"
         id="d42e57352-false-d5194055e0">
      <extends rule="II"/>
      <assert role="error"
              see="http://elga.art-decor.org/elgaambbef-html-20230118T144941/tmp-1.2.40.0.34.6.0.11.3.14-2019-05-06T140033.html"
              test="empty(@xsi:type) or resolve-QName(@xsi:type, .) = QName('urn:hl7-org:v3', 'II')">(atcdabbr_entry_externalDocument): Wenn eine @xsi:type Instruktion anwesend ist MUSS diese den Wert "{urn:hl7-org:v3}:II" haben. Gefunden "{<value-of select="namespace-uri-from-QName(resolve-QName(@xsi:type,.))"/>}:<value-of select="local-name-from-QName(resolve-QName(@xsi:type,.))"/>"</assert>
   </rule>
   <!--
Template derived rules for ID: 1.2.40.0.34.6.0.11.3.14
Context: *[hl7:externalDocument[hl7:templateId[@root = '1.2.40.0.34.6.0.11.3.14']]]/hl7:externalDocument[hl7:templateId[@root = '1.2.40.0.34.6.0.11.3.14']]/hl7:versionNumber[not(@nullFlavor)]
Item: (atcdabbr_entry_externalDocument)
-->

   <rule fpi="RULC-1"
         context="*[hl7:externalDocument[hl7:templateId[@root = '1.2.40.0.34.6.0.11.3.14']]]/hl7:externalDocument[hl7:templateId[@root = '1.2.40.0.34.6.0.11.3.14']]/hl7:versionNumber[not(@nullFlavor)]"
         id="d42e57362-false-d5194063e0">
      <extends rule="INT"/>
      <assert role="error"
              see="http://elga.art-decor.org/elgaambbef-html-20230118T144941/tmp-1.2.40.0.34.6.0.11.3.14-2019-05-06T140033.html"
              test="empty(@xsi:type) or resolve-QName(@xsi:type, .) = QName('urn:hl7-org:v3', 'INT')">(atcdabbr_entry_externalDocument): Wenn eine @xsi:type Instruktion anwesend ist MUSS diese den Wert "{urn:hl7-org:v3}:INT" haben. Gefunden "{<value-of select="namespace-uri-from-QName(resolve-QName(@xsi:type,.))"/>}:<value-of select="local-name-from-QName(resolve-QName(@xsi:type,.))"/>"</assert>
      <assert role="error"
              see="http://elga.art-decor.org/elgaambbef-html-20230118T144941/tmp-1.2.40.0.34.6.0.11.3.14-2019-05-06T140033.html"
              test="not(@value) or matches(@value, '^-?[1-9]\d*$|^+?\d*$')">(atcdabbr_entry_externalDocument): @value ist keine gültige INT Zahl <value-of select="@value"/>
      </assert>
   </rule>
</pattern>
