<svg width="24" height="24" viewBox="0 0 24 24" fill="none" xmlns="http://www.w3.org/2000/svg">
<path d="M18.707 12.707L17.293 11.293L13 15.586V6H11V15.586L6.707 11.293L5.293 12.707L12 19.414L18.707 12.707Z" fill="white"/>
</svg>
