<?xml version="1.0" encoding="UTF-8"?>
<svg width="212px" height="237px" viewBox="0 0 212 237" version="1.1" xmlns="http://www.w3.org/2000/svg" xmlns:xlink="http://www.w3.org/1999/xlink">
    <!-- Generator: Sketch 55.2 (78181) - https://sketchapp.com -->
    <title>Group 47</title>
    <desc>Created with Sketch.</desc>
    <defs>
        <filter x="-9.6%" y="-10.3%" width="119.3%" height="120.4%" filterUnits="objectBoundingBox" id="filter-1">
            <feOffset dx="0" dy="4" in="SourceAlpha" result="shadowOffsetOuter1"></feOffset>
            <feGaussianBlur stdDeviation="8" in="shadowOffsetOuter1" result="shadowBlurOuter1"></feGaussianBlur>
            <feColorMatrix values="0 0 0 0 0   0 0 0 0 0   0 0 0 0 0  0 0 0 0.2 0" type="matrix" in="shadowBlurOuter1" result="shadowMatrixOuter1"></feColorMatrix>
            <feMerge>
                <feMergeNode in="shadowMatrixOuter1"></feMergeNode>
                <feMergeNode in="SourceGraphic"></feMergeNode>
            </feMerge>
        </filter>
    </defs>
    <g id="z" stroke="none" stroke-width="1" fill="none" fill-rule="evenodd">
        <g id="homepage-copy-8" transform="translate(-182.000000, -3068.000000)" fill-rule="nonzero">
            <g id="Group-45" transform="translate(-40.000000, -30.000000)">
                <g id="Group-26" filter="url(#filter-1)" transform="translate(238.000000, 3109.000000)">
                    <g id="Group-41">
                        <g id="Group-25">
                            <g id="Group-47" transform="translate(0.366371, 0.000000)">
                                <polygon id="Polygon" points="89.6336293 0 179.267259 51.75 179.267259 155.25 89.6336293 207 5.86197757e-14 155.25 0 51.75"></polygon>
                                <path d="M89.8235109,5.37811557 L175.013393,54.693675 L175.013393,153.306325 L89.8235109,202.621884 L4.63362929,153.306325 L4.63362929,54.693675 L89.8235109,5.37811557 Z" id="Polygon" stroke-opacity="0.3" stroke="#5AEF2C" stroke-width="8" fill="#5AEF2C" stroke-linecap="square"></path>
                            </g>
                        </g>
                    </g>
                </g>
            </g>
        </g>
    </g>
</svg>