<svg width="117" height="48" xmlns="http://www.w3.org/2000/svg">
  <path d="M93.799 31.095a6.593 6.593 0 1 1-.002 13.186 6.593 6.593 0 0 1 .002-13.186zm0-3.532c5.59 0 10.125 4.535 10.125 10.126 0 5.591-4.535 10.124-10.125 10.124-5.591 0-10.124-4.533-10.124-10.124 0-5.59 4.533-10.126 10.124-10.126zm-70.061 3.532a6.594 6.594 0 1 1-6.593 6.594 6.595 6.595 0 0 1 6.593-6.594zm0-3.532c5.59 0 10.124 4.535 10.124 10.126 0 5.591-4.534 10.124-10.124 10.124-5.59 0-10.124-4.533-10.124-10.124 0-5.59 4.534-10.126 10.124-10.126zm5.678-22.586l-1.125 9.506c-.071.695-.46 1.021-1.052 1.11l-15.482-.209c-.897-.067-1.31-.53-1.108-1.493.719-2.835 1.509-5.698 2.233-7.292.525-1.155 1.847-1.53 3.556-1.693 4.234-.404 5.5-.498 9.752-.6.724-.02 1.449-.035 2.175-.05.713-.039 1.089.182 1.05.721zm27.293-.198l-.555 9.962c-.067.764-.438 1.224-1.286 1.207l-22.037-.282c-.604-.01-.93-.334-.868-1.084l.708-9.614c-.02-.497.267-.76.853-.795 7.17-.085 15.489-.07 22.658.056.42.036.542.252.527.55zm3.135 9.984l.11-9.92c-.01-.357.155-.526.478-.522 1.344.034 2.687.074 4.03.121 4.164.143 8.663.273 12.789.836 1.563.213 2.123.396 3.498 1.173 1.982 1.12 3.975 2.67 5.773 4.068 1.797 1.397 3.66 2.984 5.543 4.4.563.483.28 1.491-.386 1.524l-30.503-.41c-.848-.059-1.381-.402-1.332-1.27zm43.542 1.163c5.19 1.492 10.57 2.62 12.103 8.375.69 2.597.42 5.937.813 7.38.627 2.315.425 4.675-.55 6.856l-1.116 2.498c-.902 2.017-2.523 2.116-4.97 2.135-1.58.013-3.194.012-4.771-.09l-.195-.013a12.098 12.098 0 0 0 1.253-5.378c0-6.71-5.443-12.155-12.154-12.155S81.645 30.978 81.645 37.69c0 1.928.45 3.75 1.25 5.37H34.642a12.098 12.098 0 0 0 1.25-5.37c0-6.71-5.443-12.155-12.154-12.155-6.71 0-12.153 5.445-12.153 12.155 0 1.557.293 3.046.827 4.414l-6.19-.732c-1.09-.144-2.171-.354-3.172-.83-1.16-.55-1.657-2.305-1.95-3.45-.414-1.628-.667-3.36-.845-5.029-.202-1.92-.555-7.16.243-8.912.742-1.627 1.234-1.812 1.719-3.122C3.51 16.532 5.45 4.646 8.157 2.83c1.694-1.23 2.839-1.26 4.799-1.448C24.428.288 66.425.23 77.729 1.772c2.038.276 2.945.572 4.76 1.597 4.229 2.386 10.78 8.225 13.663 10.107 1.23.803 3.763 1.554 7.234 2.45z" fill="#000" fill-rule="evenodd"/>
</svg>
