<?xml version="1.0" encoding="UTF-8"?>
<svg width="257px" height="291px" viewBox="0 0 257 291" version="1.1" xmlns="http://www.w3.org/2000/svg" xmlns:xlink="http://www.w3.org/1999/xlink">
    <!-- Generator: Sketch 52.6 (67491) - http://www.bohemiancoding.com/sketch -->
    <title>Group 31</title>
    <desc>Created with Sketch.</desc>
    <g id="Page-1" stroke="none" stroke-width="1" fill="none" fill-rule="evenodd">
        <g id="homepage" transform="translate(-1183.000000, 0.000000)" stroke="#979797">
            <g id="Group-31" transform="translate(1182.000000, 0.000000)">
                <polyline id="Path-2" points="258.449813 279.264337 241.914782 289.021279 161.487996 241.467684 241.914782 192.670214 258.449813 202.5"></polyline>
                <polyline id="Path-3" points="202.088422 169.202893 202.088422 265.195264 242.227987 241.255897 242.227987 144.69901 162.180031 96.6107276 122.041957 120.39722"></polyline>
                <polyline id="Path-4" points="42.1036231 72.9621951 81.2759795 50 81.2759795 97.4064196 242.012472 192.752244"></polyline>
                <path d="M122.159036,264.849991 C121.596757,264.981737 108.211185,273.365073 82.0023188,290 L41.2848136,264.849991 L41.2848136,252 L41.2848136,217.227273 L82.0023188,192.5591 L122.159036,216.743281 L162.450731,192.5591 L201.87216,217" id="Path-5"></path>
                <polyline id="Path-6" points="161.402237 241.610118 161.402237 192.680654 202.628329 169.1231"></polyline>
                <polyline id="Path-7" points="161.977193 192.195185 161.977193 144.882459 121.99423 168.538822 121.99423 215.988509"></polyline>
                <polyline id="Path-8" points="201.698406 3.55271368e-15 201.698406 25.1416288 257.880822 58.7128207"></polyline>
                <polyline id="Path-9" points="258.01207 38.8264869 242.111654 48.8744286 242.111654 96.6338452 258.01207 106.590062"></polyline>
                <path d="M241.619473,0 C241.666206,0.972528507 241.666206,16.9918139 241.619473,48.0578562" id="Path-10"></path>
                <polyline id="Path-11" points="201.646205 24.8888269 121.664619 72 81.6585381 48.4444135 162.454459 7.10542736e-15 162.454459 97.0395213"></polyline>
                <path d="M81.7077561,48.8125332 L0.990881982,0" id="Path-12"></path>
                <polyline id="Path-13" points="42.1543327 24.7956109 82.0806202 0 201.87216 72 201.87216 121.095221 242.257817 96.4220584"></polyline>
                <path d="M202.024289,120.49491 L162.200166,145.015945" id="Path-14"></path>
                <path d="M2.01402107,193.143005 C1.93298527,192.491239 1.93298527,176.433474 2.01402107,144.96971 L41.810552,120.849131 L81.5772537,144.96971 L81.5772537,192.350296" id="Path-15"></path>
            </g>
        </g>
    </g>
</svg>