<?xml version="1.0" encoding="UTF-8"?>
<svg width="26px" height="26px" viewBox="0 0 26 26" version="1.1" xmlns="http://www.w3.org/2000/svg" xmlns:xlink="http://www.w3.org/1999/xlink">
    <!-- Generator: Sketch 55.2 (78181) - https://sketchapp.com -->
    <title>Group 10</title>
    <desc>Created with Sketch.</desc>
    <g id="Page-1-Copy-2" stroke="none" stroke-width="1" fill="none" fill-rule="evenodd">
        <g id="homepage-copy-8" transform="translate(-228.000000, -819.000000)" fill="#FFFFFF" fill-rule="nonzero">
            <g id="Group-45" transform="translate(-40.000000, -30.000000)">
                <g id="Group-50" transform="translate(269.000000, 850.000000)">
                    <g id="Group-9">
                        <g id="Group-10">
                            <g id="Group-8-Copy">
                                <g id="Group-18">
                                    <circle id="Oval" stroke-opacity="0.5" stroke="#FFFFFF" fill-opacity="0.1" stroke-linecap="square" cx="12" cy="12" r="12.5"></circle>
                                    <path d="M16.3106598,13.3077315 C16.2208829,13.4139453 16.1160654,13.5104332 15.9967781,13.5939591 L13.0737913,15.6406565 C12.3293995,16.1618852 11.3034114,15.9809758 10.7821827,15.2365841 C10.2609539,14.4921923 10.4418633,13.4662042 11.1862551,12.9449755 L13.6507389,11.2193253 L13.6507389,5.37690108 C13.6507389,4.5323899 14.3353504,3.84777832 15.1798616,3.84777832 C16.0243728,3.84777832 16.7089844,4.5323899 16.7089844,5.37690108 L16.7089844,12.2783901 C16.7089844,12.6748351 16.5581156,13.0360428 16.3106598,13.3077315 Z" id="Combined-Shape" transform="translate(13.596729, 9.893072) scale(-1, 1) translate(-13.596729, -9.893072) "></path>
                                </g>
                            </g>
                        </g>
                    </g>
                </g>
            </g>
        </g>
    </g>
</svg>