{
	"info": {
		"_postman_id": "ecabc945-7a7a-42c4-ba63-691fd36359a0",
		"name": "doAn",
		"schema": "https://schema.getpostman.com/json/collection/v2.1.0/collection.json"
	},
	"item": [
		{
			"name": "post_DangKi",
			"request": {
				"method": "POST",
				"header": [],
				"body": {
					"mode": "raw",
					"raw": "{\r\n    \"userName\" : \"oai\",\r\n    \"fullName\" : \"nguyen ba oai\",\r\n    \"userPass\" : \"baoai2000\",\r\n    \"userEmail\" : \"oaiker2k@gmail.com123\",\r\n    \"cellPhone\" : \"0989739956\",\r\n    \"dateOfBirth\" : \"2000-07-16\",\r\n    \"sex\" : \"nam\"\r\n}",
					"options": {
						"raw": {
							"language": "json"
						}
					}
				},
				"url": {
					"raw": "http://localhost:8080/user/register",
					"protocol": "http",
					"host": [
						"localhost"
					],
					"port": "8080",
					"path": [
						"user",
						"register"
					]
				}
			},
			"response": []
		},
		{
			"name": "get_Login",
			"request": {
				"method": "POST",
				"header": [],
				"body": {
					"mode": "raw",
					"raw": "{\n    \"email\" : \"traceuroai@gmail.com\",\n    \"pass\" : \"1234567\"\n}",
					"options": {
						"raw": {
							"language": "json"
						}
					}
				},
				"url": {
					"raw": "http://localhost:8080/user/login",
					"protocol": "http",
					"host": [
						"localhost"
					],
					"port": "8080",
					"path": [
						"user",
						"login"
					]
				}
			},
			"response": []
		},
		{
			"name": "post_Comment",
			"request": {
				"method": "POST",
				"header": [],
				"body": {
					"mode": "raw",
					"raw": "{\n    \"idQuestion\" : \"601a79f09ac8d53016740920\",\n    \"idUser\" : \"600c86277b38d872f98a6153\",\n    \"idUserResponse\" : \"600c86277b38d872f98a6153\",\n    \"content\" : \"test Comment 12345678900\"\n}",
					"options": {
						"raw": {
							"language": "json"
						}
					}
				},
				"url": {
					"raw": "http://localhost:8080/comment/addcomment",
					"protocol": "http",
					"host": [
						"localhost"
					],
					"port": "8080",
					"path": [
						"comment",
						"addcomment"
					]
				}
			},
			"response": []
		},
		{
			"name": "get_question",
			"protocolProfileBehavior": {
				"disableBodyPruning": true
			},
			"request": {
				"method": "GET",
				"header": [],
				"body": {
					"mode": "raw",
					"raw": "{\n    \n}",
					"options": {
						"raw": {
							"language": "json"
						}
					}
				},
				"url": {
					"raw": "http://localhost:8080/question/list",
					"protocol": "http",
					"host": [
						"localhost"
					],
					"port": "8080",
					"path": [
						"question",
						"list"
					]
				}
			},
			"response": []
		},
		{
			"name": "post_question",
			"request": {
				"method": "POST",
				"header": [],
				"body": {
					"mode": "raw",
					"raw": "{      \n    \"idSpecialist\" : \"6008434d4d08e227a52e6248\",\n    \"content\" : \"Cau hoi 123\",\n    \"idUser\" : \"600c86277b38d872f98a6153\"\n}",
					"options": {
						"raw": {
							"language": "json"
						}
					}
				},
				"url": {
					"raw": "http://localhost:8080/question/add-question",
					"protocol": "http",
					"host": [
						"localhost"
					],
					"port": "8080",
					"path": [
						"question",
						"add-question"
					]
				}
			},
			"response": []
		},
		{
			"name": "get_specialist",
			"protocolProfileBehavior": {
				"disableBodyPruning": true
			},
			"request": {
				"method": "GET",
				"header": [],
				"body": {
					"mode": "raw",
					"raw": "{\n    \n}",
					"options": {
						"raw": {
							"language": "json"
						}
					}
				},
				"url": {
					"raw": "http://localhost:8080/specialist/list",
					"protocol": "http",
					"host": [
						"localhost"
					],
					"port": "8080",
					"path": [
						"specialist",
						"list"
					]
				}
			},
			"response": []
		},
		{
			"name": "post_specialist",
			"request": {
				"method": "POST",
				"header": [],
				"body": {
					"mode": "raw",
					"raw": "{\n    \"name\" : \"khoa xxx\"\n}",
					"options": {
						"raw": {
							"language": "json"
						}
					}
				},
				"url": {
					"raw": "http://localhost:8080/specialist/addspecialist",
					"protocol": "http",
					"host": [
						"localhost"
					],
					"port": "8080",
					"path": [
						"specialist",
						"addspecialist"
					]
				}
			},
			"response": []
		},
		{
			"name": "get_one_question",
			"protocolProfileBehavior": {
				"disableBodyPruning": true
			},
			"request": {
				"method": "GET",
				"header": [],
				"body": {
					"mode": "raw",
					"raw": "{\n    \"id\" : \"6008147e2dec02775a989d6c\"\n}",
					"options": {
						"raw": {
							"language": "json"
						}
					}
				},
				"url": {
					"raw": "http://localhost:8080/question/question",
					"protocol": "http",
					"host": [
						"localhost"
					],
					"port": "8080",
					"path": [
						"question",
						"question"
					]
				}
			},
			"response": []
		},
		{
			"name": "put_question",
			"request": {
				"method": "PUT",
				"header": [],
				"body": {
					"mode": "raw",
					"raw": "{\n    \"id\" : \"6007aeb0a052a058ec99db87\",\n    \"idSpecialist\" : \"60081a0036f386161924d78e\",\n    \"content\" : \"tao bi benh gi vay ?\",\n    \"idUser\" : \"6007a7046db08e0633950c16\"\n}",
					"options": {
						"raw": {
							"language": "json"
						}
					}
				},
				"url": {
					"raw": "http://localhost:8080/question/updateQuestion",
					"protocol": "http",
					"host": [
						"localhost"
					],
					"port": "8080",
					"path": [
						"question",
						"updateQuestion"
					]
				}
			},
			"response": []
		},
		{
			"name": "delete_question",
			"request": {
				"method": "DELETE",
				"header": [],
				"body": {
					"mode": "raw",
					"raw": "{\n    \"id\" : \"6008147e2dec02775a989d6c\"\n}",
					"options": {
						"raw": {
							"language": "json"
						}
					}
				},
				"url": {
					"raw": "http://localhost:8080/question/deleteQuestion",
					"protocol": "http",
					"host": [
						"localhost"
					],
					"port": "8080",
					"path": [
						"question",
						"deleteQuestion"
					]
				}
			},
			"response": []
		},
		{
			"name": "get_one_specialist",
			"protocolProfileBehavior": {
				"disableBodyPruning": true
			},
			"request": {
				"method": "GET",
				"header": [],
				"body": {
					"mode": "raw",
					"raw": "{\n    \"id\" : \"600819f536f386161924d78d\"\n}",
					"options": {
						"raw": {
							"language": "json"
						}
					}
				},
				"url": {
					"raw": "http://localhost:8080/specialist/specialist",
					"protocol": "http",
					"host": [
						"localhost"
					],
					"port": "8080",
					"path": [
						"specialist",
						"specialist"
					]
				}
			},
			"response": []
		},
		{
			"name": "admin_get_listuser",
			"protocolProfileBehavior": {
				"disableBodyPruning": true
			},
			"request": {
				"method": "GET",
				"header": [],
				"body": {
					"mode": "raw",
					"raw": "{\r\n    \r\n}",
					"options": {
						"raw": {
							"language": "json"
						}
					}
				},
				"url": {
					"raw": "http://localhost:8080/admin/quantri/listuser",
					"protocol": "http",
					"host": [
						"localhost"
					],
					"port": "8080",
					"path": [
						"admin",
						"quantri",
						"listuser"
					]
				}
			},
			"response": []
		},
		{
			"name": "admin_get_user",
			"protocolProfileBehavior": {
				"disableBodyPruning": true
			},
			"request": {
				"method": "GET",
				"header": [],
				"body": {
					"mode": "raw",
					"raw": "{\r\n    \"id\" : \"600c8b200af58d3778daeb0d\"\r\n}",
					"options": {
						"raw": {
							"language": "json"
						}
					}
				},
				"url": {
					"raw": "http://localhost:8080/admin/quantri/user",
					"protocol": "http",
					"host": [
						"localhost"
					],
					"port": "8080",
					"path": [
						"admin",
						"quantri",
						"user"
					]
				}
			},
			"response": []
		},
		{
			"name": "delete_user",
			"request": {
				"method": "DELETE",
				"header": [],
				"body": {
					"mode": "raw",
					"raw": "{\r\n    \"id\" : \"600d41aa85cd146c587869f5\"\r\n}",
					"options": {
						"raw": {
							"language": "json"
						}
					}
				},
				"url": {
					"raw": "http://localhost:8080/user/deleteUser",
					"protocol": "http",
					"host": [
						"localhost"
					],
					"port": "8080",
					"path": [
						"user",
						"deleteUser"
					]
				}
			},
			"response": []
		},
		{
			"name": "put_user",
			"request": {
				"method": "PUT",
				"header": [],
				"body": {
					"mode": "raw",
					"raw": "{\r\n    \"id\": \"600c8b200af58d3778daeb0d\",\r\n    \"userName\": \"oai\",\r\n    \"fullName\": \"nguyen ba oai\",\r\n    \"userPass\": \"baoai\",\r\n    \"userEmail\": \"oaiker2k@gmail.com123\",\r\n    \"cellPhone\": \"0989739956\",\r\n    \"dateOfBirth\": \"2000-07-16T00:00:00.000+00:00\",\r\n    \"sex\": \"nam\"\r\n}",
					"options": {
						"raw": {
							"language": "json"
						}
					}
				},
				"url": {
					"raw": "http://localhost:8080/user/updateUser",
					"protocol": "http",
					"host": [
						"localhost"
					],
					"port": "8080",
					"path": [
						"user",
						"updateUser"
					]
				}
			},
			"response": []
		},
		{
			"name": "admin_add_user",
			"request": {
				"method": "POST",
				"header": [],
				"body": {
					"mode": "raw",
					"raw": "{\r\n    \"userName\" : \"ba oai\",\r\n    \"fullName\" : \"nguyen ba oai\",\r\n    \"userPass\" : \"ggggg\",\r\n    \"userEmail\" : \"oaiker2k@gmail.com1234\",\r\n    \"cellPhone\" : \"0989739956\",\r\n    \"dateOfBirth\" : \"2000-07-16\",\r\n    \"sex\" : \"Nam\"\r\n}",
					"options": {
						"raw": {
							"language": "json"
						}
					}
				},
				"url": {
					"raw": "http://localhost:8080/admin/quantri/adduser",
					"protocol": "http",
					"host": [
						"localhost"
					],
					"port": "8080",
					"path": [
						"admin",
						"quantri",
						"adduser"
					]
				}
			},
			"response": []
		},
		{
			"name": "admin_update_user",
			"request": {
				"method": "PUT",
				"header": [],
				"body": {
					"mode": "raw",
					"raw": "{\r\n    \"id\": \"600c8b200af58d3778daeb0d\",\r\n    \"userName\": \"oaiker\",\r\n    \"fullName\": \"nguyen ba oai\",\r\n    \"userPass\": \"baoai\",\r\n    \"userEmail\": \"oaiker2k@gmail.com123\",\r\n    \"cellPhone\": \"0989739956\",\r\n    \"dateOfBirth\": \"2000-07-16T00:00:00.000+00:00\",\r\n    \"sex\": \"nam\",\r\n    \"role\": [\"ADMIN\"]\r\n}",
					"options": {
						"raw": {
							"language": "json"
						}
					}
				},
				"url": {
					"raw": "http://localhost:8080/admin/quantri/updateuser",
					"protocol": "http",
					"host": [
						"localhost"
					],
					"port": "8080",
					"path": [
						"admin",
						"quantri",
						"updateuser"
					]
				}
			},
			"response": []
		},
		{
			"name": "admin_delete_user",
			"request": {
				"method": "DELETE",
				"header": [],
				"body": {
					"mode": "raw",
					"raw": "    [\"600d885fdefe45204309067e\", \"600d885adefe45204309067d\", \"600d84a4ea2319152f5adda1\", \"600d8a25a17ad72d312d3187\"]",
					"options": {
						"raw": {
							"language": "json"
						}
					}
				},
				"url": {
					"raw": "http://localhost:8080/admin/quantri/deleteuser",
					"protocol": "http",
					"host": [
						"localhost"
					],
					"port": "8080",
					"path": [
						"admin",
						"quantri",
						"deleteuser"
					]
				}
			},
			"response": []
		},
		{
			"name": "post_forgot_password_user",
			"request": {
				"method": "POST",
				"header": [],
				"body": {
					"mode": "raw",
					"raw": "{\r\n    \"userEmail\" : \"traceuroai@gmail.com\"\r\n}",
					"options": {
						"raw": {
							"language": "json"
						}
					}
				},
				"url": {
					"raw": "http://localhost:8080/user/forgotpassword",
					"protocol": "http",
					"host": [
						"localhost"
					],
					"port": "8080",
					"path": [
						"user",
						"forgotpassword"
					]
				}
			},
			"response": []
		},
		{
			"name": "post_image",
			"request": {
				"method": "POST",
				"header": [],
				"body": {
					"mode": "formdata",
					"formdata": [
						{
							"key": "image",
							"type": "file",
							"src": "/C:/Users/trace/Pictures/Screenshots/Screenshot (4).png"
						}
					],
					"options": {
						"raw": {
							"language": "json"
						}
					}
				},
				"url": {
					"raw": "http://localhost:8080/image/addimage",
					"protocol": "http",
					"host": [
						"localhost"
					],
					"port": "8080",
					"path": [
						"image",
						"addimage"
					]
				}
			},
			"response": []
		},
		{
			"name": "http://localhost:8080/image/images.jpg",
			"request": {
				"method": "GET",
				"header": [],
				"url": {
					"raw": "http://localhost:8080/image/Screenshot (4).png",
					"protocol": "http",
					"host": [
						"localhost"
					],
					"port": "8080",
					"path": [
						"image",
						"Screenshot (4).png"
					]
				}
			},
			"response": []
		},
		{
			"name": "http://localhost:8080/image/all",
			"request": {
				"method": "GET",
				"header": [],
				"url": {
					"raw": "http://localhost:8080/image/all",
					"protocol": "http",
					"host": [
						"localhost"
					],
					"port": "8080",
					"path": [
						"image",
						"all"
					]
				}
			},
			"response": []
		},
		{
			"name": "get_list_comment",
			"protocolProfileBehavior": {
				"disableBodyPruning": true
			},
			"request": {
				"method": "GET",
				"header": [],
				"body": {
					"mode": "raw",
					"raw": "{}",
					"options": {
						"raw": {
							"language": "json"
						}
					}
				},
				"url": {
					"raw": "http://localhost:8080/comment/listcomment",
					"protocol": "http",
					"host": [
						"localhost"
					],
					"port": "8080",
					"path": [
						"comment",
						"listcomment"
					]
				}
			},
			"response": []
		},
		{
			"name": "put_comment",
			"request": {
				"method": "PUT",
				"header": [],
				"body": {
					"mode": "raw",
					"raw": "{\r\n    \"id\": \"6018b71908c8ef6a0e339bce\",\r\n    \"idQuestion\": \"60110248953aff2bf5033279\",\r\n    \"idUser\": \"600b20776d420727e31349e2\",\r\n    \"idUserResponse\": \"600c86277b38d872f98a6153\",\r\n    \"content\": \"test Comment 333\"\r\n}",
					"options": {
						"raw": {
							"language": "json"
						}
					}
				},
				"url": {
					"raw": "http://localhost:8080/comment/updatecomment",
					"protocol": "http",
					"host": [
						"localhost"
					],
					"port": "8080",
					"path": [
						"comment",
						"updatecomment"
					]
				}
			},
			"response": []
		},
		{
			"name": "delete_comment",
			"request": {
				"method": "DELETE",
				"header": [],
				"body": {
					"mode": "raw",
					"raw": "{\r\n    \"id\" : \"6018b85108c8ef6a0e339bcf\"\r\n}",
					"options": {
						"raw": {
							"language": "json"
						}
					}
				},
				"url": {
					"raw": "http://localhost:8080/comment/deletecomment",
					"protocol": "http",
					"host": [
						"localhost"
					],
					"port": "8080",
					"path": [
						"comment",
						"deletecomment"
					]
				}
			},
			"response": []
		},
		{
			"name": "get_one_comment",
			"request": {
				"method": "POST",
				"header": [],
				"body": {
					"mode": "raw",
					"raw": "{\r\n    \"id\" : \"6018b71908c8ef6a0e339bce\"\r\n}",
					"options": {
						"raw": {
							"language": "json"
						}
					}
				},
				"url": {
					"raw": "http://localhost:8080/comment/comment",
					"protocol": "http",
					"host": [
						"localhost"
					],
					"port": "8080",
					"path": [
						"comment",
						"comment"
					]
				}
			},
			"response": []
		}
	]
}