%!PS-Adobe-3.0 EPSF-3.0
%%Creator: PS_dot.c,v 1.38 2007/02/02 15:18:13 ivo Exp $, ViennaRNA-1.8.2
%%CreationDate: Thu Apr 11 11:08:17 2013
%%Title: RNA Secondary Structure Plot
%%BoundingBox: 66 210 518 662
%%DocumentFonts: Helvetica
%%Pages: 1
%%EndComments

%Options: 
% to switch off outline pairs of sequence comment or
% delete the appropriate line near the end of the file

%%BeginProlog
/RNAplot 100 dict def
RNAplot begin
/fsize  14 def
/outlinecolor {0.2 setgray} bind def
/paircolor    {0.2 setgray} bind def
/seqcolor     {0   setgray} bind def
/cshow  { dup stringwidth pop -2 div fsize -3 div rmoveto show} bind def
/min { 2 copy gt { exch } if pop } bind def
/max { 2 copy lt { exch } if pop } bind def
/drawoutline {
  gsave outlinecolor newpath
  coor 0 get aload pop 0.8 0 360 arc % draw 5' circle of 1st sequence
  currentdict /cutpoint known        % check if cutpoint is defined
  {coor 0 cutpoint getinterval
   {aload pop lineto} forall         % draw outline of 1st sequence
   coor cutpoint get aload pop
   2 copy moveto 0.8 0 360 arc       % draw 5' circle of 2nd sequence
   coor cutpoint coor length cutpoint sub getinterval
   {aload pop lineto} forall}        % draw outline of 2nd sequence
  {coor {aload pop lineto} forall}   % draw outline as a whole
  ifelse
  stroke grestore
} bind def
/drawpairs {
  paircolor
  0.7 setlinewidth
  [9 3.01] 9 setdash
  newpath
  pairs {aload pop
     coor exch 1 sub get aload pop moveto
     coor exch 1 sub get aload pop lineto
  } forall
  stroke
} bind def
% draw bases
/drawbases {
  [] 0 setdash
  seqcolor
  0
  coor {
    aload pop moveto
    dup sequence exch 1 getinterval cshow
    1 add
  } forall
  pop
} bind def

/init {
  /Helvetica findfont fsize scalefont setfont
  1 setlinejoin
  1 setlinecap
  0.8 setlinewidth
  72 216 translate
  % find the coordinate range
  /xmax -1000 def /xmin 10000 def
  /ymax -1000 def /ymin 10000 def
  coor {
      aload pop
      dup ymin lt {dup /ymin exch def} if
      dup ymax gt {/ymax exch def} {pop} ifelse
      dup xmin lt {dup /xmin exch def} if
      dup xmax gt {/xmax exch def} {pop} ifelse
  } forall
  /size {xmax xmin sub ymax ymin sub max} bind def
  72 6 mul size div dup scale
  size xmin sub xmax sub 2 div size ymin sub ymax sub 2 div
  translate
} bind def
end
%%EndProlog
RNAplot begin
% data start here
/sequence (\
CAGAAGGUAGUUUAUUUUAAAACAUCAGCUUUGGGAGCUGGAGAUAGAGGUUUAAGUCCUUUCUUUCUGA\
) def
/coor [
[111.742 224.556]
[111.078 209.571]
[110.415 194.586]
[109.751 179.600]
[109.088 164.615]
[108.424 149.630]
[107.761 134.645]
[91.454 132.633]
[78.622 123.762]
[71.759 110.683]
[56.851 112.339]
[41.943 113.995]
[27.034 115.651]
[17.358 128.146]
[1.670 130.057]
[-10.723 120.249]
[-12.468 104.541]
[-2.529 92.253]
[13.196 90.674]
[25.379 100.742]
[40.287 99.086]
[55.195 97.430]
[70.104 95.775]
[75.417 82.470]
[86.265 73.111]
[82.973 58.477]
[79.682 43.843]
[76.390 29.208]
[73.099 14.574]
[59.124 7.557]
[52.976 -6.821]
[57.558 -21.773]
[70.707 -30.237]
[86.214 -28.218]
[96.757 -16.669]
[97.358 -1.043]
[87.733 11.282]
[91.024 25.917]
[94.316 40.551]
[97.608 55.185]
[100.899 69.820]
[111.781 71.050]
[121.867 76.204]
[129.746 84.856]
[134.217 96.075]
[134.464 108.525]
[149.431 109.520]
[164.398 110.515]
[179.365 111.510]
[194.332 112.505]
[205.025 101.094]
[220.557 99.278]
[233.594 107.913]
[237.981 122.923]
[231.646 137.220]
[217.580 144.053]
[202.426 140.197]
[193.337 127.472]
[178.370 126.477]
[163.403 125.482]
[148.436 124.487]
[133.469 123.492]
[122.746 133.981]
[123.410 148.966]
[124.073 163.952]
[124.737 178.937]
[125.400 193.922]
[126.064 208.908]
[126.727 223.893]
[129.768 243.035]
] def
/pairs [
[1 69]
[2 68]
[3 67]
[4 66]
[5 65]
[6 64]
[7 63]
[10 23]
[11 22]
[12 21]
[13 20]
[25 41]
[26 40]
[27 39]
[28 38]
[29 37]
[46 62]
[47 61]
[48 60]
[49 59]
[50 58]
] def

init

% switch off outline pairs or bases by removing these lines
drawoutline
drawpairs
drawbases
% show it
showpage
end
%%EOF
