%!PS-Adobe-3.0 EPSF-3.0
%%Creator: PS_dot.c,v 1.38 2007/02/02 15:18:13 ivo Exp $, ViennaRNA-1.8.2
%%CreationDate: Thu Apr 11 11:08:15 2013
%%Title: RNA Secondary Structure Plot
%%BoundingBox: 66 210 518 662
%%DocumentFonts: Helvetica
%%Pages: 1
%%EndComments

%Options: 
% to switch off outline pairs of sequence comment or
% delete the appropriate line near the end of the file

%%BeginProlog
/RNAplot 100 dict def
RNAplot begin
/fsize  14 def
/outlinecolor {0.2 setgray} bind def
/paircolor    {0.2 setgray} bind def
/seqcolor     {0   setgray} bind def
/cshow  { dup stringwidth pop -2 div fsize -3 div rmoveto show} bind def
/min { 2 copy gt { exch } if pop } bind def
/max { 2 copy lt { exch } if pop } bind def
/drawoutline {
  gsave outlinecolor newpath
  coor 0 get aload pop 0.8 0 360 arc % draw 5' circle of 1st sequence
  currentdict /cutpoint known        % check if cutpoint is defined
  {coor 0 cutpoint getinterval
   {aload pop lineto} forall         % draw outline of 1st sequence
   coor cutpoint get aload pop
   2 copy moveto 0.8 0 360 arc       % draw 5' circle of 2nd sequence
   coor cutpoint coor length cutpoint sub getinterval
   {aload pop lineto} forall}        % draw outline of 2nd sequence
  {coor {aload pop lineto} forall}   % draw outline as a whole
  ifelse
  stroke grestore
} bind def
/drawpairs {
  paircolor
  0.7 setlinewidth
  [9 3.01] 9 setdash
  newpath
  pairs {aload pop
     coor exch 1 sub get aload pop moveto
     coor exch 1 sub get aload pop lineto
  } forall
  stroke
} bind def
% draw bases
/drawbases {
  [] 0 setdash
  seqcolor
  0
  coor {
    aload pop moveto
    dup sequence exch 1 getinterval cshow
    1 add
  } forall
  pop
} bind def

/init {
  /Helvetica findfont fsize scalefont setfont
  1 setlinejoin
  1 setlinecap
  0.8 setlinewidth
  72 216 translate
  % find the coordinate range
  /xmax -1000 def /xmin 10000 def
  /ymax -1000 def /ymin 10000 def
  coor {
      aload pop
      dup ymin lt {dup /ymin exch def} if
      dup ymax gt {/ymax exch def} {pop} ifelse
      dup xmin lt {dup /xmin exch def} if
      dup xmax gt {/xmax exch def} {pop} ifelse
  } forall
  /size {xmax xmin sub ymax ymin sub max} bind def
  72 6 mul size div dup scale
  size xmin sub xmax sub 2 div size ymin sub ymax sub 2 div
  translate
} bind def
end
%%EndProlog
RNAplot begin
% data start here
/sequence (\
GGUAAGAUGGCUGAGUGUCAAAGCGUUAGGCUGUAGUCCUUUUUACAGAGGUUCAAUUCCUCUUCUUAUC\
) def
/coor [
[108.233 228.675]
[108.233 213.675]
[108.233 198.675]
[108.233 183.675]
[108.233 168.675]
[108.233 153.675]
[108.233 138.675]
[89.184 136.364]
[74.241 125.628]
[66.657 109.733]
[51.690 110.728]
[36.723 111.723]
[29.352 125.275]
[15.813 132.671]
[0.426 131.550]
[-11.898 122.270]
[-17.227 107.792]
[-13.861 92.736]
[-2.874 81.907]
[12.229 78.759]
[26.628 84.298]
[35.728 96.756]
[50.695 95.761]
[65.662 94.766]
[68.264 85.883]
[73.120 78.002]
[79.884 71.684]
[88.077 67.376]
[86.092 52.508]
[84.107 37.640]
[70.806 29.416]
[65.954 14.550]
[71.839 0.062]
[85.685 -7.207]
[100.952 -3.825]
[110.433 8.611]
[109.651 24.229]
[98.975 35.655]
[100.960 50.523]
[102.945 65.391]
[112.121 66.717]
[120.792 70.479]
[128.311 76.499]
[134.093 84.428]
[137.655 93.764]
[138.659 103.889]
[136.942 114.100]
[151.762 116.414]
[166.583 118.727]
[181.403 121.041]
[196.224 123.355]
[207.883 112.934]
[223.515 112.497]
[235.738 122.251]
[238.781 137.589]
[231.207 151.271]
[216.593 156.835]
[201.838 151.654]
[193.910 138.175]
[179.090 135.861]
[164.269 133.548]
[149.449 131.234]
[134.628 128.920]
[123.233 138.675]
[123.233 153.675]
[123.233 168.675]
[123.233 183.675]
[123.233 198.675]
[123.233 213.675]
[123.233 228.675]
] def
/pairs [
[1 70]
[2 69]
[3 68]
[4 67]
[5 66]
[6 65]
[7 64]
[10 24]
[11 23]
[12 22]
[28 40]
[29 39]
[30 38]
[47 63]
[48 62]
[49 61]
[50 60]
[51 59]
] def

init

% switch off outline pairs or bases by removing these lines
drawoutline
drawpairs
drawbases
% show it
showpage
end
%%EOF
