%!PS-Adobe-3.0 EPSF-3.0
%%Creator: PS_dot.c,v 1.38 2007/02/02 15:18:13 ivo Exp $, ViennaRNA-1.8.2
%%CreationDate: Thu Apr 11 11:08:16 2013
%%Title: RNA Secondary Structure Plot
%%BoundingBox: 66 210 518 662
%%DocumentFonts: Helvetica
%%Pages: 1
%%EndComments

%Options: 
% to switch off outline pairs of sequence comment or
% delete the appropriate line near the end of the file

%%BeginProlog
/RNAplot 100 dict def
RNAplot begin
/fsize  14 def
/outlinecolor {0.2 setgray} bind def
/paircolor    {0.2 setgray} bind def
/seqcolor     {0   setgray} bind def
/cshow  { dup stringwidth pop -2 div fsize -3 div rmoveto show} bind def
/min { 2 copy gt { exch } if pop } bind def
/max { 2 copy lt { exch } if pop } bind def
/drawoutline {
  gsave outlinecolor newpath
  coor 0 get aload pop 0.8 0 360 arc % draw 5' circle of 1st sequence
  currentdict /cutpoint known        % check if cutpoint is defined
  {coor 0 cutpoint getinterval
   {aload pop lineto} forall         % draw outline of 1st sequence
   coor cutpoint get aload pop
   2 copy moveto 0.8 0 360 arc       % draw 5' circle of 2nd sequence
   coor cutpoint coor length cutpoint sub getinterval
   {aload pop lineto} forall}        % draw outline of 2nd sequence
  {coor {aload pop lineto} forall}   % draw outline as a whole
  ifelse
  stroke grestore
} bind def
/drawpairs {
  paircolor
  0.7 setlinewidth
  [9 3.01] 9 setdash
  newpath
  pairs {aload pop
     coor exch 1 sub get aload pop moveto
     coor exch 1 sub get aload pop lineto
  } forall
  stroke
} bind def
% draw bases
/drawbases {
  [] 0 setdash
  seqcolor
  0
  coor {
    aload pop moveto
    dup sequence exch 1 getinterval cshow
    1 add
  } forall
  pop
} bind def

/init {
  /Helvetica findfont fsize scalefont setfont
  1 setlinejoin
  1 setlinecap
  0.8 setlinewidth
  72 216 translate
  % find the coordinate range
  /xmax -1000 def /xmin 10000 def
  /ymax -1000 def /ymin 10000 def
  coor {
      aload pop
      dup ymin lt {dup /ymin exch def} if
      dup ymax gt {/ymax exch def} {pop} ifelse
      dup xmin lt {dup /xmin exch def} if
      dup xmax gt {/xmax exch def} {pop} ifelse
  } forall
  /size {xmax xmin sub ymax ymin sub max} bind def
  72 6 mul size div dup scale
  size xmin sub xmax sub 2 div size ymin sub ymax sub 2 div
  translate
} bind def
end
%%EndProlog
RNAplot begin
% data start here
/sequence (\
AAGGAGUGGUAUAACCAACAAGAACUGCUAAUUCUUGCAUCCGAGCCUAAGACCUCGGCCUCCUUA\
) def
/coor [
[97.737 211.792]
[97.034 196.808]
[96.331 181.825]
[95.628 166.841]
[94.925 151.858]
[94.222 136.874]
[85.664 134.461]
[77.920 130.093]
[71.429 124.016]
[66.559 116.577]
[60.059 130.800]
[45.916 137.470]
[30.807 133.439]
[21.866 120.609]
[23.316 105.039]
[34.471 94.080]
[50.064 92.907]
[62.734 102.073]
[65.601 85.515]
[75.442 71.893]
[68.044 58.844]
[60.646 45.796]
[53.248 32.747]
[45.849 19.699]
[30.439 17.041]
[20.382 5.066]
[20.427 -10.571]
[30.552 -22.488]
[45.977 -25.058]
[59.419 -17.066]
[64.530 -2.288]
[58.898 12.300]
[66.296 25.349]
[73.694 38.397]
[81.093 51.446]
[88.491 64.495]
[100.331 62.677]
[112.136 64.704]
[122.692 70.366]
[130.910 79.080]
[135.945 89.949]
[150.908 88.895]
[165.871 87.841]
[180.834 86.787]
[195.797 85.732]
[203.898 72.498]
[218.244 66.584]
[233.319 70.265]
[243.325 82.125]
[244.415 97.604]
[236.171 110.749]
[221.761 116.507]
[206.728 112.663]
[196.851 100.695]
[181.888 101.750]
[166.925 102.804]
[151.962 103.858]
[136.999 104.912]
[127.893 124.801]
[109.206 136.171]
[109.909 151.155]
[110.612 166.138]
[111.315 181.122]
[112.018 196.105]
[112.721 211.089]
[115.812 230.222]
] def
/pairs [
[1 65]
[2 64]
[3 63]
[4 62]
[5 61]
[6 60]
[10 18]
[20 36]
[21 35]
[22 34]
[23 33]
[24 32]
[41 58]
[42 57]
[43 56]
[44 55]
[45 54]
] def

init

% switch off outline pairs or bases by removing these lines
drawoutline
drawpairs
drawbases
% show it
showpage
end
%%EOF
