%!PS-Adobe-3.0 EPSF-3.0
%%Creator: PS_dot.c,v 1.38 2007/02/02 15:18:13 ivo Exp $, ViennaRNA-1.8.2
%%CreationDate: Thu Apr 11 11:08:16 2013
%%Title: RNA Secondary Structure Plot
%%BoundingBox: 66 210 518 662
%%DocumentFonts: Helvetica
%%Pages: 1
%%EndComments

%Options: 
% to switch off outline pairs of sequence comment or
% delete the appropriate line near the end of the file

%%BeginProlog
/RNAplot 100 dict def
RNAplot begin
/fsize  14 def
/outlinecolor {0.2 setgray} bind def
/paircolor    {0.2 setgray} bind def
/seqcolor     {0   setgray} bind def
/cshow  { dup stringwidth pop -2 div fsize -3 div rmoveto show} bind def
/min { 2 copy gt { exch } if pop } bind def
/max { 2 copy lt { exch } if pop } bind def
/drawoutline {
  gsave outlinecolor newpath
  coor 0 get aload pop 0.8 0 360 arc % draw 5' circle of 1st sequence
  currentdict /cutpoint known        % check if cutpoint is defined
  {coor 0 cutpoint getinterval
   {aload pop lineto} forall         % draw outline of 1st sequence
   coor cutpoint get aload pop
   2 copy moveto 0.8 0 360 arc       % draw 5' circle of 2nd sequence
   coor cutpoint coor length cutpoint sub getinterval
   {aload pop lineto} forall}        % draw outline of 2nd sequence
  {coor {aload pop lineto} forall}   % draw outline as a whole
  ifelse
  stroke grestore
} bind def
/drawpairs {
  paircolor
  0.7 setlinewidth
  [9 3.01] 9 setdash
  newpath
  pairs {aload pop
     coor exch 1 sub get aload pop moveto
     coor exch 1 sub get aload pop lineto
  } forall
  stroke
} bind def
% draw bases
/drawbases {
  [] 0 setdash
  seqcolor
  0
  coor {
    aload pop moveto
    dup sequence exch 1 getinterval cshow
    1 add
  } forall
  pop
} bind def

/init {
  /Helvetica findfont fsize scalefont setfont
  1 setlinejoin
  1 setlinecap
  0.8 setlinewidth
  72 216 translate
  % find the coordinate range
  /xmax -1000 def /xmin 10000 def
  /ymax -1000 def /ymin 10000 def
  coor {
      aload pop
      dup ymin lt {dup /ymin exch def} if
      dup ymax gt {/ymax exch def} {pop} ifelse
      dup xmin lt {dup /xmin exch def} if
      dup xmax gt {/xmax exch def} {pop} ifelse
  } forall
  /size {xmax xmin sub ymax ymin sub max} bind def
  72 6 mul size div dup scale
  size xmin sub xmax sub 2 div size ymin sub ymax sub 2 div
  translate
} bind def
end
%%EndProlog
RNAplot begin
% data start here
/sequence (\
AGAAAGUUAGUCUAAUUAAGACAGCUGGUUUCGACCCAGCAAAUUAUAGCCCCACCUAUAACUUUCUC\
) def
/coor [
[111.870 224.602]
[111.188 209.617]
[110.505 194.633]
[109.822 179.648]
[109.140 164.664]
[108.457 149.679]
[107.774 134.695]
[91.472 132.691]
[78.632 123.840]
[71.741 110.779]
[56.838 112.483]
[41.935 114.187]
[27.032 115.890]
[15.965 127.504]
[-0.003 125.949]
[-8.621 112.418]
[-3.279 97.290]
[11.925 92.171]
[25.329 100.988]
[40.232 99.284]
[55.135 97.580]
[70.038 95.876]
[75.291 82.558]
[86.081 73.148]
[82.695 58.535]
[79.310 43.922]
[75.925 29.310]
[72.539 14.697]
[58.520 7.770]
[52.280 -6.569]
[56.766 -21.549]
[69.861 -30.098]
[85.380 -28.178]
[95.997 -16.697]
[96.698 -1.075]
[87.152 11.311]
[90.538 25.924]
[93.923 40.537]
[97.308 55.150]
[100.694 69.763]
[111.646 70.940]
[121.811 76.083]
[129.757 84.763]
[134.265 96.042]
[134.509 108.562]
[149.474 109.586]
[164.439 110.609]
[179.404 111.633]
[194.369 112.656]
[206.115 102.082]
[221.893 102.994]
[232.342 114.851]
[231.264 130.618]
[219.297 140.942]
[203.542 139.697]
[193.345 127.621]
[178.380 126.598]
[163.415 125.574]
[148.450 124.551]
[133.485 123.527]
[122.759 134.012]
[123.441 148.997]
[124.124 163.981]
[124.807 178.965]
[125.489 193.950]
[126.172 208.934]
[126.855 223.919]
[129.920 243.057]
] def
/pairs [
[1 67]
[2 66]
[3 65]
[4 64]
[5 63]
[6 62]
[7 61]
[10 22]
[11 21]
[12 20]
[13 19]
[24 40]
[25 39]
[26 38]
[27 37]
[28 36]
[45 60]
[46 59]
[47 58]
[48 57]
[49 56]
] def

init

% switch off outline pairs or bases by removing these lines
drawoutline
drawpairs
drawbases
% show it
showpage
end
%%EOF
