<svg id="network" xmlns="http://www.w3.org/2000/svg" width="59.113" height="59.113" viewBox="0 0 59.113 59.113">
  <path id="Path_30" data-name="Path 30" d="M11.92,232.166a.866.866,0,0,0-.866-.866A9.316,9.316,0,0,1,7.2,213.5a.866.866,0,1,0-.717-1.577,11.048,11.048,0,0,0,4.574,21.108A.866.866,0,0,0,11.92,232.166Z" transform="translate(0 -187.387)" fill="#24b4f2"/>
  <path id="Path_31" data-name="Path 31" d="M80.388,26.69a14.646,14.646,0,0,1,27.346-4.257.866.866,0,1,0,1.529-.813,16.47,16.47,0,0,0-1.678-2.554V7.523l2.095-2.5a2.6,2.6,0,1,0-1.327-1.113l-2.3,2.737a.866.866,0,0,0-.2.557V17.213A16.333,16.333,0,0,0,100.64,14V7.953a2.6,2.6,0,1,0-1.732,0v5.492a16.515,16.515,0,0,0-6.231-.385V5.043a2.6,2.6,0,1,0-1.732,0v8.336a16.347,16.347,0,0,0-6.231,3V7.953a2.6,2.6,0,1,0-1.732,0v9.99A16.272,16.272,0,0,0,78.965,25.1a10.953,10.953,0,0,0-1.25-.643V7.208a.866.866,0,0,0-.2-.557l-2.3-2.737a2.6,2.6,0,1,0-1.327,1.113l2.095,2.5v16.35a11.129,11.129,0,0,0-2.674-.323.866.866,0,1,0,0,1.732,9.237,9.237,0,0,1,5.7,1.941.866.866,0,0,0,1.382-.533Zm30.2-24.958a.864.864,0,1,1-.866.864A.866.866,0,0,1,110.59,1.732ZM99.774,4.642a.864.864,0,1,1-.866.864A.866.866,0,0,1,99.774,4.642ZM91.812,1.732a.864.864,0,1,1-.866.864.866.866,0,0,1,.866-.864ZM83.849,4.642a.864.864,0,1,1-.866.864A.866.866,0,0,1,83.849,4.642ZM72.113,2.6a.866.866,0,1,1,.866.864A.866.866,0,0,1,72.113,2.6Z" transform="translate(-62.255)" fill="#24b4f2"/>
  <path id="Path_32" data-name="Path 32" d="M409.232,220.043a8.354,8.354,0,0,0-1.862.208,16.436,16.436,0,0,0-.414-3.572.866.866,0,1,0-1.688.387,14.7,14.7,0,0,1,.37,3.285c0,.338-.012.683-.036,1.025a.866.866,0,0,0,1.184.864,6.6,6.6,0,1,1,2.445,12.739h-2.84a.866.866,0,1,0,0,1.732h2.84a8.335,8.335,0,1,0,0-16.669Z" transform="translate(-358.458 -191.068)" fill="#24b4f2"/>
  <path id="Path_33" data-name="Path 33" d="M287.406,380.343h-8.025a.866.866,0,0,0,0,1.732h3.631V390.5a2.6,2.6,0,1,0,1.732,0v-8.426h2.662a.866.866,0,0,0,0-1.732Zm-3.528,13.469a.864.864,0,1,1,.866-.864A.866.866,0,0,1,283.878,393.812Z" transform="translate(-246.359 -336.43)" fill="#24b4f2"/>
  <path id="Path_34" data-name="Path 34" d="M158.919,380.343h-7.885a.866.866,0,1,0,0,1.732h2.524V390.5a2.6,2.6,0,1,0,1.732,0v-8.426h3.629a.866.866,0,1,0,0-1.732Zm-4.495,13.469a.864.864,0,1,1,.866-.864A.866.866,0,0,1,154.424,393.812Z" transform="translate(-132.83 -336.43)" fill="#24b4f2"/>
  <path id="Path_35" data-name="Path 35" d="M90.592,315.637a2.6,2.6,0,0,0-.866,5.043v11.835l-3.668,4.371A.866.866,0,1,0,87.385,338l3.871-4.612a.866.866,0,0,0,.2-.557V320.68a2.6,2.6,0,0,0-.866-5.043Zm0,3.459a.864.864,0,1,1,.866-.864A.866.866,0,0,1,90.592,319.1Z" transform="translate(-75.943 -279.195)" fill="#24b4f2"/>
  <path id="Path_36" data-name="Path 36" d="M236.1,315.637a2.6,2.6,0,0,0-.866,5.043v16.763a.866.866,0,1,0,1.732,0V320.68a2.6,2.6,0,0,0-.866-5.043Zm0,3.459a.864.864,0,1,1,.866-.864A.866.866,0,0,1,236.1,319.1Z" transform="translate(-206.541 -279.195)" fill="#24b4f2"/>
  <path id="Path_37" data-name="Path 37" d="M366.083,332.515V320.68a2.6,2.6,0,1,0-1.732,0V332.83a.866.866,0,0,0,.2.557L368.424,338a.866.866,0,0,0,1.327-1.113Zm-.866-15.146a.864.864,0,1,1-.866.864A.866.866,0,0,1,365.217,317.369Z" transform="translate(-320.753 -279.195)" fill="#24b4f2"/>
</svg>
