\documentclass{standalone}

\usepackage{pgfplots}

\begin{document}

\begin{tikzpicture}
	\begin{axis}[
			width=\linewidth,
			height=3cm,
			enlarge x limits=0,
			ylabel=Amplitude,
			xlabel=Time (s)
		]
		\addplot[yticklabels={,,}] table [x=Time, y=Amplitude, col sep=space] {data/em2.txt};
	\end{axis}
\end{tikzpicture}

\end{document}