Time Amplitude
0.00000	0.13984
0.00005	0.21905
0.00009	0.11346
0.00014	-0.09415
0.00018	-0.30809
0.00023	-0.38925
0.00027	-0.31123
0.00032	-0.16451
0.00036	-0.01383
0.00041	0.03665
0.00045	0.00050
0.00050	-0.03492
0.00054	-0.05442
0.00059	-0.05459
0.00063	-0.07831
0.00068	-0.14786
0.00073	-0.19025
0.00077	-0.17026
0.00082	-0.08290
0.00086	0.03555
0.00091	0.09162
0.00095	0.07242
0.00100	0.00528
0.00104	-0.04607
0.00109	-0.02316
0.00113	0.04042
0.00118	0.10200
0.00122	0.10841
0.00127	0.05562
0.00132	-0.00435
0.00136	-0.03611
0.00141	-0.01223
0.00145	0.05921
0.00150	0.14486
0.00154	0.20461
0.00159	0.21138
0.00163	0.16695
0.00168	0.08759
0.00172	0.00641
0.00177	-0.03510
0.00181	-0.02461
0.00186	0.02705
0.00190	0.09545
0.00195	0.14008
0.00200	0.15522
0.00204	0.14484
0.00209	0.11091
0.00213	0.06459
0.00218	0.00907
0.00222	-0.04377
0.00227	-0.08363
0.00231	-0.07739
0.00236	-0.02167
0.00240	0.04568
0.00245	0.09511
0.00249	0.07427
0.00254	0.00022
0.00259	-0.07388
0.00263	-0.11426
0.00268	-0.09308
0.00272	-0.05275
0.00277	-0.02447
0.00281	-0.04393
0.00286	-0.09306
0.00290	-0.11486
0.00295	-0.11188
0.00299	-0.06589
0.00304	-0.01799
0.00308	-0.01501
0.00313	-0.03591
0.00317	-0.07614
0.00322	-0.10123
0.00327	-0.10204
0.00331	-0.09258
0.00336	-0.09251
0.00340	-0.12059
0.00345	-0.12652
0.00349	-0.09010
0.00354	-0.04455
0.00358	0.01111
0.00363	0.06021
0.00367	0.07016
0.00372	0.02488
0.00376	-0.06326
0.00381	-0.13099
0.00385	-0.12407
0.00390	-0.04045
0.00395	0.05995
0.00399	0.12462
0.00404	0.14526
0.00408	0.12191
0.00413	0.08526
0.00417	0.05176
0.00422	0.00791
0.00426	-0.00928
0.00431	0.00483
0.00435	0.03822
0.00440	0.09107
0.00444	0.13554
0.00449	0.15760
0.00454	0.14024
0.00458	0.08513
0.00463	0.02461
0.00467	-0.01291
0.00472	-0.01356
0.00476	0.02476
0.00481	0.06651
0.00485	0.08740
0.00490	0.08498
0.00494	0.05195
0.00499	0.01242
0.00503	-0.00774
0.00508	-0.00358
0.00512	0.01315
0.00517	0.02320
0.00522	0.01704
0.00526	-0.00331
0.00531	-0.02374
0.00535	-0.03786
0.00540	-0.03883
0.00544	-0.02104
0.00549	-0.00467
0.00553	0.00506
0.00558	0.00486
0.00562	-0.01573
0.00567	-0.03777
0.00571	-0.04970
0.00576	-0.05759
0.00580	-0.05366
0.00585	-0.03808
0.00590	-0.01642
0.00594	0.00976
0.00599	0.02745
0.00603	0.02726
0.00608	0.00465
0.00612	-0.03068
0.00617	-0.05561
0.00621	-0.05103
0.00626	-0.02247
0.00630	0.01428
0.00635	0.04869
0.00639	0.06450
0.00644	0.05880
0.00649	0.03713
0.00653	0.01911
0.00658	0.01140
0.00662	0.01179
0.00667	0.03605
0.00671	0.05879
0.00676	0.06845
0.00680	0.07945
0.00685	0.07471
0.00689	0.07359
0.00694	0.07275
0.00698	0.06373
0.00703	0.06153
0.00707	0.05635
0.00712	0.06435
0.00717	0.07234
0.00721	0.07658
0.00726	0.07473
0.00730	0.05417
0.00735	0.03738
0.00739	0.01792
0.00744	0.00408
0.00748	0.02278
0.00753	0.04020
0.00757	0.04206
0.00762	0.04187
0.00766	-0.00060
0.00771	-0.06887
0.00776	-0.17457
0.00780	-0.27072
0.00785	-0.25112
0.00789	-0.12251
0.00794	0.07328
0.00798	0.19220
0.00803	0.14407
0.00807	-0.01611
0.00812	-0.22968
0.00816	-0.35547
0.00821	-0.33474
0.00825	-0.22196
0.00830	-0.06622
0.00834	0.02046
0.00839	0.02101
0.00844	-0.00983
0.00848	-0.04626
0.00853	-0.04881
0.00857	-0.06353
0.00862	-0.12618
0.00866	-0.17999
0.00871	-0.18098
0.00875	-0.10658
0.00880	0.01123
0.00884	0.08841
0.00889	0.09840
0.00893	0.04087
0.00898	-0.02715
0.00902	-0.03952
0.00907	-0.00064
0.00912	0.07271
0.00916	0.11433
0.00921	0.09312
0.00925	0.03605
0.00930	-0.02160
0.00934	-0.02260
0.00939	0.03580
0.00943	0.11747
0.00948	0.19259
0.00952	0.21707
0.00957	0.18181
0.00961	0.10880
0.00966	0.03101
0.00971	-0.01868
0.00975	-0.02045
0.00980	0.01599
0.00984	0.06994
0.00989	0.12432
0.00993	0.15077
0.00998	0.15516
0.01002	0.13803
0.01007	0.09217
0.01011	0.02854
0.01016	-0.04321
0.01020	-0.09342
0.01025	-0.09733
0.01029	-0.04479
0.01034	0.04580
0.01039	0.11030
0.01043	0.09705
0.01048	0.02881
0.01052	-0.06348
0.01057	-0.12051
0.01061	-0.11399
0.01066	-0.08304
0.01070	-0.04407
0.01075	-0.04173
0.01079	-0.07387
0.01084	-0.09483
0.01088	-0.10294
0.01093	-0.07181
0.01098	-0.03647
0.01102	-0.03386
0.01107	-0.04875
0.01111	-0.08343
0.01116	-0.10113
0.01120	-0.09801
0.01125	-0.09130
0.01129	-0.08004
0.01134	-0.08335
0.01138	-0.08692
0.01143	-0.08871
0.01147	-0.10351
0.01152	-0.08360
0.01156	-0.02426
0.01161	0.03439
0.01166	0.07509
0.01170	0.04213
0.01175	-0.03510
0.01179	-0.08458
0.01184	-0.08391
0.01188	-0.03057
0.01193	0.03110
0.01197	0.08685
0.01202	0.11773
0.01206	0.11809
0.01211	0.10756
0.01215	0.06710
0.01220	0.02567
0.01224	0.00735
0.01229	0.00107
0.01234	0.03014
0.01238	0.07685
0.01243	0.12211
0.01247	0.15618
0.01252	0.14556
0.01256	0.09279
0.01261	0.02908
0.01265	-0.01498
0.01270	-0.01834
0.01274	0.01268
0.01279	0.05681
0.01283	0.09057
0.01288	0.08441
0.01293	0.04897
0.01297	0.00928
0.01302	-0.01459
0.01306	-0.01191
0.01311	-0.00040
0.01315	0.00808
0.01320	0.00640
0.01324	-0.00573
0.01329	-0.02057
0.01333	-0.03622
0.01338	-0.04075
0.01342	-0.02825
0.01347	-0.01271
0.01351	0.00148
0.01356	0.00330
0.01361	-0.00913
0.01365	-0.02653
0.01370	-0.03922
0.01374	-0.04340
0.01379	-0.04483
0.01383	-0.03551
0.01388	-0.01839
0.01392	0.00546
0.01397	0.02787
0.01401	0.03057
0.01406	0.01177
0.01410	-0.01902
0.01415	-0.04541
0.01420	-0.04854
0.01424	-0.02286
0.01429	0.01942
0.01433	0.05422
0.01438	0.06636
0.01442	0.06250
0.01447	0.04225
0.01451	0.02337
0.01456	0.01931
0.01460	0.02625
0.01465	0.03697
0.01469	0.04437
0.01474	0.06425
0.01478	0.07817
0.01483	0.08250
0.01488	0.09544
0.01492	0.07918
0.01497	0.05353
0.01501	0.04803
0.01506	0.04444
0.01510	0.05971
0.01515	0.07987
0.01519	0.07140
0.01524	0.05799
0.01528	0.04698
0.01533	0.02952
0.01537	0.02206
0.01542	0.02441
0.01546	0.03768
0.01551	0.03405
0.01556	0.02306
0.01560	0.01589
0.01565	-0.03782
0.01569	-0.11363
0.01574	-0.22567
0.01578	-0.27645
0.01583	-0.17147
0.01587	-0.00138
0.01592	0.16411
0.01596	0.17841
0.01601	0.02496
0.01605	-0.17223
0.01610	-0.33955
0.01615	-0.36599
0.01619	-0.26448
0.01624	-0.12169
0.01628	0.00059
0.01633	0.02194
0.01637	-0.01276
0.01642	-0.04202
0.01646	-0.05522
0.01651	-0.05771
0.01655	-0.10440
0.01660	-0.17930
0.01664	-0.20779
0.01669	-0.16040
0.01673	-0.04241
0.01678	0.07608
0.01683	0.11821
0.01687	0.08043
0.01692	-0.00228
0.01696	-0.05307
0.01701	-0.03608
0.01705	0.02321
0.01710	0.08644
0.01714	0.09800
0.01719	0.05431
0.01723	0.00230
0.01728	-0.01234
0.01732	0.02801
0.01737	0.10050
0.01741	0.16910
0.01746	0.19605
0.01751	0.17172
0.01755	0.11160
0.01760	0.04283
0.01764	-0.00296
0.01769	-0.01637
0.01773	0.00907
0.01778	0.05009
0.01782	0.09010
0.01787	0.12929
0.01791	0.14583
0.01796	0.13942
0.01800	0.10105
0.01805	0.02974
0.01810	-0.03961
0.01814	-0.09521
0.01819	-0.10872
0.01823	-0.05749
0.01828	0.02012
0.01832	0.08812
0.01837	0.10056
0.01841	0.03406
0.01846	-0.04809
0.01850	-0.11616
0.01855	-0.13241
0.01859	-0.09737
0.01864	-0.06715
0.01868	-0.04579
0.01873	-0.05575
0.01878	-0.08007
0.01882	-0.08284
0.01887	-0.07130
0.01891	-0.04635
0.01896	-0.04401
0.01900	-0.06403
0.01905	-0.08324
0.01909	-0.10159
0.01914	-0.09280
0.01918	-0.08014
0.01923	-0.07345
0.01927	-0.06682
0.01932	-0.07571
0.01937	-0.06648
0.01941	-0.04585
0.01946	-0.05760
0.01950	-0.05986
0.01955	-0.03803
0.01959	-0.00713
0.01964	0.02434
0.01968	0.01531
0.01973	-0.01511
0.01977	-0.03131
0.01982	-0.02281
0.01986	0.01434
0.01991	0.05027
0.01995	0.08140
0.02000	0.09695
0.02005	0.08696
0.02009	0.07069
0.02014	0.03326
0.02018	0.00685
0.02023	0.01967
0.02027	0.04969
0.02032	0.09165
0.02036	0.11774
0.02041	0.11372
0.02045	0.09155
0.02050	0.05887
0.02054	0.03357
0.02059	0.01737
0.02063	0.00781
0.02068	0.01710
0.02073	0.04026
0.02077	0.06483
0.02082	0.07615
0.02086	0.05798
0.02091	0.02062
0.02095	-0.01842
0.02100	-0.03152
0.02104	-0.02164
0.02109	-0.00205
0.02113	0.02280
0.02118	0.02498
0.02122	0.00385
0.02127	-0.02581
0.02132	-0.04610
0.02136	-0.04441
0.02141	-0.02355
0.02145	0.00091
0.02150	0.00499
0.02154	-0.00768
0.02159	-0.02408
0.02163	-0.03720
0.02168	-0.03840
0.02172	-0.03230
0.02177	-0.02504
0.02181	-0.02153
0.02186	-0.01449
0.02190	0.00667
0.02195	0.02308
0.02200	0.01978
0.02204	-0.00167
0.02209	-0.02770
0.02213	-0.03537
0.02218	-0.02067
0.02222	0.00883
0.02227	0.04033
0.02231	0.06040
0.02236	0.06168
0.02240	0.04937
0.02245	0.03494
0.02249	0.02138
0.02254	0.01790
0.02259	0.03139
0.02263	0.05132
0.02268	0.06206
0.02272	0.07857
0.02277	0.09541
0.02281	0.08247
0.02286	0.06489
0.02290	0.05102
0.02295	0.04860
0.02299	0.06393
0.02304	0.06921
0.02308	0.06873
0.02313	0.07170
0.02317	0.06853
0.02322	0.05716
0.02327	0.04524
0.02331	0.03267
0.02336	0.02533
0.02340	0.02190
0.02345	0.01975
0.02349	0.02327
0.02354	0.03216
0.02358	0.02724
0.02363	-0.00798
0.02367	-0.08543
0.02372	-0.20579
0.02376	-0.29726
0.02381	-0.23796
0.02385	-0.05768
0.02390	0.12805
0.02395	0.20950
0.02399	0.10638
0.02404	-0.10737
0.02408	-0.29403
0.02413	-0.37019
0.02417	-0.31134
0.02422	-0.16021
0.02426	-0.02165
0.02431	0.03587
0.02435	0.02639
0.02440	-0.01765
0.02444	-0.04985
0.02449	-0.05727
0.02454	-0.08575
0.02458	-0.14852
0.02463	-0.19423
0.02467	-0.16353
0.02472	-0.05832
0.02476	0.06341
0.02481	0.13242
0.02485	0.10630
0.02490	0.01772
0.02494	-0.05043
0.02499	-0.05381
0.02503	0.00161
0.02508	0.07798
0.02512	0.11832
0.02517	0.09272
0.02522	0.03059
0.02526	-0.01053
0.02531	0.00065
0.02535	0.05816
0.02540	0.13576
0.02544	0.18688
0.02549	0.18866
0.02553	0.14872
0.02558	0.07435
0.02562	0.00879
0.02567	-0.02021
0.02571	-0.01022
0.02576	0.03713
0.02580	0.09072
0.02585	0.12995
0.02590	0.14822
0.02594	0.14135
0.02599	0.10739
0.02603	0.04835
0.02608	-0.02077
0.02612	-0.07974
0.02617	-0.09942
0.02621	-0.06544
0.02626	0.00110
0.02630	0.06907
0.02635	0.09916
0.02639	0.06496
0.02644	-0.01624
0.02649	-0.09883
0.02653	-0.14289
0.02658	-0.12698
0.02662	-0.08478
0.02667	-0.04625
0.02671	-0.03061
0.02676	-0.04608
0.02680	-0.06712
0.02685	-0.07069
0.02689	-0.06098
0.02694	-0.05944
0.02698	-0.06251
0.02703	-0.07034
0.02707	-0.08346
0.02712	-0.07898
0.02717	-0.07032
0.02721	-0.06421
0.02726	-0.05808
0.02730	-0.06544
0.02735	-0.06520
0.02739	-0.04216
0.02744	-0.00578
0.02748	0.01086
0.02753	-0.03674
0.02757	-0.10714
0.02762	-0.11411
0.02766	-0.05067
0.02771	0.04352
0.02776	0.10325
0.02780	0.09263
0.02785	0.04336
0.02789	-0.00270
0.02794	-0.02070
0.02798	-0.01318
0.02803	0.01990
0.02807	0.06542
0.02812	0.08547
0.02816	0.08301
0.02821	0.06193
0.02825	0.04647
0.02830	0.06774
0.02834	0.08606
0.02839	0.07445
0.02844	0.04647
0.02848	0.01553
0.02853	0.01469
0.02857	0.04647
0.02862	0.07444
0.02866	0.07545
0.02871	0.03981
0.02875	0.00254
0.02880	-0.00820
0.02884	0.00191
0.02889	0.02796
0.02893	0.04126
0.02898	0.02701
0.02902	-0.00370
0.02907	-0.02480
0.02912	-0.02400
0.02916	-0.01718
0.02921	-0.00697
0.02925	-0.00437
0.02930	-0.01512
0.02934	-0.02523
0.02939	-0.03301
0.02943	-0.03126
0.02948	-0.02170
0.02952	-0.01859
0.02957	-0.02324
0.02961	-0.03274
0.02966	-0.03836
0.02971	-0.02855
0.02975	-0.01188
0.02980	-0.00343
0.02984	-0.00479
0.02989	-0.00892
0.02993	-0.01538
0.02998	-0.01362
0.03002	-0.00472
0.03007	0.00326
0.03011	0.01169
0.03016	0.01367
0.03020	0.00950
0.03025	0.00556
0.03029	0.00460
0.03034	0.01178
0.03039	0.03333
0.03043	0.05257
0.03048	0.05782
0.03052	0.05041
0.03057	0.03488
0.03061	0.02851
0.03066	0.04061
0.03070	0.05903
0.03075	0.06003
0.03079	0.05829
0.03084	0.06080
0.03088	0.05107
0.03093	0.05824
0.03098	0.07093
0.03102	0.06869
0.03107	0.06937
0.03111	0.05549
0.03116	0.03323
0.03120	0.01959
0.03125	0.02546
0.03129	0.04657
0.03134	0.05037
0.03138	0.04526
0.03143	0.03152
0.03147	0.00962
0.03152	-0.00399
0.03156	-0.01213
0.03161	0.00492
0.03166	0.00902
0.03170	-0.03521
0.03175	-0.13554
0.03179	-0.25821
0.03184	-0.27788
0.03188	-0.15258
0.03193	0.05106
0.03197	0.18918
0.03202	0.15765
0.03206	-0.01805
0.03211	-0.22387
0.03215	-0.33652
0.03220	-0.32131
0.03224	-0.20218
0.03229	-0.05622
0.03234	0.01294
0.03238	0.00448
0.03243	-0.02665
0.03247	-0.04507
0.03252	-0.03434
0.03256	-0.03855
0.03261	-0.10054
0.03265	-0.17598
0.03270	-0.18951
0.03274	-0.11338
0.03279	0.01620
0.03283	0.11462
0.03288	0.12811
0.03293	0.06145
0.03297	-0.02490
0.03302	-0.05665
0.03306	-0.01869
0.03311	0.05848
0.03315	0.10822
0.03320	0.09848
0.03324	0.05174
0.03329	0.00271
0.03333	0.00086
0.03338	0.04620
0.03342	0.10829
0.03347	0.16509
0.03351	0.18282
0.03356	0.14920
0.03361	0.08932
0.03365	0.02697
0.03370	-0.00870
0.03374	-0.00355
0.03379	0.02314
0.03383	0.06123
0.03388	0.09817
0.03392	0.11994
0.03397	0.12438
0.03401	0.11073
0.03406	0.07486
0.03410	0.01350
0.03415	-0.04899
0.03420	-0.09219
0.03424	-0.09093
0.03429	-0.03197
0.03433	0.04532
0.03438	0.09325
0.03442	0.07834
0.03447	0.01437
0.03451	-0.07072
0.03456	-0.12953
0.03460	-0.12314
0.03465	-0.08709
0.03469	-0.04345
0.03474	-0.02625
0.03478	-0.04089
0.03483	-0.06294
0.03488	-0.08236
0.03492	-0.07265
0.03497	-0.05853
0.03501	-0.05383
0.03506	-0.05410
0.03510	-0.06996
0.03515	-0.07671
0.03519	-0.06650
0.03524	-0.05591
0.03528	-0.05074
0.03533	-0.05206
0.03537	-0.05757
0.03542	-0.05381
0.03546	-0.02141
0.03551	-0.00673
0.03556	-0.03147
0.03560	-0.06297
0.03565	-0.09180
0.03569	-0.06084
0.03574	0.01673
0.03578	0.08892
0.03583	0.11443
0.03587	0.08881
0.03592	0.04060
0.03596	-0.02148
0.03601	-0.04234
0.03605	-0.01395
0.03610	0.03627
0.03615	0.09712
0.03619	0.12139
0.03624	0.10484
0.03628	0.08739
0.03633	0.06608
0.03637	0.05524
0.03642	0.04884
0.03646	0.03298
0.03651	0.02512
0.03655	0.03047
0.03660	0.05171
0.03664	0.07304
0.03669	0.07654
0.03673	0.05721
0.03678	0.02080
0.03683	-0.00922
0.03687	-0.01006
0.03692	0.00414
0.03696	0.02177
0.03701	0.02553
0.03705	0.01213
0.03710	-0.00286
0.03714	-0.01469
0.03719	-0.01326
0.03723	-0.00921
0.03728	-0.00793
0.03732	-0.00572
0.03737	-0.01104
0.03741	-0.02340
0.03746	-0.03027
0.03751	-0.03503
0.03755	-0.03433
0.03760	-0.02370
0.03764	-0.01969
0.03769	-0.01604
0.03773	-0.00965
0.03778	-0.00593
0.03782	-0.00080
0.03787	-0.00455
0.03791	-0.01152
0.03796	-0.01145
0.03800	-0.00817
0.03805	0.00030
0.03810	0.00873
0.03814	0.02146
0.03819	0.03009
0.03823	0.03044
0.03828	0.02634
0.03832	0.01707
0.03837	0.01452
0.03841	0.02150
0.03846	0.04454
0.03850	0.06047
0.03855	0.06049
0.03859	0.05530
0.03864	0.04136
0.03868	0.04135
0.03873	0.04451
0.03878	0.04979
0.03882	0.06053
0.03887	0.05131
0.03891	0.05991
0.03896	0.07402
0.03900	0.06892
0.03905	0.06798
0.03909	0.04832
0.03914	0.03182
0.03918	0.02785
0.03923	0.03036
0.03927	0.04271
0.03932	0.03836
0.03937	0.05808
0.03941	0.05484
0.03946	0.02517
0.03950	0.00813
0.03955	-0.02608
0.03959	-0.01411
0.03964	0.00564
0.03968	0.01308
0.03973	0.00397
0.03977	-0.05658
0.03982	-0.16425
0.03986	-0.28066
0.03991	-0.27160
0.03995	-0.12268
0.04000	0.07196
0.04005	0.19552
0.04009	0.13692
0.04014	-0.04885
0.04018	-0.24164
0.04023	-0.33783
0.04027	-0.30355
0.04032	-0.18917
0.04036	-0.06020
0.04041	0.01103
0.04045	0.02276
0.04050	0.00690
0.04054	-0.01162
0.04059	-0.02819
0.04063	-0.06730
0.04068	-0.13000
0.04073	-0.18311
0.04077	-0.16363
0.04082	-0.06733
0.04086	0.05419
0.04091	0.13267
0.04095	0.12365
0.04100	0.05050
0.04104	-0.02809
0.04109	-0.05140
0.04113	-0.01467
0.04118	0.05049
0.04122	0.10353
0.04127	0.10601
0.04132	0.06736
0.04136	0.02708
0.04141	0.01478
0.04145	0.04517
0.04150	0.10328
0.04154	0.15534
0.04159	0.17457
0.04163	0.14273
0.04168	0.07686
0.04172	0.01327
0.04177	-0.01699
0.04181	-0.00099
0.04186	0.03612
0.04190	0.07291
0.04195	0.09852
0.04200	0.10899
0.04204	0.11657
0.04209	0.10351
0.04213	0.06867
0.04218	0.00596
0.04222	-0.06738
0.04227	-0.10579
0.04231	-0.09235
0.04236	-0.02306
0.04240	0.05408
0.04245	0.10209
0.04249	0.07653
0.04254	-0.00699
0.04259	-0.08244
0.04263	-0.12691
0.04268	-0.11051
0.04272	-0.06745
0.04277	-0.04015
0.04281	-0.02901
0.04286	-0.05176
0.04290	-0.07379
0.04295	-0.07501
0.04299	-0.05783
0.04304	-0.03953
0.04308	-0.04388
0.04313	-0.05532
0.04317	-0.07254
0.04322	-0.07203
0.04327	-0.05597
0.04331	-0.04849
0.04336	-0.04220
0.04340	-0.05223
0.04345	-0.07277
0.04349	-0.07155
0.04354	-0.03435
0.04358	0.02350
0.04363	0.03946
0.04367	-0.00961
0.04372	-0.06435
0.04376	-0.08040
0.04381	-0.03337
0.04385	0.04271
0.04390	0.08795
0.04395	0.09370
0.04399	0.05816
0.04404	0.01452
0.04408	-0.01325
0.04413	-0.00979
0.04417	0.03385
0.04422	0.07764
0.04426	0.09604
0.04431	0.07854
0.04435	0.04828
0.04440	0.04557
0.04444	0.05983
0.04449	0.06875
0.04454	0.05305
0.04458	0.02564
0.04463	0.01099
0.04467	0.01715
0.04472	0.03979
0.04476	0.05632
0.04481	0.04772
0.04485	0.01701
0.04490	-0.01239
0.04494	-0.02719
0.04499	-0.01477
0.04503	0.01308
0.04508	0.02951
0.04512	0.02687
0.04517	0.00651
0.04522	-0.01664
0.04526	-0.03052
0.04531	-0.03141
0.04535	-0.01676
0.04540	-0.00268
0.04544	0.00190
0.04549	-0.00588
0.04553	-0.01877
0.04558	-0.02584
0.04562	-0.02679
0.04567	-0.01930
0.04571	-0.01621
0.04576	-0.01963
0.04580	-0.01748
0.04585	-0.00934
0.04590	0.00214
0.04594	0.01084
0.04599	0.01263
0.04603	0.00704
0.04608	0.00001
0.04612	-0.00599
0.04617	-0.00490
0.04621	0.01022
0.04626	0.02762
0.04630	0.03443
0.04635	0.03711
0.04639	0.03077
0.04644	0.01913
0.04649	0.02193
0.04653	0.03438
0.04658	0.05251
0.04662	0.06319
0.04667	0.05873
0.04671	0.04525
0.04676	0.03435
0.04680	0.04099
0.04685	0.05270
0.04689	0.06112
0.04694	0.06797
0.04698	0.06705
0.04703	0.05501
0.04707	0.05009
0.04712	0.05063
0.04717	0.04199
0.04721	0.03660
0.04726	0.03314
0.04730	0.03556
0.04735	0.03689
0.04739	0.03767
0.04744	0.04633
0.04748	0.02661
0.04753	0.01629
0.04757	0.01018
0.04762	-0.01412
0.04766	-0.00922
0.04771	-0.00297
0.04776	0.00364
0.04780	-0.00925
0.04785	-0.10971
0.04789	-0.25340
0.04794	-0.30673
0.04798	-0.18498
0.04803	0.03940
0.04807	0.20195
0.04812	0.20150
0.04816	0.02832
0.04821	-0.20105
0.04825	-0.33573
0.04830	-0.34522
0.04834	-0.23865
0.04839	-0.07620
0.04844	0.03252
0.04848	0.06037
0.04853	0.03153
0.04857	-0.01733
0.04862	-0.04062
0.04866	-0.05844
0.04871	-0.10333
0.04875	-0.15733
0.04880	-0.17040
0.04884	-0.09588
0.04889	0.02766
0.04893	0.12476
0.04898	0.14431
0.04902	0.07789
0.04907	-0.01352
0.04912	-0.05812
0.04916	-0.04053
0.04921	0.02518
0.04925	0.09159
0.04930	0.11339
0.04934	0.08682
0.04939	0.03603
0.04943	0.00839
0.04948	0.02376
0.04952	0.08441
0.04957	0.15258
0.04961	0.18175
0.04966	0.15850
0.04971	0.08557
0.04975	0.00722
0.04980	-0.02809
0.04984	-0.00715
0.04989	0.03986
0.04993	0.07691
0.04998	0.09905
0.05002	0.10670
0.05007	0.11425
0.05011	0.11087
0.05016	0.07782
0.05020	0.01999
0.05025	-0.05544
0.05029	-0.09933
0.05034	-0.08905
0.05039	-0.03084
0.05043	0.05633
0.05048	0.10403
0.05052	0.09186
0.05057	0.02348
0.05061	-0.06783
0.05066	-0.12443
0.05070	-0.12789
0.05075	-0.08663
0.05079	-0.04388
0.05084	-0.02572
0.05088	-0.02502
0.05093	-0.04577
0.05098	-0.06126
0.05102	-0.05220
0.05107	-0.05023
0.05111	-0.05514
0.05116	-0.05579
0.05120	-0.06532
0.05125	-0.06663
0.05129	-0.05577
0.05134	-0.04420
0.05138	-0.02998
0.05143	-0.02407
0.05147	-0.03575
0.05152	-0.06946
0.05156	-0.07873
0.05161	-0.05241
0.05166	-0.00366
0.05170	0.05323
0.05175	0.04381
0.05179	-0.01028
0.05184	-0.05720
0.05188	-0.07187
0.05193	-0.02528
0.05197	0.04627
0.05202	0.09434
0.05206	0.09071
0.05211	0.05928
0.05215	0.03463
0.05220	0.01036
0.05224	0.00378
0.05229	0.01290
0.05234	0.03094
0.05238	0.06402
0.05243	0.08590
0.05247	0.09021
0.05252	0.08134
0.05256	0.06250
0.05261	0.03836
0.05265	0.00723
0.05270	-0.01849
0.05274	-0.01923
0.05279	0.00886
0.05283	0.05726
0.05288	0.08891
0.05293	0.06588
0.05297	0.01136
0.05302	-0.03588
0.05306	-0.05115
0.05311	-0.03093
0.05315	0.00082
0.05320	0.02447
0.05324	0.03096
0.05329	0.02261
0.05333	0.00099
0.05338	-0.03307
0.05342	-0.05063
0.05347	-0.04137
0.05351	-0.01806
0.05356	0.00705
0.05361	0.01039
0.05365	-0.00440
0.05370	-0.01582
0.05374	-0.02113
0.05379	-0.02008
0.05383	-0.01604
0.05388	-0.01705
0.05392	-0.01474
0.05397	0.00397
0.05401	0.03029
0.05406	0.04297
0.05410	0.03300
0.05415	0.00348
0.05420	-0.02122
0.05424	-0.01748
0.05429	0.00497
0.05433	0.03268
0.05438	0.05100
0.05442	0.05714
0.05447	0.05159
0.05451	0.03502
0.05456	0.02154
0.05460	0.01660
0.05465	0.02933
0.05469	0.05027
0.05474	0.05893
0.05478	0.06139
0.05483	0.05616
0.05488	0.04595
0.05492	0.04374
0.05497	0.04211
0.05501	0.04369
0.05506	0.04569
0.05510	0.04456
0.05515	0.05493
0.05519	0.05275
0.05524	0.03868
0.05528	-0.00280
0.05533	-0.05986
0.05537	-0.03350
0.05542	0.03417
0.05546	0.09215
0.05551	0.10900
0.05556	0.07248
0.05560	0.03231
0.05565	-0.02734
0.05569	-0.06811
0.05574	-0.07218
0.05578	-0.05149
0.05583	0.00588
0.05587	0.01591
0.05592	-0.10930
0.05596	-0.26116
0.05601	-0.26095
0.05605	-0.09352
0.05610	0.12149
0.05615	0.19589
0.05619	0.09560
0.05624	-0.08873
0.05628	-0.25298
0.05633	-0.30543
0.05637	-0.26929
0.05642	-0.15235
0.05646	-0.01681
0.05651	0.04572
0.05655	0.06398
0.05660	0.01608
0.05664	-0.04284
0.05669	-0.05157
0.05673	-0.07900
0.05678	-0.12966
0.05683	-0.16788
0.05687	-0.14055
0.05692	-0.04031
0.05696	0.07412
0.05701	0.14956
0.05705	0.13658
0.05710	0.04334
0.05714	-0.05133
0.05719	-0.09157
0.05723	-0.06647
0.05728	0.01486
0.05732	0.09383
0.05737	0.11995
0.05741	0.09054
0.05746	0.03817
0.05751	0.01342
0.05755	0.02899
0.05760	0.07863
0.05764	0.12684
0.05769	0.13174
0.05773	0.09069
0.05778	0.02369
0.05782	-0.01652
0.05787	-0.00324
0.05791	0.04303
0.05796	0.07476
0.05800	0.07946
0.05805	0.06789
0.05810	0.05719
0.05814	0.07298
0.05819	0.06530
0.05823	0.03493
0.05828	-0.01080
0.05832	-0.06115
0.05837	-0.06539
0.05841	-0.03900
0.05846	0.01478
0.05850	0.06936
0.05855	0.08112
0.05859	0.04896
0.05864	-0.02071
0.05868	-0.09640
0.05873	-0.12842
0.05878	-0.09899
0.05882	-0.04425
0.05887	-0.00207
0.05891	0.00711
0.05896	-0.00840
0.05900	-0.03379
0.05905	-0.04837
0.05909	-0.04487
0.05914	-0.05571
0.05918	-0.05887
0.05923	-0.05360
0.05927	-0.05980
0.05932	-0.04408
0.05937	-0.03068
0.05941	-0.01694
0.05946	-0.00050
0.05950	-0.01581
0.05955	-0.05876
0.05959	-0.10481
0.05964	-0.09696
0.05968	-0.02724
0.05973	0.06101
0.05977	0.09554
0.05982	0.03856
0.05986	-0.04799
0.05991	-0.08777
0.05995	-0.06811
0.06000	-0.01311
0.06005	0.04981
0.06009	0.08913
0.06014	0.09868
0.06018	0.08011
0.06023	0.02881
0.06027	-0.02017
0.06032	-0.03173
0.06036	-0.00409
0.06041	0.03055
0.06045	0.04891
0.06050	0.06395
0.06054	0.07745
0.06059	0.08596
0.06063	0.07219
0.06068	0.02524
0.06073	-0.03064
0.06077	-0.05852
0.06082	-0.03705
0.06086	0.01830
0.06091	0.07087
0.06095	0.07840
0.06100	0.04174
0.06104	-0.00722
0.06109	-0.04502
0.06113	-0.05033
0.06118	-0.02916
0.06122	-0.00244
0.06127	0.02216
0.06132	0.03163
0.06136	0.01218
0.06141	-0.02345
0.06145	-0.04811
0.06150	-0.04334
0.06154	-0.01449
0.06159	0.01207
0.06163	0.01234
0.06168	-0.00517
0.06172	-0.01990
0.06177	-0.02063
0.06181	-0.01749
0.06186	-0.02378
0.06190	-0.03331
0.06195	-0.02808
0.06200	-0.00100
0.06204	0.03106
0.06209	0.04416
0.06213	0.03353
0.06218	0.00584
0.06222	-0.02421
0.06227	-0.03237
0.06231	-0.01910
0.06236	0.00739
0.06240	0.03890
0.06245	0.06298
0.06249	0.06379
0.06254	0.03868
0.06259	0.00983
0.06263	-0.00663
0.06268	0.00190
0.06272	0.02766
0.06277	0.04202
0.06281	0.04353
0.06286	0.04343
0.06290	0.04679
0.06295	0.04801
0.06299	0.04012
0.06304	0.03187
0.06308	0.02607
0.06313	0.02953
0.06317	0.03437
0.06322	0.03581
0.06327	0.04043
0.06331	0.04432
0.06336	0.04214
0.06340	0.02891
0.06345	0.02142
0.06349	0.02280
0.06354	0.03235
0.06358	0.04382
0.06363	0.03984
0.06367	0.03418
0.06372	0.01171
0.06376	-0.00880
0.06381	-0.01713
0.06385	-0.01889
0.06390	0.00069
0.06395	0.00843
0.06399	0.01023
0.06404	-0.00355
0.06408	-0.02571
0.06413	-0.12977
0.06417	-0.29938
0.06422	-0.31037
0.06426	-0.17023
0.06431	0.02499
0.06435	0.11373
0.06440	0.02616
