Frequency	Level
21.533203	-57.957287
43.066406	-58.927925
64.599609	-57.112793
86.132812	-57.138603
107.666016	-59.098454
129.199219	-53.409985
150.732422	-39.652653
172.265625	-39.639202
193.798828	-51.460812
215.332031	-64.530075
236.865234	-71.412193
258.398438	-63.570568
279.931641	-63.392982
301.464844	-37.201046
322.998047	-31.802771
344.531250	-38.190811
366.064453	-60.108467
387.597656	-63.836411
409.130859	-71.123123
430.664062	-68.435150
452.197266	-49.703243
473.730469	-36.920033
495.263672	-35.730522
516.796875	-47.680145
538.330078	-63.614365
559.863281	-59.914005
581.396484	-57.273357
602.929688	-51.031033
624.462891	-32.023006
645.996094	-26.467434
667.529297	-32.162025
689.062500	-47.353268
710.595703	-49.663189
732.128906	-58.423817
753.662109	-67.036339
775.195312	-43.754852
796.728516	-32.532600
818.261719	-33.037098
839.794922	-45.249508
861.328125	-41.756126
882.861328	-45.559860
904.394531	-44.744164
925.927734	-35.725681
947.460938	-21.632582
968.994141	-17.221653
990.527344	-23.965406
1012.060547	-34.126171
1033.593750	-29.261389
1055.126953	-34.919666
1076.660156	-36.988262
1098.193359	-23.264236
1119.726562	-15.198309
1141.259766	-15.293524
1162.792969	-25.784515
1184.326172	-31.660723
1205.859375	-41.989174
1227.392578	-38.354862
1248.925781	-30.376921
1270.458984	-20.913176
1291.992188	-17.319729
1313.525391	-23.339298
1335.058594	-33.934715
1356.591797	-30.298409
1378.125000	-38.347500
1399.658203	-38.985115
1421.191406	-36.300488
1442.724609	-25.568703
1464.257812	-25.650364
1485.791016	-32.771759
1507.324219	-33.782082
1528.857422	-39.715027
1550.390625	-33.678967
1571.923828	-32.723682
1593.457031	-21.019377
1614.990234	-18.197151
1636.523438	-23.261986
1658.056641	-43.177658
1679.589844	-32.054199
1701.123047	-37.875492
1722.656250	-41.749523
1744.189453	-30.528837
1765.722656	-27.475100
1787.255859	-33.451576
1808.789062	-43.896595
1830.322266	-36.785812
1851.855469	-38.760906
1873.388672	-43.987190
1894.921875	-45.513130
1916.455078	-36.195206
1937.988281	-36.685684
1959.521484	-46.955894
1981.054688	-48.066284
2002.587891	-40.073082
2024.121094	-41.728035
2045.654297	-49.603977
2067.187500	-39.294437
2088.720703	-35.638985
2110.253906	-42.227825
2131.787109	-48.209095
2153.320312	-43.286022
2174.853516	-46.979954
2196.386719	-52.016460
2217.919922	-55.488541
2239.453125	-45.223557
2260.986328	-52.884090
2282.519531	-53.347015
2304.052734	-49.036888
2325.585938	-43.988117
2347.119141	-47.310493
2368.652344	-45.602238
2390.185547	-36.656868
2411.718750	-34.418121
2433.251953	-40.734062
2454.785156	-45.225597
2476.318359	-40.953453
2497.851562	-43.626347
2519.384766	-44.769062
2540.917969	-42.560047
2562.451172	-37.744171
2583.984375	-43.416580
2605.517578	-46.234577
2627.050781	-38.435555
2648.583984	-39.112579
2670.117188	-43.539612
2691.650391	-50.365173
2713.183594	-37.040592
2734.716797	-32.826748
2756.250000	-42.693871
2777.783203	-38.547592
2799.316406	-36.309216
2820.849609	-36.120190
2842.382812	-36.811287
2863.916016	-35.615604
2885.449219	-32.680187
2906.982422	-33.693848
2928.515625	-38.110703
2950.048828	-36.238251
2971.582031	-39.952232
2993.115234	-46.341278
3014.648438	-43.807343
3036.181641	-38.546135
3057.714844	-37.687328
3079.248047	-46.096806
3100.781250	-46.311184
3122.314453	-44.681019
3143.847656	-51.300335
3165.380859	-52.206848
3186.914062	-48.461994
3208.447266	-43.618839
3229.980469	-47.963554
3251.513672	-49.210743
3273.046875	-41.788876
3294.580078	-42.648285
3316.113281	-50.562256
3337.646484	-52.661053
3359.179688	-50.930565
3380.712891	-47.815479
3402.246094	-55.493900
3423.779297	-47.281799
3445.312500	-46.909016
3466.845703	-47.947304
3488.378906	-45.302338
3509.912109	-37.554012
3531.445312	-34.858109
3552.978516	-36.821430
3574.511719	-53.847271
3596.044922	-40.109276
3617.578125	-40.493935
3639.111328	-45.580242
3660.644531	-51.899014
3682.177734	-41.422909
3703.710938	-45.550770
3725.244141	-43.180347
3746.777344	-37.050022
3768.310547	-40.589443
3789.843750	-45.290447
3811.376953	-46.546223
3832.910156	-38.956303
3854.443359	-41.030029
3875.976562	-43.356758
3897.509766	-55.513046
3919.042969	-43.810230
3940.576172	-43.452003
3962.109375	-47.486240
3983.642578	-61.883259
4005.175781	-52.623375
4026.708984	-60.843498
4048.242188	-46.524746
4069.775391	-42.795441
4091.308594	-48.095039
4112.841797	-54.139114
4134.375000	-62.345234
4155.908203	-48.095768
4177.441406	-48.628597
4198.974609	-49.682961
4220.507812	-58.189487
4242.041016	-50.546757
4263.574219	-47.075726
4285.107422	-51.146332
4306.640625	-53.984577
4328.173828	-55.937813
4349.707031	-54.771595
4371.240234	-52.608101
4392.773438	-52.010540
4414.306641	-65.250076
4435.839844	-50.427128
4457.373047	-60.953949
4478.906250	-48.755924
4500.439453	-50.828053
4521.972656	-53.134544
4543.505859	-65.111145
4565.039062	-55.882702
4586.572266	-52.804100
4608.105469	-57.831718
4629.638672	-50.199883
4651.171875	-54.902290
4672.705078	-53.068951
4694.238281	-52.906918
4715.771484	-51.829437
4737.304688	-57.923534
4758.837891	-57.042068
4780.371094	-90.864311
4801.904297	-54.924446
4823.437500	-58.002510
4844.970703	-55.356190
4866.503906	-52.894028
4888.037109	-54.626057
4909.570312	-54.720303
4931.103516	-58.725498
4952.636719	-48.352100
4974.169922	-52.930595
4995.703125	-56.204967
5017.236328	-57.041260
5038.769531	-54.430721
5060.302734	-58.091972
5081.835938	-61.182518
5103.369141	-58.720806
5124.902344	-60.681377
5146.435547	-68.289497
5167.968750	-63.778938
5189.501953	-60.011723
5211.035156	-61.147141
5232.568359	-75.864525
5254.101562	-75.931496
5275.634766	-62.978626
5297.167969	-66.703201
5318.701172	-68.690186
5340.234375	-77.626518
5361.767578	-73.136711
5383.300781	-75.672012
5404.833984	-69.911880
5426.367188	-70.490379
5447.900391	-68.412880
5469.433594	-70.934410
5490.966797	-66.111282
5512.500000	-59.268532
5534.033203	-61.082905
5555.566406	-66.685616
5577.099609	-61.031132
5598.632812	-60.002857
5620.166016	-62.892059
5641.699219	-65.109169
5663.232422	-79.734550
5684.765625	-63.141113
5706.298828	-65.963676
5727.832031	-72.807892
5749.365234	-66.548447
5770.898438	-67.869240
5792.431641	-69.227287
5813.964844	-67.629288
5835.498047	-63.923717
5857.031250	-68.243004
5878.564453	-71.123581
5900.097656	-71.011398
5921.630859	-77.345970
5943.164062	-81.556847
5964.697266	-70.566727
5986.230469	-73.622597
6007.763672	-64.986267
6029.296875	-64.349777
6050.830078	-67.037003
6072.363281	-61.099030
6093.896484	-62.286789
6115.429688	-65.413803
6136.962891	-62.733608
6158.496094	-58.308392
6180.029297	-63.512459
6201.562500	-64.403709
6223.095703	-72.510620
6244.628906	-71.302650
6266.162109	-72.541931
6287.695312	-71.142120
6309.228516	-76.081955
6330.761719	-65.147316
6352.294922	-71.751602
6373.828125	-69.498848
6395.361328	-62.320095
6416.894531	-62.749344
6438.427734	-77.176262
6459.960938	-65.960777
6481.494141	-63.717869
6503.027344	-64.750793
6524.560547	-84.002632
6546.093750	-67.477028
6567.626953	-66.259750
6589.160156	-74.579536
6610.693359	-69.191963
6632.226562	-64.343925
6653.759766	-63.429070
6675.292969	-64.518303
6696.826172	-71.309608
6718.359375	-82.496590
6739.892578	-75.256989
6761.425781	-69.823227
6782.958984	-71.221581
6804.492188	-72.996140
6826.025391	-75.797783
6847.558594	-68.923637
6869.091797	-65.766518
6890.625000	-65.337372
6912.158203	-70.499290
6933.691406	-70.240982
6955.224609	-72.959023
6976.757812	-79.132011
6998.291016	-72.124245
7019.824219	-74.974197
7041.357422	-64.721924
7062.890625	-63.586605
7084.423828	-66.407669
7105.957031	-71.066269
7127.490234	-69.207527
7149.023438	-74.880722
7170.556641	-88.994629
7192.089844	-76.899681
7213.623047	-69.799950
7235.156250	-85.084869
7256.689453	-75.666527
7278.222656	-82.256668
7299.755859	-74.168739
7321.289062	-79.696083
7342.822266	-82.082970
7364.355469	-87.619591
7385.888672	-74.086929
7407.421875	-70.684479
7428.955078	-72.863007
7450.488281	-75.608742
7472.021484	-74.839638
7493.554688	-87.795776
7515.087891	-88.276077
7536.621094	-84.352226
7558.154297	-103.580292
7579.687500	-79.571091
7601.220703	-78.497635
7622.753906	-74.154480
7644.287109	-78.102020
7665.820312	-72.632561
7687.353516	-70.734688
7708.886719	-81.454361
7730.419922	-79.342209
7751.953125	-85.508629
7773.486328	-76.421181
7795.019531	-79.996277
7816.552734	-83.309769
7838.085938	-74.068733
7859.619141	-72.440010
7881.152344	-74.150635
7902.685547	-74.174873
7924.218750	-73.732178
7945.751953	-76.434494
7967.285156	-79.680923
7988.818359	-79.983894
8010.351562	-76.866333
8031.884766	-80.221832
8053.417969	-82.242096
8074.951172	-78.749306
8096.484375	-80.017197
8118.017578	-87.747536
8139.550781	-83.667671
8161.083984	-73.677383
8182.617188	-77.646240
8204.150391	-82.390564
8225.683594	-78.954399
8247.216797	-81.101639
8268.750000	-97.443451
8290.283203	-85.531487
8311.816406	-90.309280
8333.349609	-84.472351
8354.882812	-77.682213
8376.416016	-80.333801
8397.949219	-82.077209
8419.482422	-77.878067
8441.015625	-83.320297
8462.548828	-91.525810
8484.082031	-93.655556
8505.615234	-89.496078
8527.148438	-83.259842
8548.681641	-78.352875
8570.214844	-86.902740
8591.748047	-85.028381
8613.281250	-86.150925
8634.814453	-86.551331
8656.347656	-96.087517
8677.880859	-89.121674
8699.414062	-104.056206
8720.947266	-94.269333
8742.480469	-93.132881
8764.013672	-81.282722
8785.546875	-81.967529
8807.080078	-95.026833
8828.613281	-85.465187
8850.146484	-82.838760
8871.679688	-83.537193
8893.212891	-94.397400
8914.746094	-87.500145
8936.279297	-91.792084
8957.812500	-93.976120
8979.345703	-86.708672
9000.878906	-82.749634
9022.412109	-99.484116
9043.945312	-85.619667
9065.478516	-84.801369
9087.011719	-86.829002
9108.544922	-91.079384
9130.078125	-91.546394
9151.611328	-91.114655
9173.144531	-87.121643
9194.677734	-84.125839
9216.210938	-84.358757
9237.744141	-90.178017
9259.277344	-94.275162
9280.810547	-89.380814
9302.343750	-92.619438
9323.876953	-101.551331
9345.410156	-92.505394
9366.943359	-87.535019
9388.476562	-85.419327
9410.009766	-97.950417
9431.542969	-87.108482
9453.076172	-90.733429
9474.609375	-92.348595
9496.142578	-93.285004
9517.675781	-94.417122
9539.208984	-93.047768
9560.742188	-89.936096
9582.275391	-102.300301
9603.808594	-95.545326
9625.341797	-92.844368
9646.875000	-89.819038
9668.408203	-88.598122
9689.941406	-102.807762
9711.474609	-88.931702
9733.007812	-88.337662
9754.541016	-85.692795
9776.074219	-84.030106
9797.607422	-85.091606
9819.140625	-83.690727
9840.673828	-85.140030
9862.207031	-92.846359
9883.740234	-93.599403
9905.273438	-90.723862
9926.806641	-88.756363
9948.339844	-80.300140
9969.873047	-82.872589
9991.406250	-90.824074
10012.939453	-83.675713
10034.472656	-85.055046
10056.005859	-86.251808
10077.539062	-105.761208
10099.072266	-86.211937
10120.605469	-85.058258
10142.138672	-95.064636
10163.671875	-91.102211
10185.205078	-88.827873
10206.738281	-90.739433
10228.271484	-92.380234
10249.804688	-95.416382
10271.337891	-90.352913
10292.871094	-88.547539
10314.404297	-92.928642
10335.937500	-87.093224
10357.470703	-88.550591
10379.003906	-88.098122
10400.537109	-95.918968
10422.070312	-92.788010
10443.603516	-88.172440
10465.136719	-91.234894
10486.669922	-99.397514
10508.203125	-103.212494
10529.736328	-95.392387
10551.269531	-101.207085
10572.802734	-89.610359
10594.335938	-88.132919
10615.869141	-96.709328
10637.402344	-100.499352
10658.935547	-94.656975
10680.468750	-98.763863
10702.001953	-103.869377
10723.535156	-97.865089
10745.068359	-99.775124
10766.601562	-106.251144
10788.134766	-111.051880
10809.667969	-106.512283
10831.201172	-101.399109
10852.734375	-97.730690
10874.267578	-96.470360
10895.800781	-98.784523
10917.333984	-99.352821
10938.867188	-105.846741
10960.400391	-104.786682
10981.933594	-98.178642
11003.466797	-100.320290
