Frequency	Level
21.533203	-63.538086
43.066406	-58.468651
64.599609	-54.846302
86.132812	-57.008305
107.666016	-58.467888
129.199219	-47.755726
150.732422	-36.484741
172.265625	-38.165752
193.798828	-52.678577
215.332031	-71.700310
236.865234	-73.290459
258.398438	-62.905872
279.931641	-53.963047
301.464844	-36.325920
322.998047	-34.492886
344.531250	-45.804977
366.064453	-62.780819
387.597656	-64.699089
409.130859	-61.823139
430.664062	-57.747986
452.197266	-49.023434
473.730469	-45.002201
495.263672	-51.519028
516.796875	-61.872036
538.330078	-61.358105
559.863281	-67.917259
581.396484	-65.261223
602.929688	-53.198631
624.462891	-49.556179
645.996094	-55.431503
667.529297	-75.963585
689.062500	-81.365906
710.595703	-68.559227
732.128906	-65.378456
753.662109	-68.216316
775.195312	-65.794144
796.728516	-63.733601
818.261719	-63.282440
839.794922	-69.279739
861.328125	-66.769119
882.861328	-72.231834
904.394531	-65.617432
925.927734	-60.709305
947.460938	-58.753254
968.994141	-60.476185
990.527344	-69.494125
1012.060547	-62.783089
1033.593750	-59.803364
1055.126953	-58.517078
1076.660156	-58.884724
1098.193359	-59.921024
1119.726562	-65.794701
1141.259766	-62.658966
1162.792969	-58.542606
1184.326172	-59.913853
1205.859375	-61.599701
1227.392578	-60.692410
1248.925781	-68.566086
1270.458984	-60.688782
1291.992188	-61.507359
1313.525391	-75.772720
1335.058594	-70.807106
1356.591797	-62.005482
1378.125000	-65.342522
1399.658203	-60.339073
1421.191406	-65.158180
1442.724609	-54.415611
1464.257812	-51.738541
1485.791016	-59.102669
1507.324219	-57.104889
1528.857422	-66.165733
1550.390625	-69.015007
1571.923828	-66.243759
1593.457031	-67.507393
1614.990234	-74.222694
1636.523438	-88.110954
1658.056641	-70.749794
1679.589844	-62.381237
1701.123047	-56.247425
1722.656250	-53.975899
1744.189453	-57.159176
1765.722656	-64.434608
1787.255859	-63.311317
1808.789062	-57.965225
1830.322266	-54.660526
1851.855469	-57.776115
1873.388672	-66.570740
1894.921875	-72.882233
1916.455078	-78.530800
1937.988281	-63.414146
1959.521484	-64.952812
1981.054688	-72.353775
2002.587891	-71.085854
2024.121094	-67.605042
2045.654297	-62.272808
2067.187500	-63.041363
2088.720703	-65.655441
2110.253906	-69.735603
2131.787109	-55.864223
2153.320312	-54.960995
2174.853516	-69.239624
2196.386719	-64.019958
2217.919922	-65.005928
2239.453125	-53.498569
2260.986328	-51.984818
2282.519531	-55.017281
2304.052734	-60.886806
2325.585938	-61.005817
2347.119141	-57.375919
2368.652344	-61.326252
2390.185547	-68.467796
2411.718750	-72.717422
2433.251953	-69.407005
2454.785156	-72.765823
2476.318359	-65.960373
2497.851562	-60.922665
2519.384766	-59.960457
2540.917969	-61.925838
2562.451172	-62.275879
2583.984375	-62.666759
2605.517578	-69.396370
2627.050781	-71.666107
2648.583984	-57.379585
2670.117188	-52.873753
2691.650391	-57.816280
2713.183594	-60.496067
2734.716797	-61.895622
2756.250000	-59.395054
2777.783203	-59.955772
2799.316406	-56.833763
2820.849609	-47.685978
2842.382812	-45.522724
2863.916016	-51.338421
2885.449219	-56.052567
2906.982422	-63.656250
2928.515625	-65.498650
2950.048828	-59.753365
2971.582031	-65.318848
2993.115234	-59.540329
3014.648438	-65.342613
3036.181641	-67.803047
3057.714844	-67.517471
3079.248047	-73.974930
3100.781250	-61.418095
3122.314453	-63.918159
3143.847656	-56.433289
3165.380859	-60.523071
3186.914062	-58.743336
3208.447266	-62.617352
3229.980469	-69.130707
3251.513672	-64.474419
3273.046875	-64.395439
3294.580078	-56.098217
3316.113281	-54.076694
3337.646484	-63.815002
3359.179688	-61.973358
3380.712891	-67.957481
3402.246094	-67.102760
3423.779297	-64.955688
3445.312500	-54.292175
3466.845703	-53.462921
3488.378906	-63.156750
3509.912109	-59.957481
3531.445312	-61.176445
3552.978516	-60.397121
3574.511719	-65.300613
3596.044922	-53.706997
3617.578125	-50.316772
3639.111328	-53.568909
3660.644531	-65.247879
3682.177734	-57.412315
3703.710938	-65.525467
3725.244141	-57.376621
3746.777344	-59.701862
3768.310547	-51.338860
3789.843750	-46.963009
3811.376953	-48.183304
3832.910156	-49.309658
3854.443359	-60.803116
3875.976562	-52.208191
3897.509766	-50.859596
3919.042969	-46.643196
3940.576172	-48.161865
3962.109375	-54.714489
3983.642578	-51.838303
4005.175781	-56.034538
4026.708984	-59.594482
4048.242188	-66.140945
4069.775391	-48.085941
4091.308594	-46.840557
4112.841797	-49.507580
4134.375000	-50.742855
4155.908203	-50.452236
4177.441406	-53.541344
4198.974609	-51.246552
4220.507812	-59.256992
4242.041016	-53.787510
4263.574219	-54.101440
4285.107422	-46.527500
4306.640625	-48.715202
4328.173828	-52.269188
4349.707031	-52.421803
4371.240234	-53.530628
4392.773438	-55.536285
4414.306641	-74.097092
4435.839844	-51.718266
4457.373047	-52.979263
4478.906250	-56.080875
4500.439453	-58.050831
4521.972656	-83.974167
4543.505859	-52.025280
4565.039062	-51.050446
4586.572266	-57.157459
4608.105469	-59.454250
4629.638672	-62.316078
4651.171875	-62.186699
4672.705078	-67.688560
4694.238281	-67.551414
4715.771484	-61.811604
4737.304688	-67.302643
4758.837891	-58.334049
4780.371094	-58.465080
4801.904297	-63.513435
4823.437500	-64.912277
4844.970703	-67.184792
4866.503906	-73.075562
4888.037109	-62.274151
4909.570312	-60.838570
4931.103516	-60.528435
4952.636719	-60.319576
4974.169922	-64.232819
4995.703125	-64.739365
5017.236328	-65.609207
5038.769531	-60.544727
5060.302734	-71.083549
5081.835938	-63.519451
5103.369141	-60.272533
5124.902344	-64.679146
5146.435547	-59.659519
5167.968750	-57.455154
5189.501953	-59.726933
5211.035156	-64.890121
5232.568359	-73.783585
5254.101562	-78.064957
5275.634766	-65.079201
5297.167969	-61.602982
5318.701172	-59.856712
5340.234375	-60.596588
5361.767578	-63.024956
5383.300781	-69.791313
5404.833984	-62.860912
5426.367188	-62.073711
5447.900391	-63.305336
5469.433594	-67.832603
5490.966797	-53.420288
5512.500000	-49.410896
5534.033203	-51.435188
5555.566406	-50.455376
5577.099609	-51.419487
5598.632812	-67.828972
5620.166016	-68.622116
5641.699219	-55.028774
5663.232422	-52.133888
5684.765625	-51.696613
5706.298828	-55.852985
5727.832031	-77.560555
5749.365234	-54.284115
5770.898438	-52.715866
5792.431641	-64.025169
5813.964844	-50.273335
5835.498047	-53.162289
5857.031250	-63.768044
5878.564453	-65.372696
5900.097656	-68.036461
5921.630859	-56.690258
5943.164062	-58.117424
5964.697266	-58.024395
5986.230469	-52.874084
6007.763672	-52.429420
6029.296875	-52.609451
6050.830078	-56.947796
6072.363281	-57.459122
6093.896484	-66.579506
6115.429688	-65.040871
6136.962891	-57.223618
6158.496094	-50.193867
6180.029297	-52.782627
6201.562500	-60.840313
6223.095703	-64.161812
6244.628906	-61.917023
6266.162109	-59.470871
6287.695312	-49.615856
6309.228516	-53.196625
6330.761719	-69.319542
6352.294922	-67.544571
6373.828125	-62.942642
6395.361328	-58.489986
6416.894531	-59.273178
6438.427734	-56.295864
6459.960938	-52.091187
6481.494141	-55.213890
6503.027344	-57.824471
6524.560547	-64.791573
6546.093750	-58.800072
6567.626953	-55.940605
6589.160156	-56.202568
6610.693359	-56.361870
6632.226562	-54.199421
6653.759766	-55.050140
6675.292969	-62.751060
6696.826172	-64.816025
6718.359375	-61.123650
6739.892578	-70.490379
6761.425781	-58.180458
6782.958984	-61.522488
6804.492188	-66.967110
6826.025391	-58.097263
6847.558594	-57.768246
6869.091797	-60.532749
6890.625000	-57.177563
6912.158203	-55.006920
6933.691406	-53.279583
6955.224609	-54.408787
6976.757812	-58.600159
6998.291016	-62.444283
7019.824219	-72.543793
7041.357422	-56.942799
7062.890625	-59.054222
7084.423828	-61.298977
7105.957031	-61.414253
7127.490234	-56.170921
7149.023438	-55.926102
7170.556641	-54.491669
7192.089844	-54.645023
7213.623047	-63.423382
7235.156250	-53.426235
7256.689453	-51.224762
7278.222656	-52.634407
7299.755859	-57.735325
7321.289062	-58.259609
7342.822266	-56.681740
7364.355469	-59.863033
7385.888672	-61.428993
7407.421875	-63.846394
7428.955078	-66.057449
7450.488281	-61.139027
7472.021484	-59.916222
7493.554688	-62.890907
7515.087891	-63.832493
7536.621094	-68.321899
7558.154297	-65.557922
7579.687500	-69.881165
7601.220703	-66.313843
7622.753906	-73.527260
7644.287109	-85.825035
7665.820312	-70.375542
7687.353516	-68.470779
7708.886719	-67.284447
7730.419922	-65.952682
7751.953125	-66.398659
7773.486328	-67.847343
7795.019531	-74.037193
7816.552734	-66.670334
7838.085938	-70.281303
7859.619141	-68.708649
7881.152344	-65.835297
7902.685547	-69.726624
7924.218750	-75.517937
7945.751953	-71.073288
7967.285156	-68.378372
7988.818359	-69.235474
8010.351562	-70.976601
8031.884766	-71.358101
8053.417969	-71.499763
8074.951172	-77.754707
8096.484375	-77.942513
8118.017578	-74.690224
8139.550781	-74.586159
8161.083984	-81.138268
8182.617188	-76.606834
8204.150391	-71.817657
8225.683594	-73.081360
8247.216797	-77.868317
8268.750000	-74.206970
8290.283203	-70.715569
8311.816406	-71.881973
8333.349609	-73.818710
8354.882812	-69.879402
8376.416016	-65.081932
8397.949219	-71.173897
8419.482422	-74.312668
8441.015625	-80.648239
8462.548828	-74.538757
8484.082031	-78.899040
8505.615234	-82.876152
8527.148438	-76.760551
8548.681641	-78.116447
8570.214844	-81.145058
8591.748047	-89.914963
8613.281250	-89.861023
8634.814453	-82.979355
8656.347656	-80.166656
8677.880859	-77.031876
8699.414062	-78.458855
8720.947266	-78.489952
8742.480469	-80.864388
8764.013672	-92.221840
8785.546875	-86.457932
8807.080078	-84.165970
8828.613281	-86.459503
8850.146484	-80.801941
8871.679688	-77.360504
8893.212891	-83.222694
8914.746094	-78.501564
8936.279297	-78.060066
8957.812500	-85.341713
8979.345703	-83.626556
9000.878906	-82.243324
9022.412109	-77.264381
9043.945312	-78.857956
9065.478516	-83.027657
9087.011719	-85.174744
9108.544922	-85.728729
9130.078125	-76.985847
9151.611328	-76.544258
9173.144531	-79.209244
9194.677734	-82.448586
9216.210938	-85.056931
9237.744141	-83.816338
9259.277344	-78.630081
9280.810547	-83.390755
9302.343750	-79.757133
9323.876953	-82.803345
9345.410156	-88.594238
9366.943359	-85.345230
9388.476562	-84.229446
9410.009766	-82.351051
9431.542969	-86.651749
9453.076172	-82.674767
9474.609375	-80.728622
9496.142578	-82.010193
9517.675781	-80.808472
9539.208984	-82.358444
9560.742188	-93.691154
9582.275391	-81.457611
9603.808594	-78.430428
9625.341797	-76.718369
9646.875000	-78.858551
9668.408203	-85.165268
9689.941406	-82.279572
9711.474609	-85.419937
9733.007812	-88.975258
9754.541016	-87.795654
9776.074219	-82.291946
9797.607422	-83.822021
9819.140625	-83.537933
9840.673828	-79.764755
9862.207031	-88.171913
9883.740234	-78.445724
9905.273438	-75.646690
9926.806641	-75.162720
9948.339844	-79.978539
9969.873047	-81.146843
9991.406250	-82.995796
10012.939453	-83.652122
10034.472656	-90.580017
10056.005859	-82.736618
10077.539062	-77.919495
10099.072266	-77.093010
10120.605469	-84.459602
10142.138672	-88.397102
10163.671875	-84.487648
10185.205078	-88.275253
10206.738281	-82.762070
10228.271484	-79.836998
10249.804688	-82.726013
10271.337891	-92.416176
10292.871094	-88.036186
10314.404297	-83.850975
10335.937500	-83.603104
10357.470703	-81.312653
10379.003906	-83.910355
10400.537109	-90.920204
10422.070312	-88.727791
10443.603516	-89.604660
10465.136719	-87.197151
10486.669922	-85.126450
10508.203125	-100.393913
10529.736328	-94.160820
10551.269531	-90.431808
10572.802734	-92.104942
10594.335938	-98.990616
10615.869141	-97.547043
10637.402344	-94.316269
10658.935547	-97.812187
10680.468750	-91.245674
10702.001953	-102.714394
10723.535156	-97.584900
10745.068359	-97.558884
10766.601562	-101.171776
10788.134766	-97.513763
10809.667969	-92.522606
10831.201172	-95.809952
10852.734375	-97.873764
10874.267578	-97.991676
10895.800781	-92.783180
10917.333984	-95.814926
10938.867188	-102.004517
10960.400391	-97.928169
10981.933594	-94.516830
11003.466797	-91.970795
