Frequency	Level
21.533203	-75.476089
43.066406	-72.119804
64.599609	-72.101997
86.132812	-73.392227
107.666016	-58.155396
129.199219	-55.412113
150.732422	-64.636169
172.265625	-78.465630
193.798828	-77.348679
215.332031	-63.951012
236.865234	-52.133408
258.398438	-52.862267
279.931641	-66.002899
301.464844	-78.215508
322.998047	-83.689735
344.531250	-63.616760
366.064453	-55.284298
387.597656	-56.849365
409.130859	-70.264961
430.664062	-81.716873
452.197266	-75.916603
473.730469	-62.037899
495.263672	-59.417618
516.796875	-66.394310
538.330078	-80.034294
559.863281	-83.045486
581.396484	-81.710472
602.929688	-75.877419
624.462891	-74.780037
645.996094	-77.589935
667.529297	-82.595390
689.062500	-83.355194
710.595703	-79.521019
732.128906	-76.028206
753.662109	-78.079872
775.195312	-81.524277
796.728516	-87.918808
818.261719	-85.216019
839.794922	-79.792465
861.328125	-78.106522
882.861328	-79.458954
904.394531	-81.064964
925.927734	-87.355042
947.460938	-72.141434
968.994141	-62.451374
990.527344	-62.979729
1012.060547	-65.076950
1033.593750	-70.716347
1055.126953	-82.324539
1076.660156	-74.748009
1098.193359	-67.152718
1119.726562	-66.618866
1141.259766	-66.525459
1162.792969	-73.425110
1184.326172	-79.027435
1205.859375	-65.613815
1227.392578	-63.665871
1248.925781	-68.333534
1270.458984	-68.596664
1291.992188	-76.380753
1313.525391	-75.620819
1335.058594	-65.722298
1356.591797	-63.028862
1378.125000	-66.090652
1399.658203	-66.957626
1421.191406	-75.464813
1442.724609	-66.381577
1464.257812	-62.837681
1485.791016	-67.892319
1507.324219	-75.075302
1528.857422	-75.718224
1550.390625	-82.330826
1571.923828	-76.915955
1593.457031	-71.313469
1614.990234	-73.769455
1636.523438	-78.728035
1658.056641	-78.765388
1679.589844	-77.071365
1701.123047	-72.715485
1722.656250	-75.828796
1744.189453	-80.964073
1765.722656	-79.904755
1787.255859	-81.556023
1808.789062	-88.148026
1830.322266	-80.778557
1851.855469	-80.504204
1873.388672	-88.441345
1894.921875	-80.457870
1916.455078	-80.927887
1937.988281	-79.020294
1959.521484	-82.038956
1981.054688	-84.304390
2002.587891	-84.410324
2024.121094	-83.003777
2045.654297	-87.322716
2067.187500	-83.260826
2088.720703	-79.120438
2110.253906	-84.906303
2131.787109	-84.677628
2153.320312	-80.588707
2174.853516	-78.413429
2196.386719	-77.319382
2217.919922	-78.526009
2239.453125	-80.022652
2260.986328	-78.373802
2282.519531	-75.170860
2304.052734	-77.568237
2325.585938	-71.050987
2347.119141	-72.833458
2368.652344	-76.601616
2390.185547	-68.934380
2411.718750	-65.372154
2433.251953	-63.938473
2454.785156	-64.278564
2476.318359	-66.220291
2497.851562	-75.313889
2519.384766	-63.291687
2540.917969	-58.521309
2562.451172	-56.667145
2583.984375	-58.309258
2605.517578	-65.421219
2627.050781	-68.385124
2648.583984	-66.321297
2670.117188	-64.256737
2691.650391	-66.966888
2713.183594	-70.408836
2734.716797	-72.065666
2756.250000	-78.606888
2777.783203	-73.864822
2799.316406	-70.565948
2820.849609	-70.415787
2842.382812	-76.233803
2863.916016	-85.188446
2885.449219	-83.336357
2906.982422	-78.739738
2928.515625	-78.780739
2950.048828	-84.320480
2971.582031	-87.268456
2993.115234	-89.102356
3014.648438	-90.874405
3036.181641	-84.832573
3057.714844	-82.097862
3079.248047	-84.763214
3100.781250	-92.417511
3122.314453	-90.176712
3143.847656	-90.524055
3165.380859	-92.875122
3186.914062	-93.682831
3208.447266	-94.869041
3229.980469	-96.006630
3251.513672	-94.468437
3273.046875	-91.541428
3294.580078	-89.141068
3316.113281	-93.446922
3337.646484	-95.147926
3359.179688	-90.196129
3380.712891	-92.362350
3402.246094	-87.751221
3423.779297	-88.630852
3445.312500	-92.176430
3466.845703	-91.215149
3488.378906	-90.761848
3509.912109	-90.298927
3531.445312	-87.391289
3552.978516	-87.336647
3574.511719	-86.766922
3596.044922	-85.427589
3617.578125	-81.887848
3639.111328	-76.751434
3660.644531	-74.304451
3682.177734	-74.635544
3703.710938	-76.395538
3725.244141	-81.900703
3746.777344	-79.605217
3768.310547	-76.123283
3789.843750	-71.241875
3811.376953	-68.540680
3832.910156	-71.288391
3854.443359	-77.228462
3875.976562	-70.306229
3897.509766	-69.495934
3919.042969	-68.426178
3940.576172	-70.367859
3962.109375	-76.985443
3983.642578	-75.449356
4005.175781	-71.540741
4026.708984	-71.575218
4048.242188	-74.847778
4069.775391	-76.038338
4091.308594	-72.927132
4112.841797	-68.991890
4134.375000	-65.882454
4155.908203	-67.330498
4177.441406	-70.410583
4198.974609	-74.051697
4220.507812	-73.320145
4242.041016	-72.778542
4263.574219	-72.056183
4285.107422	-74.468613
4306.640625	-77.823997
4328.173828	-80.681320
4349.707031	-78.608253
4371.240234	-76.005051
4392.773438	-77.063049
4414.306641	-82.282707
4435.839844	-84.693718
4457.373047	-85.199944
4478.906250	-85.140831
4500.439453	-83.146378
4521.972656	-84.753311
4543.505859	-85.939362
4565.039062	-87.528046
4586.572266	-88.981285
4608.105469	-86.826820
4629.638672	-86.824875
4651.171875	-96.345589
4672.705078	-95.009247
4694.238281	-95.754295
4715.771484	-92.616348
4737.304688	-93.379974
4758.837891	-96.539482
4780.371094	-95.236275
4801.904297	-95.628250
4823.437500	-99.466103
4844.970703	-101.330620
4866.503906	-97.812126
4888.037109	-94.203308
4909.570312	-95.171982
4931.103516	-98.170387
4952.636719	-97.858971
4974.169922	-97.569618
4995.703125	-94.107635
5017.236328	-100.376297
5038.769531	-97.883087
5060.302734	-95.193680
5081.835938	-95.126961
5103.369141	-95.042290
5124.902344	-94.612175
5146.435547	-95.846863
5167.968750	-96.445000
5189.501953	-96.742210
5211.035156	-97.938217
5232.568359	-97.558067
5254.101562	-97.410744
5275.634766	-95.320793
5297.167969	-96.607498
5318.701172	-100.265999
5340.234375	-100.524887
5361.767578	-97.713799
5383.300781	-95.965843
5404.833984	-96.585175
5426.367188	-97.148407
5447.900391	-98.357750
5469.433594	-102.346992
5490.966797	-98.112968
5512.500000	-95.334358
5534.033203	-95.067200
5555.566406	-97.661835
5577.099609	-96.623138
5598.632812	-98.227386
5620.166016	-99.738724
5641.699219	-99.176765
5663.232422	-98.113327
5684.765625	-99.434929
5706.298828	-96.853806
5727.832031	-99.121498
5749.365234	-100.211876
5770.898438	-100.159386
5792.431641	-99.520836
5813.964844	-100.122345
5835.498047	-96.951416
5857.031250	-97.131218
5878.564453	-99.918961
5900.097656	-100.269035
5921.630859	-99.923965
5943.164062	-100.457443
5964.697266	-98.317368
5986.230469	-97.571457
6007.763672	-95.802216
6029.296875	-93.513817
6050.830078	-91.665382
6072.363281	-90.577301
6093.896484	-89.340027
6115.429688	-92.676918
6136.962891	-92.667938
6158.496094	-90.799141
6180.029297	-90.353798
6201.562500	-88.881172
6223.095703	-89.296211
6244.628906	-92.063194
6266.162109	-88.916977
6287.695312	-88.539124
6309.228516	-87.958160
6330.761719	-84.733360
6352.294922	-87.420364
6373.828125	-91.440430
6395.361328	-91.255157
6416.894531	-90.950150
6438.427734	-90.217804
6459.960938	-87.110130
6481.494141	-91.461983
6503.027344	-94.098221
6524.560547	-94.509079
6546.093750	-94.000084
6567.626953	-88.451736
6589.160156	-88.600151
6610.693359	-91.042160
6632.226562	-89.696815
6653.759766	-88.268539
6675.292969	-90.784447
6696.826172	-87.935730
6718.359375	-89.959000
6739.892578	-91.887520
6761.425781	-91.009056
6782.958984	-91.816147
6804.492188	-89.579346
6826.025391	-87.196892
6847.558594	-90.634903
6869.091797	-94.164253
6890.625000	-91.849892
6912.158203	-90.903709
6933.691406	-88.511513
6955.224609	-87.359573
6976.757812	-90.998299
6998.291016	-91.114540
7019.824219	-89.500938
7041.357422	-85.519897
7062.890625	-82.598022
7084.423828	-86.852028
7105.957031	-93.577286
7127.490234	-89.908821
7149.023438	-87.303986
7170.556641	-89.125526
7192.089844	-87.207649
7213.623047	-92.182518
7235.156250	-96.697914
7256.689453	-100.836143
7278.222656	-96.534103
7299.755859	-92.687172
7321.289062	-95.333656
7342.822266	-100.165031
7364.355469	-98.054214
7385.888672	-97.466293
7407.421875	-97.901375
7428.955078	-95.498001
7450.488281	-97.473358
7472.021484	-99.861214
7493.554688	-99.668106
7515.087891	-95.328125
7536.621094	-89.284065
7558.154297	-89.448158
7579.687500	-91.571396
7601.220703	-93.736465
7622.753906	-92.589325
7644.287109	-92.857437
7665.820312	-91.970039
7687.353516	-92.267380
7708.886719	-94.666962
7730.419922	-94.340759
7751.953125	-92.249146
7773.486328	-90.272423
7795.019531	-88.901939
7816.552734	-91.174522
7838.085938	-92.608887
7859.619141	-89.822067
7881.152344	-87.283180
7902.685547	-85.546753
7924.218750	-85.771149
7945.751953	-88.617950
7967.285156	-90.037888
7988.818359	-89.398163
8010.351562	-88.214401
8031.884766	-86.608444
8053.417969	-90.267807
8074.951172	-94.856392
8096.484375	-97.680000
8118.017578	-95.214088
8139.550781	-91.745186
8161.083984	-91.440468
8182.617188	-95.302925
8204.150391	-98.689796
8225.683594	-98.927986
8247.216797	-98.040985
8268.750000	-97.751892
8290.283203	-96.691650
8311.816406	-96.867310
8333.349609	-97.513260
8354.882812	-98.888901
8376.416016	-99.886971
8397.949219	-96.290092
8419.482422	-96.204544
8441.015625	-97.983185
8462.548828	-100.710564
8484.082031	-99.012405
8505.615234	-98.336357
8527.148438	-97.520607
8548.681641	-99.605522
8570.214844	-103.311111
8591.748047	-99.682564
8613.281250	-99.722404
8634.814453	-95.990479
8656.347656	-96.545883
8677.880859	-98.509613
8699.414062	-99.325699
8720.947266	-103.232628
8742.480469	-103.442352
8764.013672	-103.888657
8785.546875	-99.896477
8807.080078	-99.774055
8828.613281	-100.389297
8850.146484	-100.119507
8871.679688	-99.664864
8893.212891	-100.513481
8914.746094	-104.155647
8936.279297	-103.345985
8957.812500	-99.804375
8979.345703	-102.986351
9000.878906	-104.397148
9022.412109	-101.225304
9043.945312	-100.858635
9065.478516	-104.978996
9087.011719	-106.378860
9108.544922	-103.153229
9130.078125	-102.078529
9151.611328	-100.627373
9173.144531	-100.972534
9194.677734	-104.368286
9216.210938	-104.242531
9237.744141	-103.144508
9259.277344	-105.435265
9280.810547	-105.357910
9302.343750	-103.599571
9323.876953	-103.608948
9345.410156	-103.265488
9366.943359	-104.129211
9388.476562	-109.093956
9410.009766	-105.319519
9431.542969	-103.784775
9453.076172	-106.564659
9474.609375	-108.324829
9496.142578	-108.399399
9517.675781	-106.121979
9539.208984	-107.265160
9560.742188	-109.748871
9582.275391	-109.049835
9603.808594	-106.585220
9625.341797	-108.098572
9646.875000	-112.244522
9668.408203	-110.481064
9689.941406	-107.970802
9711.474609	-107.417397
9733.007812	-108.471474
9754.541016	-109.657227
9776.074219	-108.716751
9797.607422	-109.045799
9819.140625	-112.309349
9840.673828	-112.442833
9862.207031	-111.910789
9883.740234	-112.357483
9905.273438	-111.623741
9926.806641	-113.331261
9948.339844	-114.506325
9969.873047	-110.844650
9991.406250	-110.327637
10012.939453	-110.212379
10034.472656	-111.022453
10056.005859	-108.924225
10077.539062	-109.778023
10099.072266	-111.545166
10120.605469	-113.573830
10142.138672	-112.275681
10163.671875	-114.562805
10185.205078	-109.422081
10206.738281	-109.486084
10228.271484	-114.504219
10249.804688	-111.945404
10271.337891	-110.831718
10292.871094	-110.100136
10314.404297	-109.409576
10335.937500	-107.922531
10357.470703	-109.265991
10379.003906	-113.721451
10400.537109	-113.689529
10422.070312	-115.016724
10443.603516	-113.693069
10465.136719	-113.485138
10486.669922	-116.142609
10508.203125	-116.379684
10529.736328	-116.931656
10551.269531	-112.438110
10572.802734	-113.433067
10594.335938	-115.483002
10615.869141	-117.446144
10637.402344	-116.314003
10658.935547	-116.097458
10680.468750	-116.257011
10702.001953	-116.307892
10723.535156	-118.905998
10745.068359	-121.183006
10766.601562	-121.282974
10788.134766	-118.989182
10809.667969	-119.502670
10831.201172	-121.335167
10852.734375	-121.273849
10874.267578	-122.556808
10895.800781	-121.500671
10917.333984	-125.559822
10938.867188	-124.931602
10960.400391	-122.347412
10981.933594	-123.488152
11003.466797	-123.242462
