Time Amplitude
0.00000	-0.04435
0.00005	-0.07299
0.00009	-0.03289
0.00014	-0.00465
0.00018	-0.02324
0.00023	-0.03246
0.00027	-0.00959
0.00032	0.01481
0.00036	-0.00346
0.00041	-0.03470
0.00045	-0.01955
0.00050	0.00680
0.00054	-0.01160
0.00059	-0.02535
0.00063	0.01243
0.00068	0.03929
0.00073	0.00230
0.00077	-0.01495
0.00082	0.02140
0.00086	0.02122
0.00091	-0.00921
0.00095	0.00423
0.00100	0.04459
0.00104	0.04734
0.00109	0.00991
0.00113	-0.00508
0.00118	0.02765
0.00122	0.04819
0.00127	0.03171
0.00132	0.02116
0.00136	0.03081
0.00141	0.03079
0.00145	0.01082
0.00150	0.02899
0.00154	0.06266
0.00159	0.02113
0.00163	-0.04315
0.00168	-0.02217
0.00172	0.03441
0.00177	0.06007
0.00181	0.05417
0.00186	0.02541
0.00190	-0.00470
0.00195	-0.00445
0.00200	0.03118
0.00204	0.04963
0.00209	0.03017
0.00213	0.00224
0.00218	-0.01350
0.00222	-0.00602
0.00227	0.02146
0.00231	0.02407
0.00236	-0.01406
0.00240	-0.03716
0.00245	-0.01272
0.00249	0.01886
0.00254	0.01797
0.00259	-0.00605
0.00263	-0.02877
0.00268	-0.03568
0.00272	-0.03097
0.00277	-0.01451
0.00281	0.00683
0.00286	0.00501
0.00290	-0.02029
0.00295	-0.02647
0.00299	-0.00497
0.00304	0.01034
0.00308	0.00237
0.00313	-0.00142
0.00317	0.00267
0.00322	0.00289
0.00327	0.01513
0.00331	0.02190
0.00336	0.01094
0.00340	0.01748
0.00345	0.01991
0.00349	0.00488
0.00354	0.01581
0.00358	0.04495
0.00363	0.04648
0.00367	0.01307
0.00372	0.00073
0.00376	0.01232
0.00381	0.02579
0.00385	0.04860
0.00390	0.05777
0.00395	0.03180
0.00399	0.01969
0.00404	0.02410
0.00408	0.03169
0.00413	0.05447
0.00417	0.04906
0.00422	0.01441
0.00426	0.00399
0.00431	0.02862
0.00435	0.04188
0.00440	0.03161
0.00444	0.02036
0.00449	0.00986
0.00454	-0.01077
0.00458	-0.01098
0.00463	0.01741
0.00467	0.00969
0.00472	-0.01540
0.00476	0.01079
0.00481	0.03932
0.00485	-0.03045
0.00490	-0.07781
0.00494	-0.02373
0.00499	0.00232
0.00503	-0.03541
0.00508	-0.03992
0.00512	-0.02461
0.00517	-0.05674
0.00522	-0.08423
0.00526	-0.05429
0.00531	-0.01648
0.00535	-0.04969
0.00540	-0.09974
0.00544	-0.07216
0.00549	-0.01174
0.00553	-0.01991
0.00558	-0.07029
0.00562	-0.07383
0.00567	-0.04506
0.00571	-0.04614
0.00576	-0.05523
0.00580	-0.02908
0.00585	-0.01059
0.00590	-0.03806
0.00594	-0.07390
0.00599	-0.04886
0.00603	0.00830
0.00608	0.00143
0.00612	-0.04841
0.00617	-0.03147
0.00621	0.01724
0.00626	0.00290
0.00630	-0.03345
0.00635	-0.01371
0.00639	0.01595
0.00644	-0.00821
0.00649	-0.02607
0.00653	0.00677
0.00658	0.03033
0.00662	0.00379
0.00667	-0.02722
0.00671	-0.00613
0.00676	0.02840
0.00680	0.01183
0.00685	-0.00727
0.00689	0.02731
0.00694	0.05163
0.00698	0.01195
0.00703	-0.01120
0.00707	0.02674
0.00712	0.04617
0.00717	0.01783
0.00721	0.00839
0.00726	0.02960
0.00730	0.03835
0.00735	0.02021
0.00739	0.02650
0.00744	0.02800
0.00748	-0.06349
0.00753	-0.01889
0.00757	0.19203
0.00762	0.12015
0.00766	-0.11884
0.00771	-0.03553
0.00776	0.04270
0.00780	-0.05095
0.00785	0.08147
0.00789	0.18693
0.00794	-0.06717
0.00798	-0.17194
0.00803	0.06652
0.00807	0.12850
0.00812	0.00403
0.00816	-0.02469
0.00821	-0.03385
0.00825	-0.03517
0.00830	0.05458
0.00834	0.07312
0.00839	-0.00988
0.00844	-0.07562
0.00848	-0.10459
0.00853	-0.04572
0.00857	0.06206
0.00862	0.06800
0.00866	-0.03157
0.00871	-0.09315
0.00875	-0.06644
0.00880	0.00699
0.00884	0.04525
0.00889	0.01161
0.00893	-0.02474
0.00898	-0.01395
0.00902	-0.00096
0.00907	0.00948
0.00912	0.03372
0.00916	0.02243
0.00921	-0.03892
0.00925	-0.05028
0.00930	0.02163
0.00934	0.07077
0.00939	0.03948
0.00943	-0.00961
0.00948	-0.00730
0.00952	0.00399
0.00957	0.01250
0.00961	0.05243
0.00966	0.07895
0.00971	0.02393
0.00975	-0.01670
0.00980	0.00965
0.00984	0.03102
0.00989	0.04880
0.00993	0.05285
0.00998	0.01895
0.01002	0.01399
0.01007	0.05255
0.01011	0.05530
0.01016	0.03933
0.01020	0.01837
0.01025	-0.00733
0.01029	0.00703
0.01034	0.03698
0.01039	0.03609
0.01043	0.03079
0.01048	0.01600
0.01052	-0.02385
0.01057	-0.01950
0.01061	-0.00370
0.01066	-0.02474
0.01070	-0.00161
0.01075	0.04047
0.01079	-0.02509
0.01084	-0.08559
0.01088	-0.04074
0.01093	-0.01310
0.01098	-0.03205
0.01102	-0.02015
0.01107	-0.01547
0.01111	-0.05908
0.01116	-0.07637
0.01120	-0.03725
0.01125	-0.00822
0.01129	-0.03731
0.01134	-0.09541
0.01138	-0.10540
0.01143	-0.04188
0.01147	-0.00631
0.01152	-0.04656
0.01156	-0.07312
0.01161	-0.08007
0.01166	-0.09263
0.01170	-0.06139
0.01175	-0.00895
0.01179	0.00843
0.01184	-0.01516
0.01188	-0.07578
0.01193	-0.07701
0.01197	-0.00619
0.01202	-0.01219
0.01206	-0.05192
0.01211	-0.01933
0.01215	-0.00354
0.01220	-0.02065
0.01224	-0.01386
0.01229	-0.00787
0.01234	0.00221
0.01238	0.00975
0.01243	-0.02708
0.01247	-0.03167
0.01252	0.03393
0.01256	0.03944
0.01261	-0.01543
0.01265	-0.00340
0.01270	0.01893
0.01274	-0.01594
0.01279	-0.01383
0.01283	0.03698
0.01288	0.05533
0.01293	0.02541
0.01297	-0.01519
0.01302	-0.00407
0.01306	0.05195
0.01311	0.05023
0.01315	0.01615
0.01320	0.02594
0.01324	0.04041
0.01329	0.01463
0.01333	-0.00420
0.01338	0.04300
0.01342	0.08558
0.01347	0.02882
0.01351	-0.03670
0.01356	0.00564
0.01361	0.04975
0.01365	0.02708
0.01370	0.02875
0.01374	0.04661
0.01379	0.00335
0.01383	-0.01608
0.01388	0.03279
0.01392	0.04596
0.01397	0.01949
0.01401	-0.00001
0.01406	-0.02433
0.01410	-0.02054
0.01415	0.01211
0.01420	0.00621
0.01424	-0.02776
0.01429	-0.04213
0.01433	-0.02051
0.01438	0.00135
0.01442	-0.00277
0.01447	-0.00643
0.01451	-0.01489
0.01456	-0.04076
0.01460	-0.04887
0.01465	-0.01300
0.01469	0.01719
0.01474	-0.00686
0.01478	-0.03851
0.01483	-0.02280
0.01488	-0.00608
0.01492	-0.01473
0.01497	-0.00918
0.01501	-0.00117
0.01506	-0.00382
0.01510	-0.00056
0.01515	0.00548
0.01519	0.01402
0.01524	0.02460
0.01528	0.01449
0.01533	-0.00774
0.01537	0.00128
0.01542	0.01678
0.01546	0.00748
0.01551	0.00554
0.01556	0.01824
0.01560	0.02130
0.01565	0.01680
0.01569	0.00501
0.01574	0.01395
0.01578	0.05497
0.01583	0.05819
0.01587	0.02385
0.01592	0.03350
0.01596	0.04441
0.01601	0.02578
0.01605	0.03758
0.01610	0.05895
0.01615	0.04062
0.01619	0.01848
0.01624	0.01927
0.01628	0.02203
0.01633	0.02618
0.01637	0.02853
0.01642	0.02753
0.01646	0.01304
0.01651	-0.00264
0.01655	0.00164
0.01660	0.01507
0.01664	-0.00922
0.01669	-0.02497
0.01673	0.02215
0.01678	0.03360
0.01683	-0.04406
0.01687	-0.07554
0.01692	-0.02324
0.01696	-0.00264
0.01701	-0.02976
0.01705	-0.03562
0.01710	-0.03542
0.01714	-0.07301
0.01719	-0.07872
0.01723	-0.03001
0.01728	-0.00567
0.01732	-0.05374
0.01737	-0.10633
0.01741	-0.07568
0.01746	-0.01054
0.01751	-0.01748
0.01755	-0.06427
0.01760	-0.06692
0.01764	-0.05410
0.01769	-0.05398
0.01773	-0.04709
0.01778	-0.01657
0.01782	-0.00226
0.01787	-0.04172
0.01791	-0.08049
0.01796	-0.03943
0.01800	0.01444
0.01805	-0.01232
0.01810	-0.05458
0.01814	-0.02752
0.01819	0.01437
0.01823	-0.00173
0.01828	-0.03303
0.01832	-0.01698
0.01837	0.01170
0.01841	-0.01298
0.01846	-0.03762
0.01850	0.01627
0.01855	0.05722
0.01859	0.00174
0.01864	-0.03765
0.01868	0.00450
0.01873	0.03093
0.01878	0.00629
0.01882	0.00282
0.01887	0.03802
0.01891	0.04746
0.01896	0.00997
0.01900	-0.00422
0.01905	0.03322
0.01909	0.04744
0.01914	0.01205
0.01918	0.00478
0.01923	0.03995
0.01927	0.05906
0.01932	0.04236
0.01937	0.03363
0.01941	0.03069
0.01946	-0.02237
0.01950	-0.01705
0.01955	0.11646
0.01959	0.13237
0.01964	-0.02108
0.01968	-0.05332
0.01973	0.01121
0.01977	0.00614
0.01982	0.06575
0.01986	0.13400
0.01991	-0.00169
0.01995	-0.11835
0.02000	0.00868
0.02005	0.10851
0.02009	0.03850
0.02014	-0.01911
0.02018	-0.02987
0.02023	-0.03484
0.02027	0.01363
0.02032	0.06879
0.02036	0.03289
0.02041	-0.05256
0.02045	-0.08832
0.02050	-0.04296
0.02054	0.04294
0.02059	0.06958
0.02063	-0.00596
0.02068	-0.07503
0.02073	-0.05635
0.02077	-0.00464
0.02082	0.02019
0.02086	0.01407
0.02091	-0.01202
0.02095	-0.02299
0.02100	-0.01836
0.02104	-0.00620
0.02109	0.02692
0.02113	0.02152
0.02118	-0.03122
0.02122	-0.02807
0.02127	0.03111
0.02132	0.04784
0.02136	0.02400
0.02141	0.01664
0.02145	0.02463
0.02150	0.00354
0.02154	-0.01330
0.02159	0.03271
0.02163	0.06933
0.02168	0.03379
0.02172	0.01283
0.02177	0.03019
0.02181	0.02084
0.02186	0.02483
0.02190	0.05231
0.02195	0.04715
0.02200	0.03461
0.02204	0.04152
0.02209	0.03539
0.02213	0.04225
0.02218	0.05941
0.02222	0.02719
0.02227	-0.00595
0.02231	0.01597
0.02236	0.04232
0.02240	0.04974
0.02245	0.05539
0.02249	0.02452
0.02254	-0.01689
0.02259	-0.01374
0.02263	0.00969
0.02268	0.00259
0.02272	0.00237
0.02277	0.03256
0.02281	0.03950
0.02286	-0.01958
0.02290	-0.07157
0.02295	-0.03883
0.02299	-0.00293
0.02304	-0.03212
0.02308	-0.04397
0.02313	-0.01430
0.02317	-0.03907
0.02322	-0.08038
0.02327	-0.04390
0.02331	0.00147
0.02336	-0.04432
0.02340	-0.10679
0.02345	-0.08105
0.02349	-0.00728
0.02354	0.00273
0.02358	-0.06374
0.02363	-0.09239
0.02367	-0.05774
0.02372	-0.04656
0.02376	-0.05224
0.02381	-0.00773
0.02385	0.02457
0.02390	-0.02885
0.02395	-0.08500
0.02399	-0.04545
0.02404	0.01894
0.02408	0.00560
0.02413	-0.05260
0.02417	-0.04268
0.02422	0.01705
0.02426	0.00891
0.02431	-0.03121
0.02435	-0.00562
0.02440	0.01580
0.02444	-0.03963
0.02449	-0.05054
0.02454	0.02624
0.02458	0.06178
0.02463	0.01629
0.02467	-0.02711
0.02472	-0.01532
0.02476	0.01639
0.02481	0.01388
0.02485	0.00767
0.02490	0.04526
0.02494	0.05807
0.02499	0.01162
0.02503	-0.00527
0.02508	0.03626
0.02512	0.05782
0.02517	0.03161
0.02522	0.00970
0.02526	0.01840
0.02531	0.04693
0.02535	0.05635
0.02540	0.03539
0.02544	0.02965
0.02549	0.03782
0.02553	0.03699
0.02558	0.04417
0.02562	0.06193
0.02567	0.04413
0.02571	0.00740
0.02576	-0.01056
0.02580	0.01073
0.02585	0.04415
0.02590	0.03481
0.02594	0.00104
0.02599	-0.00070
0.02603	0.02920
0.02608	0.03319
0.02612	0.00746
0.02617	-0.00478
0.02621	-0.00060
0.02626	-0.00360
0.02630	-0.01156
0.02635	-0.01099
0.02639	0.00205
0.02644	-0.01552
0.02649	-0.04174
0.02653	-0.01466
0.02658	0.01211
0.02662	-0.00156
0.02667	-0.01813
0.02671	-0.01893
0.02676	-0.01268
0.02680	-0.02152
0.02685	-0.03988
0.02689	-0.03009
0.02694	-0.00762
0.02698	-0.00650
0.02703	-0.01339
0.02707	-0.00849
0.02712	-0.00346
0.02717	-0.00245
0.02721	-0.00833
0.02726	-0.00134
0.02730	0.01628
0.02735	0.00760
0.02739	-0.01226
0.02744	-0.00313
0.02748	0.03136
0.02753	0.02694
0.02757	-0.00121
0.02762	0.00870
0.02766	0.03714
0.02771	0.02813
0.02776	0.01632
0.02780	0.04080
0.02785	0.03996
0.02789	0.00561
0.02794	0.02199
0.02798	0.06383
0.02803	0.04828
0.02807	0.03020
0.02812	0.04343
0.02816	0.03048
0.02821	0.02611
0.02825	0.04263
0.02830	0.02387
0.02834	0.01341
0.02839	0.02660
0.02844	0.02138
0.02848	0.02006
0.02853	0.03837
0.02857	0.03664
0.02862	0.00798
0.02866	-0.00640
0.02871	0.01272
0.02875	0.02200
0.02880	-0.00567
0.02884	-0.00579
0.02889	0.03746
0.02893	0.03004
0.02898	-0.05432
0.02902	-0.08113
0.02907	-0.02702
0.02912	-0.01146
0.02916	-0.03903
0.02921	-0.02705
0.02925	-0.02444
0.02930	-0.07417
0.02934	-0.08018
0.02939	-0.02376
0.02943	-0.00743
0.02948	-0.06089
0.02952	-0.09533
0.02957	-0.06225
0.02961	-0.01548
0.02966	-0.02491
0.02971	-0.06861
0.02975	-0.07805
0.02980	-0.06335
0.02984	-0.05702
0.02989	-0.03640
0.02993	-0.00079
0.02998	0.00126
0.03002	-0.05009
0.03007	-0.07884
0.03011	-0.02840
0.03016	0.01054
0.03020	-0.01970
0.03025	-0.04413
0.03029	-0.01319
0.03034	0.00740
0.03039	-0.02269
0.03043	-0.03264
0.03048	-0.00593
0.03052	-0.00680
0.03057	-0.02726
0.03061	-0.02240
0.03066	0.01601
0.03070	0.03062
0.03075	0.00227
0.03079	-0.00654
0.03084	0.01532
0.03088	0.01935
0.03093	0.00379
0.03098	0.01708
0.03102	0.05002
0.03107	0.04104
0.03111	-0.00196
0.03116	-0.00256
0.03120	0.02789
0.03125	0.03561
0.03129	0.03027
0.03134	0.02831
0.03138	0.03536
0.03143	0.04007
0.03147	0.02958
0.03152	0.03366
0.03156	0.04176
0.03161	0.03011
0.03166	-0.02084
0.03170	-0.05765
0.03175	0.05911
0.03179	0.19935
0.03184	0.07804
0.03188	-0.10279
0.03193	-0.05669
0.03197	0.00464
0.03202	0.00841
0.03206	0.12464
0.03211	0.13767
0.03215	-0.08125
0.03220	-0.14332
0.03224	0.02900
0.03229	0.08990
0.03234	0.01489
0.03238	-0.04931
0.03243	-0.09062
0.03247	-0.03742
0.03252	0.07323
0.03256	0.07288
0.03261	-0.01581
0.03265	-0.08943
0.03270	-0.10365
0.03274	-0.03396
0.03279	0.06479
0.03283	0.07301
0.03288	-0.02344
0.03293	-0.11266
0.03297	-0.09366
0.03302	0.00325
0.03306	0.04797
0.03311	0.00804
0.03315	-0.02431
0.03320	-0.02190
0.03324	-0.01219
0.03329	0.00117
0.03333	0.01269
0.03338	0.01054
0.03342	-0.01345
0.03347	-0.02016
0.03351	0.02298
0.03356	0.07147
0.03361	0.05736
0.03365	0.00386
0.03370	-0.01427
0.03374	-0.00235
0.03379	0.00757
0.03383	0.03582
0.03388	0.06651
0.03392	0.05269
0.03397	0.01183
0.03401	-0.01468
0.03406	0.00224
0.03410	0.05572
0.03415	0.07414
0.03420	0.04378
0.03424	0.02579
0.03429	0.02800
0.03433	0.03423
0.03438	0.04049
0.03442	0.03751
0.03447	0.02143
0.03451	0.00187
0.03456	0.00842
0.03460	0.03868
0.03465	0.05537
0.03469	0.03367
0.03474	-0.00998
0.03478	-0.01994
0.03483	-0.00261
0.03488	-0.00860
0.03492	0.00795
0.03497	0.05977
0.03501	0.03275
0.03506	-0.07211
0.03510	-0.09609
0.03515	-0.03551
0.03519	-0.00442
0.03524	-0.01096
0.03528	-0.02552
0.03533	-0.04693
0.03537	-0.07419
0.03542	-0.06732
0.03546	-0.02208
0.03551	-0.01590
0.03556	-0.07486
0.03560	-0.11152
0.03565	-0.06498
0.03569	0.00450
0.03574	0.00314
0.03578	-0.04704
0.03583	-0.07752
0.03587	-0.09039
0.03592	-0.08810
0.03596	-0.05001
0.03601	0.00223
0.03605	0.00481
0.03610	-0.05250
0.03615	-0.08133
0.03619	-0.03605
0.03624	0.00040
0.03628	-0.01444
0.03633	-0.03242
0.03637	-0.02472
0.03642	-0.00787
0.03646	-0.00968
0.03651	-0.01491
0.03655	0.01431
0.03660	0.02126
0.03664	-0.03414
0.03669	-0.05025
0.03673	0.01751
0.03678	0.05264
0.03683	0.01373
0.03687	-0.00350
0.03692	0.00634
0.03696	-0.01313
0.03701	-0.01889
0.03705	0.02864
0.03710	0.06260
0.03714	0.03990
0.03719	-0.00573
0.03723	-0.01515
0.03728	0.02372
0.03732	0.04021
0.03737	0.01741
0.03741	0.01570
0.03746	0.02830
0.03751	0.02992
0.03755	0.04812
0.03760	0.04313
0.03764	0.01216
0.03769	0.03438
0.03773	0.05744
0.03778	0.00748
0.03782	0.00418
0.03787	0.05653
0.03791	0.01428
0.03796	-0.03502
0.03800	0.01996
0.03805	0.04595
0.03810	-0.01923
0.03814	-0.00968
0.03819	0.05847
0.03823	0.03764
0.03828	-0.01760
0.03832	-0.02209
0.03837	-0.01266
0.03841	-0.00278
0.03846	0.00286
0.03850	-0.00719
0.03855	-0.01226
0.03859	-0.02484
0.03864	-0.03521
0.03868	-0.02563
0.03873	-0.00711
0.03878	-0.01329
0.03882	-0.03991
0.03887	-0.04016
0.03891	-0.00651
0.03896	0.00964
0.03900	-0.01875
0.03905	-0.04761
0.03909	-0.03126
0.03914	-0.01225
0.03918	-0.02190
0.03923	-0.01613
0.03927	-0.00058
0.03932	-0.00850
0.03937	-0.01700
0.03941	-0.00747
0.03946	0.01606
0.03950	0.02422
0.03955	-0.00079
0.03959	-0.00663
0.03964	0.01020
0.03968	0.00562
0.03973	-0.00315
0.03977	0.01498
0.03982	0.02756
0.03986	0.02099
0.03991	0.02393
0.03995	0.03265
0.04000	0.04707
0.04005	0.04519
0.04009	0.01531
0.04014	0.00881
0.04018	0.03631
0.04023	0.04471
0.04027	0.03059
0.04032	0.03797
0.04036	0.04286
0.04041	0.03178
0.04045	0.03040
0.04050	0.03916
0.04054	0.04247
0.04059	0.02144
0.04063	-0.00286
0.04068	0.00383
0.04073	0.02803
0.04077	0.02758
0.04082	-0.00211
0.04086	-0.01109
0.04091	0.00803
0.04095	0.00759
0.04100	-0.02067
0.04104	0.00576
0.04109	0.06458
0.04113	0.02450
0.04118	-0.08456
0.04122	-0.08708
0.04127	-0.01118
0.04132	-0.00414
0.04136	-0.03421
0.04141	-0.02509
0.04145	-0.03144
0.04150	-0.08148
0.04154	-0.08318
0.04159	-0.01873
0.04163	-0.00430
0.04168	-0.08299
0.04172	-0.12386
0.04177	-0.05619
0.04181	0.00314
0.04186	-0.03200
0.04190	-0.07030
0.04195	-0.05951
0.04200	-0.06599
0.04204	-0.07801
0.04209	-0.04798
0.04213	-0.00374
0.04218	-0.00977
0.04222	-0.05983
0.04227	-0.08225
0.04231	-0.03491
0.04236	0.00959
0.04240	-0.01881
0.04245	-0.03959
0.04249	0.00371
0.04254	0.01120
0.04259	-0.03942
0.04263	-0.03758
0.04268	0.00883
0.04272	0.00073
0.04277	-0.04292
0.04281	-0.03232
0.04286	0.01862
0.04290	0.02910
0.04295	0.00157
0.04299	-0.00021
0.04304	0.01714
0.04308	-0.00061
0.04313	-0.02219
0.04317	0.01929
0.04322	0.06094
0.04327	0.03168
0.04331	-0.01022
0.04336	-0.00273
0.04340	0.03136
0.04345	0.04145
0.04349	0.02244
0.04354	0.01174
0.04358	0.02660
0.04363	0.03129
0.04367	0.00982
0.04372	0.02405
0.04376	0.07302
0.04381	0.05119
0.04385	-0.02059
0.04390	0.00863
0.04395	0.07256
0.04399	0.04338
0.04404	0.01903
0.04408	0.03946
0.04413	0.01885
0.04417	-0.01041
0.04422	0.03159
0.04426	0.06050
0.04431	0.01676
0.04435	-0.01442
0.04440	-0.01770
0.04444	-0.02095
0.04449	0.00693
0.04454	0.03021
0.04458	-0.00268
0.04463	-0.02758
0.04467	-0.01606
0.04472	-0.00710
0.04476	-0.00129
0.04481	0.00392
0.04485	-0.01660
0.04490	-0.03732
0.04494	-0.02950
0.04499	-0.00541
0.04503	0.00779
0.04508	-0.00448
0.04512	-0.02880
0.04517	-0.03359
0.04522	-0.01032
0.04526	0.00608
0.04531	0.00316
0.04535	-0.01047
0.04540	-0.02404
0.04544	-0.02342
0.04549	-0.00809
0.04553	0.00478
0.04558	0.01076
0.04562	0.00685
0.04567	-0.01044
0.04571	-0.00946
0.04576	0.01247
0.04580	0.02584
0.04585	0.03282
0.04590	0.02681
0.04594	0.01788
0.04599	0.02655
0.04603	0.03092
0.04608	0.02955
0.04612	0.04673
0.04617	0.03935
0.04621	0.01532
0.04626	0.02837
0.04630	0.05304
0.04635	0.05449
0.04639	0.04197
0.04644	0.03537
0.04649	0.03949
0.04653	0.03737
0.04658	0.02818
0.04662	0.03048
0.04667	0.03710
0.04671	0.02240
0.04676	0.00348
0.04680	0.02384
0.04685	0.04978
0.04689	0.02680
0.04694	0.00244
0.04698	0.01032
0.04703	0.01028
0.04707	-0.02318
0.04712	-0.02861
0.04717	0.03537
0.04721	0.06260
0.04726	-0.01937
0.04730	-0.09444
0.04735	-0.06233
0.04739	-0.01095
0.04744	-0.02287
0.04748	-0.03157
0.04753	-0.01201
0.04757	-0.04858
0.04762	-0.09747
0.04766	-0.05516
0.04771	0.01073
0.04776	-0.01650
0.04780	-0.10343
0.04785	-0.11462
0.04789	-0.03280
0.04794	0.00046
0.04798	-0.03880
0.04803	-0.05596
0.04807	-0.05529
0.04812	-0.06726
0.04816	-0.06065
0.04821	-0.01574
0.04825	0.01815
0.04830	-0.01934
0.04834	-0.08763
0.04839	-0.08170
0.04844	-0.00634
0.04848	0.00979
0.04853	-0.03789
0.04857	-0.02983
