Time Amplitude
0.00000	0.81904
0.00005	0.82693
0.00009	0.72721
0.00014	0.49175
0.00018	0.15992
0.00023	-0.22130
0.00027	-0.54981
0.00032	-0.75091
0.00036	-0.80693
0.00041	-0.73453
0.00045	-0.57724
0.00050	-0.39609
0.00054	-0.21298
0.00059	-0.02416
0.00063	0.18780
0.00068	0.38372
0.00073	0.49694
0.00077	0.48589
0.00082	0.36728
0.00086	0.21093
0.00091	0.07186
0.00095	-0.01382
0.00100	-0.05688
0.00104	-0.06600
0.00109	-0.04626
0.00113	-0.00782
0.00118	0.04565
0.00122	0.09600
0.00127	0.11048
0.00132	0.06501
0.00136	-0.01640
0.00141	-0.10367
0.00145	-0.17727
0.00150	-0.23470
0.00154	-0.27930
0.00159	-0.29542
0.00163	-0.27691
0.00168	-0.21896
0.00172	-0.10201
0.00177	0.06678
0.00181	0.23685
0.00186	0.35513
0.00190	0.38651
0.00195	0.31482
0.00200	0.15913
0.00204	-0.01653
0.00209	-0.14540
0.00213	-0.21704
0.00218	-0.27321
0.00222	-0.34236
0.00227	-0.38096
0.00231	-0.31936
0.00236	-0.15255
0.00240	0.07372
0.00245	0.29607
0.00249	0.43732
0.00254	0.46728
0.00259	0.41282
0.00263	0.30941
0.00268	0.18049
0.00272	0.03425
0.00277	-0.11968
0.00281	-0.24165
0.00286	-0.30285
0.00290	-0.30684
0.00295	-0.25490
0.00299	-0.17701
0.00304	-0.09622
0.00308	0.00315
0.00313	0.12462
0.00317	0.23813
0.00322	0.30206
0.00327	0.28172
0.00331	0.18451
0.00336	0.05345
0.00340	-0.06418
0.00345	-0.12208
0.00349	-0.11202
0.00354	-0.05950
0.00358	-0.00348
0.00363	0.04441
0.00367	0.09445
0.00372	0.13648
0.00376	0.16245
0.00381	0.16025
0.00385	0.10589
0.00390	0.01118
0.00395	-0.08167
0.00399	-0.15067
0.00404	-0.18510
0.00408	-0.16735
0.00413	-0.10175
0.00417	-0.01125
0.00422	0.07256
0.00426	0.13820
0.00431	0.20497
0.00435	0.25834
0.00440	0.26363
0.00444	0.20840
0.00449	0.11832
0.00454	0.01221
0.00458	-0.09467
0.00463	-0.15981
0.00467	-0.15057
0.00472	-0.07755
0.00476	0.00150
0.00481	0.06236
0.00485	0.08539
0.00490	0.06558
0.00494	0.03658
0.00499	0.01232
0.00503	-0.02881
0.00508	-0.12465
0.00512	-0.28565
0.00517	-0.46398
0.00522	-0.58267
0.00526	-0.60494
0.00531	-0.52030
0.00535	-0.38379
0.00540	-0.25639
0.00544	-0.11497
0.00549	0.10354
0.00553	0.48004
0.00558	0.78906
0.00562	0.83358
0.00567	0.81668
0.00571	0.63942
0.00576	0.35002
0.00580	0.14299
0.00585	-0.04745
0.00590	-0.25242
0.00594	-0.47097
0.00599	-0.65423
0.00603	-0.73241
0.00608	-0.68496
0.00612	-0.53407
0.00617	-0.33643
0.00621	-0.14115
0.00626	0.03124
0.00630	0.18335
0.00635	0.31753
0.00639	0.40172
0.00644	0.39577
0.00649	0.29600
0.00653	0.17158
0.00658	0.09614
0.00662	0.09178
0.00667	0.11877
0.00671	0.11915
0.00676	0.07995
0.00680	0.02117
0.00685	-0.02095
0.00689	-0.03734
0.00694	-0.03665
0.00698	-0.05419
0.00703	-0.12324
0.00707	-0.21494
0.00712	-0.29099
0.00717	-0.32752
0.00721	-0.31185
0.00726	-0.24841
0.00730	-0.14853
0.00735	-0.02833
0.00739	0.09928
0.00744	0.22701
0.00748	0.32924
0.00753	0.38301
0.00757	0.38669
0.00762	0.32350
0.00766	0.18966
0.00771	0.00567
0.00776	-0.19200
0.00780	-0.34509
0.00785	-0.43585
0.00789	-0.49464
0.00794	-0.51274
0.00798	-0.44659
0.00803	-0.27406
0.00807	-0.01826
0.00812	0.24567
0.00816	0.44186
0.00821	0.52999
0.00825	0.52152
0.00830	0.45574
0.00834	0.35926
0.00839	0.23569
0.00844	0.08643
0.00848	-0.06960
0.00853	-0.21628
0.00857	-0.31964
0.00862	-0.35120
0.00866	-0.32032
0.00871	-0.24451
0.00875	-0.14857
0.00880	-0.04571
0.00884	0.06060
0.00889	0.14725
0.00893	0.18256
0.00898	0.16242
0.00902	0.11330
0.00907	0.06845
0.00912	0.04908
0.00916	0.05882
0.00921	0.08872
0.00925	0.11963
0.00930	0.13123
0.00934	0.11868
0.00939	0.09792
0.00943	0.07409
0.00948	0.03716
0.00952	-0.01497
0.00957	-0.08539
0.00961	-0.16571
0.00966	-0.22997
0.00971	-0.25910
0.00975	-0.22947
0.00980	-0.11905
0.00984	0.04187
0.00989	0.19237
0.00993	0.27316
0.00998	0.29039
0.01002	0.28090
0.01007	0.24270
0.01011	0.18608
0.01016	0.11913
0.01020	0.04264
0.01025	-0.04105
0.01029	-0.11884
0.01034	-0.17455
0.01039	-0.18785
0.01043	-0.15602
0.01048	-0.11382
0.01052	-0.07329
0.01057	-0.01705
0.01061	0.06339
0.01066	0.13257
0.01070	0.14012
0.01075	0.06503
0.01079	-0.09513
0.01084	-0.30693
0.01088	-0.50342
0.01093	-0.61748
0.01098	-0.58999
0.01102	-0.43977
0.01107	-0.27459
0.01111	-0.17806
0.01116	-0.10431
0.01120	0.06678
0.01125	0.42153
0.01129	0.75271
0.01134	0.82795
0.01138	0.79712
0.01143	0.61264
0.01147	0.31524
0.01152	0.07843
0.01156	-0.13733
0.01161	-0.34786
0.01166	-0.54216
0.01170	-0.67570
0.01175	-0.69877
0.01179	-0.60561
0.01184	-0.44098
0.01188	-0.25824
0.01193	-0.09598
0.01197	0.04579
0.01202	0.19876
0.01206	0.35850
0.01211	0.46310
0.01215	0.44716
0.01220	0.31801
0.01224	0.15151
0.01229	0.03161
0.01234	-0.00242
0.01238	0.01348
0.01243	0.02871
0.01247	0.01716
0.01252	-0.01722
0.01256	-0.04482
0.01261	-0.04773
0.01265	-0.04217
0.01270	-0.05584
0.01274	-0.10165
0.01279	-0.16111
0.01283	-0.20506
0.01288	-0.22457
0.01293	-0.22332
0.01297	-0.19704
0.01302	-0.13922
0.01306	-0.05222
0.01311	0.06409
0.01315	0.20078
0.01320	0.32474
0.01324	0.39287
0.01329	0.38198
0.01333	0.30171
0.01338	0.17472
0.01342	0.01327
0.01347	-0.16895
0.01351	-0.32888
0.01356	-0.43101
0.01361	-0.48815
0.01365	-0.52358
0.01370	-0.50825
0.01374	-0.38554
0.01379	-0.14922
0.01383	0.14058
0.01388	0.39704
0.01392	0.56499
0.01397	0.61737
0.01401	0.56746
0.01406	0.45865
0.01410	0.31551
0.01415	0.15021
0.01420	-0.02165
0.01424	-0.17592
0.01429	-0.28696
0.01433	-0.34401
0.01438	-0.34688
0.01442	-0.30565
0.01447	-0.23408
0.01451	-0.14198
0.01456	-0.04115
0.01460	0.05517
0.01465	0.12346
0.01469	0.15091
0.01474	0.14649
0.01478	0.12501
0.01483	0.11185
0.01488	0.12230
0.01492	0.15099
0.01497	0.17800
0.01501	0.18629
0.01506	0.15724
0.01510	0.10369
0.01515	0.05081
0.01519	-0.00643
0.01524	-0.05370
0.01528	-0.10285
0.01533	-0.17498
0.01537	-0.24329
0.01542	-0.27203
0.01546	-0.24995
0.01551	-0.16191
0.01556	-0.00894
0.01560	0.15023
0.01565	0.25828
0.01569	0.30240
0.01574	0.31710
0.01578	0.30465
0.01583	0.25848
0.01587	0.18610
0.01592	0.07812
0.01596	-0.03635
0.01601	-0.11584
0.01605	-0.14760
0.01610	-0.15576
0.01615	-0.15423
0.01619	-0.12707
0.01624	-0.05650
0.01628	0.04110
0.01633	0.12108
0.01637	0.14356
0.01642	0.08437
0.01646	-0.00888
0.01651	-0.10266
0.01655	-0.22153
0.01660	-0.38650
0.01664	-0.56504
0.01669	-0.65757
0.01673	-0.58038
0.01678	-0.36393
0.01683	-0.15212
0.01687	-0.02943
0.01692	0.07033
0.01696	0.28347
0.01701	0.62852
0.01705	0.82195
0.01710	0.83085
0.01714	0.73054
0.01719	0.43090
0.01723	0.12901
0.01728	-0.08946
0.01732	-0.28538
0.01737	-0.46774
0.01741	-0.61349
0.01746	-0.67954
0.01751	-0.64133
0.01755	-0.50552
0.01760	-0.31132
0.01764	-0.11708
0.01769	0.03264
0.01773	0.14915
0.01778	0.27081
0.01782	0.39003
0.01787	0.43781
0.01791	0.37127
0.01796	0.22780
0.01800	0.09797
0.01805	0.03946
0.01810	0.04597
0.01814	0.06604
0.01819	0.05616
0.01823	0.02693
0.01828	-0.01276
0.01832	-0.04861
0.01837	-0.06559
0.01841	-0.07923
0.01846	-0.11315
0.01850	-0.16779
0.01855	-0.21680
0.01859	-0.23991
0.01864	-0.23586
0.01868	-0.20585
0.01873	-0.14933
0.01878	-0.06511
0.01882	0.04952
0.01887	0.17509
0.01891	0.28759
0.01896	0.36444
0.01900	0.38190
0.01905	0.33409
0.01909	0.24008
0.01914	0.12777
0.01918	-0.00737
0.01923	-0.17809
0.01927	-0.36390
0.01932	-0.51076
0.01937	-0.57277
0.01941	-0.53392
0.01946	-0.40775
0.01950	-0.20942
0.01955	0.00677
0.01959	0.17063
0.01964	0.28181
0.01968	0.35782
0.01973	0.40979
0.01977	0.43000
0.01982	0.40770
0.01986	0.33155
0.01991	0.21166
0.01995	0.08613
0.02000	-0.01519
0.02005	-0.09571
0.02009	-0.16985
0.02014	-0.22661
0.02018	-0.26114
0.02023	-0.25912
0.02027	-0.22589
0.02032	-0.17975
0.02036	-0.13462
0.02041	-0.09713
0.02045	-0.04922
0.02050	0.02513
0.02054	0.13124
0.02059	0.23827
0.02063	0.30606
0.02068	0.32513
0.02073	0.30063
0.02077	0.24495
0.02082	0.17055
0.02086	0.08652
0.02091	-0.00391
0.02095	-0.08286
0.02100	-0.14037
0.02104	-0.18255
0.02109	-0.20990
0.02113	-0.22492
0.02118	-0.21256
0.02122	-0.15326
0.02127	-0.05525
0.02132	0.05134
0.02136	0.14456
0.02141	0.20985
0.02145	0.24575
0.02150	0.26892
0.02154	0.25745
0.02159	0.19660
0.02163	0.11973
0.02168	0.05518
0.02172	-0.00304
0.02177	-0.05314
0.02181	-0.08497
0.02186	-0.10628
0.02190	-0.11578
0.02195	-0.10029
0.02200	-0.04974
0.02204	0.02614
0.02209	0.09411
0.02213	0.12900
0.02218	0.11355
0.02222	0.02742
0.02227	-0.10985
0.02231	-0.26886
0.02236	-0.42188
0.02240	-0.55098
0.02245	-0.61812
0.02249	-0.55978
0.02254	-0.37103
0.02259	-0.15435
0.02263	-0.02161
0.02268	0.06046
0.02272	0.20735
0.02277	0.49784
0.02281	0.76271
0.02286	0.83302
0.02290	0.77026
0.02295	0.52412
0.02299	0.21222
0.02304	-0.03132
0.02308	-0.24631
0.02313	-0.43094
0.02317	-0.56598
0.02322	-0.63180
0.02327	-0.61760
0.02331	-0.52395
0.02336	-0.36715
0.02340	-0.18941
0.02345	-0.03384
0.02349	0.09724
0.02354	0.22440
0.02358	0.35221
0.02363	0.43041
0.02367	0.40023
0.02372	0.27724
0.02376	0.14277
0.02381	0.06652
0.02385	0.05025
0.02390	0.05715
0.02395	0.05742
0.02399	0.04209
0.02404	0.01613
0.02408	-0.02273
0.02413	-0.06353
0.02417	-0.08908
0.02422	-0.11333
0.02426	-0.15145
0.02431	-0.19312
0.02435	-0.21978
0.02440	-0.22319
0.02444	-0.20430
0.02449	-0.16490
0.02454	-0.08687
0.02458	0.02581
0.02463	0.14833
0.02467	0.26432
0.02472	0.34845
0.02476	0.37978
0.02481	0.35702
0.02485	0.28329
0.02490	0.17567
0.02494	0.06849
0.02499	-0.03495
0.02503	-0.17661
0.02508	-0.39239
0.02512	-0.59799
0.02517	-0.66350
0.02522	-0.55827
0.02526	-0.33671
0.02531	-0.09061
0.02535	0.10486
0.02540	0.22132
0.02544	0.29338
0.02549	0.36772
0.02553	0.44091
0.02558	0.46986
0.02562	0.42850
0.02567	0.32235
0.02571	0.17853
0.02576	0.03618
0.02580	-0.07720
0.02585	-0.17440
0.02590	-0.26490
0.02594	-0.31267
0.02599	-0.28647
0.02603	-0.19603
0.02608	-0.10368
0.02612	-0.06051
0.02617	-0.05379
0.02621	-0.04961
0.02626	-0.01619
0.02630	0.06831
0.02635	0.17364
0.02639	0.24984
0.02644	0.27676
0.02649	0.25974
0.02653	0.21325
0.02658	0.17087
0.02662	0.14875
0.02667	0.11063
0.02671	0.04031
0.02676	-0.05032
0.02680	-0.13153
0.02685	-0.18846
0.02689	-0.22170
0.02694	-0.22079
0.02698	-0.18407
0.02703	-0.10570
0.02707	-0.00575
0.02712	0.07980
0.02717	0.14382
0.02721	0.19273
0.02726	0.22391
0.02730	0.23457
0.02735	0.22826
0.02739	0.18441
0.02744	0.11144
0.02748	0.03379
0.02753	-0.02602
0.02757	-0.06506
0.02762	-0.09133
0.02766	-0.10291
0.02771	-0.09924
0.02776	-0.07285
0.02780	-0.01533
0.02785	0.07407
0.02789	0.15261
0.02794	0.17739
0.02798	0.13566
0.02803	0.04933
0.02807	-0.06419
0.02812	-0.19258
0.02816	-0.33942
0.02821	-0.49779
0.02825	-0.62837
0.02830	-0.67058
0.02834	-0.55376
0.02839	-0.31790
0.02844	-0.09798
0.02848	0.04731
0.02853	0.17225
0.02857	0.38906
0.02862	0.69116
0.02866	0.83227
0.02871	0.83236
0.02875	0.70718
0.02880	0.39510
0.02884	0.10484
0.02889	-0.12373
0.02893	-0.33122
0.02898	-0.49970
0.02902	-0.61262
0.02907	-0.65369
0.02912	-0.61277
0.02916	-0.49573
0.02921	-0.31695
0.02925	-0.11783
0.02930	0.04803
0.02934	0.17148
0.02939	0.28303
0.02943	0.38050
0.02948	0.42178
0.02952	0.37404
0.02957	0.25594
0.02961	0.13433
0.02966	0.06569
0.02971	0.04702
0.02975	0.04902
0.02980	0.04857
0.02984	0.03660
0.02989	0.00880
0.02993	-0.03795
0.02998	-0.08591
0.03002	-0.11763
0.03007	-0.14654
0.03011	-0.18727
0.03016	-0.22956
0.03020	-0.25652
0.03025	-0.25230
0.03029	-0.21305
0.03034	-0.13932
0.03039	-0.03476
0.03043	0.08914
0.03048	0.21350
0.03052	0.31403
0.03057	0.37884
0.03061	0.39827
0.03066	0.36281
0.03070	0.27997
0.03075	0.16354
0.03079	0.03686
0.03084	-0.07791
0.03088	-0.17988
0.03093	-0.31621
0.03098	-0.51160
0.03102	-0.66826
0.03107	-0.64853
0.03111	-0.43306
0.03116	-0.15389
0.03120	0.05524
0.03125	0.16767
0.03129	0.22729
0.03134	0.29677
0.03138	0.40188
0.03143	0.49465
0.03147	0.51173
0.03152	0.43530
0.03156	0.28773
0.03161	0.12059
0.03166	-0.02993
0.03170	-0.14758
0.03175	-0.24226
0.03179	-0.31933
0.03184	-0.35752
0.03188	-0.33693
0.03193	-0.26090
0.03197	-0.18630
0.03202	-0.14274
0.03206	-0.09325
0.03211	-0.01004
0.03215	0.10651
0.03220	0.23262
0.03224	0.32322
0.03229	0.35544
0.03234	0.33443
0.03238	0.27490
0.03243	0.20377
0.03247	0.13923
0.03252	0.07695
0.03256	0.00414
0.03261	-0.07921
0.03265	-0.15246
0.03270	-0.20364
0.03274	-0.22494
0.03279	-0.21273
0.03283	-0.16779
0.03288	-0.09373
0.03293	-0.01806
0.03297	0.04033
0.03302	0.07685
0.03306	0.10780
0.03311	0.15379
0.03315	0.19630
0.03320	0.19638
0.03324	0.17732
0.03329	0.16455
0.03333	0.13195
0.03338	0.07710
0.03342	0.02125
0.03347	-0.01157
0.03351	-0.01316
0.03356	0.00602
0.03361	0.02115
0.03365	0.01458
0.03370	-0.00743
0.03374	-0.01481
0.03379	-0.00601
0.03383	0.00873
0.03388	0.00290
0.03392	-0.04725
0.03397	-0.13566
0.03401	-0.25218
0.03406	-0.37314
0.03410	-0.48140
0.03415	-0.56180
0.03420	-0.57623
0.03424	-0.45869
0.03429	-0.22327
0.03433	0.01413
0.03438	0.15806
0.03442	0.25384
0.03447	0.41334
0.03451	0.64525
0.03456	0.81687
0.03460	0.81273
0.03465	0.63092
0.03469	0.34151
0.03474	0.05604
0.03478	-0.18804
0.03483	-0.39703
0.03488	-0.55955
0.03492	-0.64556
0.03497	-0.64347
0.03501	-0.56898
0.03506	-0.42616
0.03510	-0.23459
0.03515	-0.04649
0.03519	0.09823
0.03524	0.20865
0.03528	0.31240
0.03533	0.40110
0.03537	0.42938
0.03542	0.36798
0.03546	0.24330
0.03551	0.11560
0.03556	0.03830
0.03560	0.01657
0.03565	0.02119
0.03569	0.02480
0.03574	0.01790
0.03578	-0.00438
0.03583	-0.05058
0.03587	-0.10165
0.03592	-0.13650
0.03596	-0.16788
0.03601	-0.20486
0.03605	-0.23512
0.03610	-0.24790
0.03615	-0.23392
0.03619	-0.19439
0.03624	-0.12583
0.03628	-0.01672
0.03633	0.11137
0.03637	0.23516
0.03642	0.34069
0.03646	0.40727
0.03651	0.41690
0.03655	0.36758
0.03660	0.27231
0.03664	0.14390
0.03669	0.00292
0.03673	-0.12376
0.03678	-0.22722
0.03683	-0.31509
0.03687	-0.39510
0.03692	-0.49165
0.03696	-0.57066
0.03701	-0.52708
0.03705	-0.32087
0.03710	-0.05061
0.03714	0.16118
0.03719	0.26459
0.03723	0.29761
0.03728	0.32750
0.03732	0.38211
0.03737	0.44473
0.03741	0.44803
0.03746	0.36370
0.03751	0.22235
0.03755	0.06595
0.03760	-0.08555
0.03764	-0.21179
0.03769	-0.30509
0.03773	-0.37443
0.03778	-0.39252
0.03782	-0.33435
0.03787	-0.22578
0.03791	-0.11366
0.03796	-0.02065
0.03800	0.04112
0.03805	0.10627
0.03810	0.20433
0.03814	0.30087
0.03819	0.34618
0.03823	0.33206
0.03828	0.26476
0.03832	0.16357
0.03837	0.07362
0.03841	0.00344
0.03846	-0.03800
0.03850	-0.05796
0.03855	-0.09991
0.03859	-0.15797
0.03864	-0.19981
0.03868	-0.22213
0.03873	-0.20379
0.03878	-0.12290
0.03882	-0.02380
0.03887	0.04932
0.03891	0.09872
0.03896	0.13144
0.03900	0.14513
0.03905	0.15043
0.03909	0.16507
0.03914	0.18208
0.03918	0.18325
0.03923	0.16164
0.03927	0.12571
0.03932	0.09138
0.03937	0.05901
0.03941	0.01225
0.03946	-0.03853
0.03950	-0.08140
0.03955	-0.10967
0.03959	-0.09485
0.03964	-0.04086
0.03968	0.00979
0.03973	0.01985
0.03977	0.01437
0.03982	0.01227
0.03986	0.00506
0.03991	-0.00498
0.03995	-0.01904
0.04000	-0.07004
0.04005	-0.17724
0.04009	-0.31992
0.04014	-0.46231
0.04018	-0.54338
0.04023	-0.50170
0.04027	-0.31372
0.04032	-0.05539
0.04036	0.12461
0.04041	0.16364
0.04045	0.17612
0.04050	0.28180
0.04054	0.47548
0.04059	0.62292
0.04063	0.60570
0.04068	0.43430
0.04073	0.20206
0.04077	0.00127
0.04082	-0.15791
0.04086	-0.29724
0.04091	-0.41395
0.04095	-0.47256
0.04100	-0.45570
0.04104	-0.37135
0.04109	-0.23902
0.04113	-0.10442
0.04118	-0.01607
0.04122	0.03020
0.04127	0.08329
0.04132	0.17272
0.04136	0.26818
0.04141	0.30197
0.04145	0.24516
0.04150	0.13723
0.04154	0.05310
0.04159	0.03194
0.04163	0.04563
0.04168	0.05865
0.04172	0.06481
0.04177	0.05038
0.04181	0.01420
0.04186	-0.02990
0.04190	-0.07948
0.04195	-0.13222
0.04200	-0.18668
0.04204	-0.23621
0.04209	-0.25390
0.04213	-0.22413
0.04218	-0.16710
0.04222	-0.10661
0.04227	-0.04915
0.04231	0.01951
0.04236	0.11646
0.04240	0.22546
0.04245	0.31524
0.04249	0.36530
0.04254	0.35300
0.04259	0.27689
0.04263	0.16539
0.04268	0.04913
0.04272	-0.05306
0.04277	-0.12991
0.04281	-0.17969
0.04286	-0.22003
0.04290	-0.27095
0.04295	-0.34425
0.04299	-0.43827
0.04304	-0.47925
0.04308	-0.38173
0.04313	-0.16328
0.04317	0.05723
0.04322	0.20348
0.04327	0.27937
0.04331	0.31501
0.04336	0.33993
0.04340	0.36582
0.04345	0.38251
0.04349	0.35169
0.04354	0.26386
0.04358	0.13957
0.04363	-0.00566
0.04367	-0.15542
0.04372	-0.26944
0.04376	-0.33530
0.04381	-0.35648
0.04385	-0.30743
0.04390	-0.20131
0.04395	-0.09102
0.04399	-0.01248
0.04404	0.02861
0.04408	0.05031
0.04413	0.10046
0.04417	0.18303
0.04422	0.24681
0.04426	0.26781
0.04431	0.24251
0.04435	0.17016
0.04440	0.09084
0.04444	0.03659
0.04449	-0.00304
0.04454	-0.03935
0.04458	-0.07941
0.04463	-0.13442
0.04467	-0.18780
0.04472	-0.20868
0.04476	-0.19552
0.04481	-0.15022
0.04485	-0.07215
0.04490	0.00629
0.04494	0.06572
0.04499	0.11373
0.04503	0.14388
0.04508	0.16958
0.04512	0.20471
0.04517	0.23488
0.04522	0.24917
0.04526	0.25146
0.04531	0.21154
0.04535	0.12332
0.04540	0.02665
0.04544	-0.06615
0.04549	-0.15955
0.04553	-0.21226
0.04558	-0.18897
0.04562	-0.13805
0.04567	-0.08588
0.04571	-0.02867
0.04576	0.02901
0.04580	0.07311
0.04585	0.10229
0.04590	0.11294
0.04594	0.08585
0.04599	0.01272
0.04603	-0.07179
0.04608	-0.13753
0.04612	-0.21586
0.04617	-0.32075
0.04621	-0.44785
0.04626	-0.54133
0.04630	-0.51162
0.04635	-0.33013
0.04639	-0.09836
0.04644	0.05343
0.04649	0.12559
0.04653	0.23150
0.04658	0.43138
0.04662	0.61789
0.04667	0.66298
