Frequency	Level
21.533203	-61.274460
43.066406	-56.697308
64.599609	-57.519535
86.132812	-56.695709
107.666016	-41.042366
129.199219	-38.166435
150.732422	-47.019585
172.265625	-57.902740
193.798828	-69.941475
215.332031	-49.421356
236.865234	-33.335773
258.398438	-31.685678
279.931641	-42.490929
301.464844	-61.347195
322.998047	-55.095871
344.531250	-38.239925
366.064453	-24.085585
387.597656	-23.679865
409.130859	-36.387787
430.664062	-55.082203
452.197266	-58.184704
473.730469	-51.534348
495.263672	-43.200924
516.796875	-46.115108
538.330078	-73.578346
559.863281	-61.918182
581.396484	-67.232628
602.929688	-49.161541
624.462891	-42.257145
645.996094	-46.663326
667.529297	-68.498276
689.062500	-66.220802
710.595703	-80.191650
732.128906	-52.438946
753.662109	-47.771656
775.195312	-54.510338
796.728516	-73.841942
818.261719	-69.131386
839.794922	-84.936630
861.328125	-55.482826
882.861328	-53.763420
904.394531	-66.013252
925.927734	-71.800072
947.460938	-68.472900
968.994141	-73.416756
990.527344	-53.657879
1012.060547	-52.813046
1033.593750	-63.614731
1055.126953	-66.310539
1076.660156	-74.604774
1098.193359	-61.439877
1119.726562	-51.655056
1141.259766	-53.082520
1162.792969	-68.784767
1184.326172	-74.940643
1205.859375	-74.895691
1227.392578	-67.195595
1248.925781	-57.224106
1270.458984	-58.350163
1291.992188	-67.117287
1313.525391	-70.528870
1335.058594	-78.462090
1356.591797	-56.044495
1378.125000	-48.748146
1399.658203	-53.360367
1421.191406	-67.983757
1442.724609	-68.328438
1464.257812	-66.615433
1485.791016	-60.520412
1507.324219	-56.540840
1528.857422	-62.974838
1550.390625	-64.807526
1571.923828	-69.484917
1593.457031	-66.993599
1614.990234	-47.540180
1636.523438	-45.632957
1658.056641	-54.349941
1679.589844	-68.590057
1701.123047	-60.175926
1722.656250	-61.997490
1744.189453	-50.635567
1765.722656	-48.310654
1787.255859	-58.295582
1808.789062	-64.686485
1830.322266	-56.837688
1851.855469	-46.514355
1873.388672	-34.424370
1894.921875	-34.161686
1916.455078	-43.295879
1937.988281	-55.966019
1959.521484	-48.216537
1981.054688	-41.958519
2002.587891	-28.288143
2024.121094	-28.341898
2045.654297	-40.510460
2067.187500	-53.875813
2088.720703	-44.585533
2110.253906	-39.080162
2131.787109	-35.640450
2153.320312	-41.708405
2174.853516	-49.545109
2196.386719	-48.090397
2217.919922	-54.354702
2239.453125	-40.641144
2260.986328	-35.151878
2282.519531	-40.607147
2304.052734	-56.710854
2325.585938	-69.089188
2347.119141	-45.802238
2368.652344	-35.238770
2390.185547	-34.385483
2411.718750	-41.331039
2433.251953	-44.950481
2454.785156	-46.235886
2476.318359	-44.823883
2497.851562	-27.748215
2519.384766	-25.954132
2540.917969	-37.234989
2562.451172	-47.046963
2583.984375	-44.756180
2605.517578	-41.046047
2627.050781	-33.186504
2648.583984	-35.465576
2670.117188	-42.929138
2691.650391	-47.753769
2713.183594	-53.331951
2734.716797	-43.793213
2756.250000	-35.699799
2777.783203	-39.365387
2799.316406	-62.272373
2820.849609	-61.547562
2842.382812	-52.195019
2863.916016	-44.208057
2885.449219	-39.418827
2906.982422	-42.838585
2928.515625	-50.505630
2950.048828	-55.469288
2971.582031	-60.030605
2993.115234	-44.348801
3014.648438	-40.822266
3036.181641	-46.952877
3057.714844	-69.404083
3079.248047	-55.748947
3100.781250	-51.139091
3122.314453	-42.736580
3143.847656	-40.566338
3165.380859	-46.061619
3186.914062	-49.838718
3208.447266	-51.790543
3229.980469	-45.226875
3251.513672	-32.750671
3273.046875	-31.699953
3294.580078	-40.059498
3316.113281	-52.824005
3337.646484	-48.776981
3359.179688	-49.361340
3380.712891	-38.023655
3402.246094	-34.725891
3423.779297	-43.734219
3445.312500	-65.611313
3466.845703	-46.710033
3488.378906	-43.135151
3509.912109	-37.622173
3531.445312	-43.143631
3552.978516	-62.905312
3574.511719	-62.059193
3596.044922	-53.413670
3617.578125	-50.420506
3639.111328	-38.640007
3660.644531	-41.315609
3682.177734	-56.242027
3703.710938	-53.173286
3725.244141	-52.478775
3746.777344	-45.790722
3768.310547	-41.506084
3789.843750	-44.592655
3811.376953	-54.066101
3832.910156	-58.727989
3854.443359	-72.891914
3875.976562	-50.610138
3897.509766	-47.804455
3919.042969	-55.342377
3940.576172	-67.280266
3962.109375	-59.833450
3983.642578	-63.925613
4005.175781	-57.461472
4026.708984	-59.800613
4048.242188	-60.642338
4069.775391	-68.597694
4091.308594	-68.065369
4112.841797	-63.708477
4134.375000	-57.208256
4155.908203	-56.875603
4177.441406	-63.065563
4198.974609	-69.908577
4220.507812	-58.803596
4242.041016	-57.143612
4263.574219	-52.959106
4285.107422	-55.876068
4306.640625	-62.745827
4328.173828	-67.399452
4349.707031	-71.278809
4371.240234	-66.260147
4392.773438	-63.644501
4414.306641	-70.329659
4435.839844	-67.203697
4457.373047	-61.079876
4478.906250	-60.962559
4500.439453	-55.702751
4521.972656	-55.137146
4543.505859	-58.720383
4565.039062	-66.446732
4586.572266	-68.856316
4608.105469	-83.995010
4629.638672	-60.067268
4651.171875	-56.296535
4672.705078	-62.330158
4694.238281	-68.001175
4715.771484	-59.770473
4737.304688	-63.156765
4758.837891	-55.954926
4780.371094	-58.192890
4801.904297	-60.876389
4823.437500	-71.231354
4844.970703	-66.012321
4866.503906	-68.729485
4888.037109	-57.402477
4909.570312	-56.540375
4931.103516	-61.711384
4952.636719	-65.335228
4974.169922	-77.300835
4995.703125	-62.210823
5017.236328	-62.087914
5038.769531	-62.919209
5060.302734	-66.315071
5081.835938	-67.779282
5103.369141	-66.359848
5124.902344	-69.975060
5146.435547	-63.288799
5167.968750	-67.870041
5189.501953	-74.543152
5211.035156	-74.367653
5232.568359	-75.789764
5254.101562	-69.449638
5275.634766	-64.521530
5297.167969	-66.680458
5318.701172	-83.332375
5340.234375	-65.782944
5361.767578	-71.888481
5383.300781	-70.949211
5404.833984	-69.568184
5426.367188	-79.372192
5447.900391	-82.385605
5469.433594	-86.525040
5490.966797	-76.884567
5512.500000	-74.640793
5534.033203	-73.838150
5555.566406	-70.497055
5577.099609	-78.927025
5598.632812	-70.278221
5620.166016	-73.106018
5641.699219	-66.838829
5663.232422	-71.297295
5684.765625	-79.492317
5706.298828	-76.273773
5727.832031	-78.889259
5749.365234	-80.041519
5770.898438	-77.981918
5792.431641	-76.501709
5813.964844	-76.737335
5835.498047	-73.299133
5857.031250	-71.055061
5878.564453	-80.097519
5900.097656	-73.345390
5921.630859	-78.076294
5943.164062	-74.387657
5964.697266	-70.418991
5986.230469	-78.425758
6007.763672	-86.992828
6029.296875	-77.421829
6050.830078	-73.887619
6072.363281	-74.453239
6093.896484	-72.456841
6115.429688	-76.879921
6136.962891	-75.663368
6158.496094	-74.021919
6180.029297	-78.219467
6201.562500	-79.078987
6223.095703	-71.111977
6244.628906	-74.525848
6266.162109	-81.170410
6287.695312	-73.726547
6309.228516	-75.112259
6330.761719	-71.626755
6352.294922	-70.272896
6373.828125	-79.411224
6395.361328	-80.789696
6416.894531	-96.261978
6438.427734	-82.932526
6459.960938	-83.080956
6481.494141	-91.798775
6503.027344	-78.442261
6524.560547	-85.192024
6546.093750	-81.636223
6567.626953	-89.154930
6589.160156	-77.154472
6610.693359	-74.128860
6632.226562	-74.382164
6653.759766	-75.144386
6675.292969	-74.519730
6696.826172	-73.756439
6718.359375	-84.885452
6739.892578	-71.905090
6761.425781	-76.461441
6782.958984	-77.328148
6804.492188	-81.122192
6826.025391	-69.449173
6847.558594	-67.921906
6869.091797	-76.775841
6890.625000	-82.087967
6912.158203	-73.252640
6933.691406	-69.744972
6955.224609	-68.874420
6976.757812	-70.773117
6998.291016	-80.903214
7019.824219	-69.397636
7041.357422	-72.921097
7062.890625	-82.259521
7084.423828	-75.324715
7105.957031	-74.336975
7127.490234	-76.564491
7149.023438	-71.154831
7170.556641	-67.740456
7192.089844	-71.442795
7213.623047	-67.309525
7235.156250	-71.370766
7256.689453	-67.682953
7278.222656	-70.755562
7299.755859	-73.781471
7321.289062	-72.064255
7342.822266	-71.880241
7364.355469	-79.870445
7385.888672	-72.636444
7407.421875	-70.498161
7428.955078	-73.436211
7450.488281	-69.927956
7472.021484	-66.615631
7493.554688	-71.576317
7515.087891	-64.744576
7536.621094	-71.622452
7558.154297	-72.452774
7579.687500	-71.169075
7601.220703	-83.012917
7622.753906	-72.503342
7644.287109	-75.973976
7665.820312	-72.561111
7687.353516	-82.534203
7708.886719	-72.821884
7730.419922	-71.145134
7751.953125	-77.548470
7773.486328	-71.719826
7795.019531	-75.872879
7816.552734	-71.485657
7838.085938	-72.376106
7859.619141	-85.851135
7881.152344	-73.746582
7902.685547	-72.790634
7924.218750	-72.332664
7945.751953	-74.506248
7967.285156	-79.126572
7988.818359	-90.123032
8010.351562	-84.488251
8031.884766	-78.390007
8053.417969	-76.065712
8074.951172	-83.546150
8096.484375	-81.817680
8118.017578	-84.975243
8139.550781	-79.579620
8161.083984	-76.923569
8182.617188	-75.680153
8204.150391	-81.998642
8225.683594	-70.292809
8247.216797	-71.795479
8268.750000	-72.553650
8290.283203	-66.890961
8311.816406	-68.025452
8333.349609	-76.530907
8354.882812	-64.992416
8376.416016	-60.071304
8397.949219	-59.249073
8419.482422	-59.881279
8441.015625	-63.212864
8462.548828	-68.882370
8484.082031	-67.163094
8505.615234	-72.262733
8527.148438	-77.117874
8548.681641	-71.828606
8570.214844	-75.499313
8591.748047	-75.833511
8613.281250	-64.397743
8634.814453	-59.696594
8656.347656	-59.770481
8677.880859	-58.454155
8699.414062	-62.194885
8720.947266	-68.275146
8742.480469	-63.901432
8764.013672	-70.002159
8785.546875	-73.058487
8807.080078	-69.673485
8828.613281	-73.939323
8850.146484	-82.330681
8871.679688	-71.622032
8893.212891	-72.673935
8914.746094	-74.122353
8936.279297	-76.881279
8957.812500	-77.295540
8979.345703	-72.219574
9000.878906	-73.154655
9022.412109	-89.890182
9043.945312	-72.335060
9065.478516	-72.766846
9087.011719	-84.457703
9108.544922	-73.119629
9130.078125	-74.202316
9151.611328	-78.725464
9173.144531	-76.252663
9194.677734	-76.329422
9216.210938	-81.149666
9237.744141	-78.896622
9259.277344	-84.328842
9280.810547	-77.706131
9302.343750	-74.198807
9323.876953	-77.076416
9345.410156	-86.028542
9366.943359	-73.086136
9388.476562	-72.895020
9410.009766	-69.742325
9431.542969	-68.570198
9453.076172	-72.791061
9474.609375	-93.016518
9496.142578	-83.358086
9517.675781	-84.900955
9539.208984	-86.787933
9560.742188	-87.914856
9582.275391	-92.368805
9603.808594	-86.328651
9625.341797	-79.601410
9646.875000	-79.784637
9668.408203	-83.432968
9689.941406	-82.842247
9711.474609	-83.000069
9733.007812	-89.250275
9754.541016	-90.998825
9776.074219	-84.353401
9797.607422	-84.051109
9819.140625	-90.432625
9840.673828	-102.145691
9862.207031	-91.081985
9883.740234	-92.717255
9905.273438	-89.887878
9926.806641	-84.089737
9948.339844	-89.671700
9969.873047	-88.693214
9991.406250	-92.604698
10012.939453	-92.053177
10034.472656	-90.812874
10056.005859	-93.280373
10077.539062	-105.567909
10099.072266	-93.159264
10120.605469	-82.213982
10142.138672	-80.291046
10163.671875	-80.288528
10185.205078	-80.923470
10206.738281	-90.185158
10228.271484	-91.729431
10249.804688	-96.063408
10271.337891	-116.654198
10292.871094	-100.719467
10314.404297	-105.985718
10335.937500	-96.693153
10357.470703	-99.933701
10379.003906	-106.506706
10400.537109	-100.389343
10422.070312	-93.947151
10443.603516	-92.261887
10465.136719	-99.055664
10486.669922	-88.786179
10508.203125	-91.666245
10529.736328	-100.199348
10551.269531	-101.792305
10572.802734	-92.884811
10594.335938	-92.439835
10615.869141	-94.970367
10637.402344	-93.771820
10658.935547	-104.307396
10680.468750	-102.166634
10702.001953	-117.017960
10723.535156	-97.624405
10745.068359	-92.607895
10766.601562	-95.263069
10788.134766	-96.152412
10809.667969	-98.084694
10831.201172	-103.856323
10852.734375	-98.069984
10874.267578	-90.194290
10895.800781	-94.279213
10917.333984	-98.943962
10938.867188	-105.147980
10960.400391	-114.823799
10981.933594	-106.772369
11003.466797	-104.826912
