id,code,name,comments,extended_comments
1,AL,Alabama,NULL,NULL
2,AK,Alaska,NULL,NULL
3,AZ,Arizona,NULL,NULL
4,AR,Arkansas,NULL,NULL
5,CA,California,NULL,NULL
6,CO,Colorado,NULL,NULL
7,CT,Connecticut,NULL,NULL
8,DE,Delaware,NULL,NULL
9,DC,District of Columbia,NULL,NULL
10,FL,Florida,NULL,NULL
11,GA,Georgia,NULL,NULL
12,HI,Hawaii,NULL,NULL
13,ID,Idaho,NULL,NULL
14,IL,Illinois,NULL,NULL
15,IN,Indiana,NULL,NULL
16,IA,Iowa,NULL,NULL
17,KS,Kansas,NULL,NULL
18,KY,Kentucky,NULL,NULL
19,LA,Louisiana,NULL,NULL
20,ME,Maine,NULL,NULL
21,MD,Maryland,NULL,NULL
22,MA,Massachusetts,NULL,NULL
23,MI,Michigan,NULL,NULL
24,MN,Minnesota,NULL,NULL
25,MS,Mississippi,NULL,NULL
26,MO,Missouri,NULL,NULL
27,MT,Montana,NULL,NULL
28,NE,Nebraska,NULL,NULL
29,NV,Nevada,NULL,NULL
30,NH,New Hampshire,NULL,NULL
31,NJ,New Jersey,NULL,NULL
32,NM,New Mexico,NULL,NULL
33,NY,New York,NULL,NULL
34,NC,North Carolina,NULL,NULL
35,ND,North Dakota,NULL,NULL
36,OH,Ohio,NULL,NULL
37,OK,Oklahoma,NULL,NULL
38,OR,Oregon,NULL,NULL
39,PA,Pennsylvania,NULL,NULL
40,RI,Rhode Island,NULL,NULL
41,SC,South Carolina,NULL,NULL
42,SD,South Dakota,NULL,NULL
43,TN,Tennessee,NULL,NULL
44,TX,Texas,NULL,NULL
45,UT,Utah,NULL,NULL
46,VT,Vermont,NULL,NULL
47,VA,Virginia,NULL,NULL
48,WA,Washington,NULL,NULL
49,WV,West Virginia,NULL,NULL
50,WI,Wisconsin,NULL,NULL
51,WY,Wyoming,NULL,NULL