id,district_number,state_id
1,1,1
2,2,1
3,3,1
4,4,1
5,5,1
6,6,1
7,7,1
8,1,2
9,1,3
10,2,3
11,3,3
12,4,3
13,5,3
14,6,3
15,7,3
16,8,3
17,9,3
18,1,4
19,2,4
20,3,4
21,4,4
22,1,5
23,2,5
24,3,5
25,4,5
26,5,5
27,6,5
28,7,5
29,8,5
30,9,5
31,10,5
32,11,5
33,12,5
34,13,5
35,14,5
36,15,5
37,16,5
38,17,5
39,18,5
40,19,5
41,20,5
42,21,5
43,22,5
44,23,5
45,24,5
46,25,5
47,26,5
48,27,5
49,28,5
50,29,5
51,30,5
52,31,5
53,32,5
54,33,5
55,34,5
56,35,5
57,36,5
58,37,5
59,38,5
60,39,5
61,40,5
62,41,5
63,42,5
64,43,5
65,44,5
66,45,5
67,46,5
68,47,5
69,48,5
70,49,5
71,50,5
72,51,5
73,52,5
74,1,6
75,2,6
76,3,6
77,4,6
78,5,6
79,6,6
80,7,6
81,8,6
82,1,7
83,2,7
84,3,7
85,4,7
86,5,7
87,1,8
88,1,10
89,2,10
90,3,10
91,4,10
92,5,10
93,6,10
94,7,10
95,8,10
96,9,10
97,10,10
98,11,10
99,12,10
100,13,10
101,14,10
102,15,10
103,16,10
104,17,10
105,18,10
106,19,10
107,20,10
108,21,10
109,22,10
110,23,10
111,24,10
112,25,10
113,26,10
114,27,10
115,28,10
116,1,11
117,2,11
118,3,11
119,4,11
120,5,11
121,6,11
122,7,11
123,8,11
124,9,11
125,10,11
126,11,11
127,12,11
128,13,11
129,14,11
130,1,12
131,2,12
132,1,13
133,2,13
134,1,14
135,2,14
136,3,14
137,4,14
138,5,14
139,6,14
140,7,14
141,8,14
142,9,14
143,10,14
144,11,14
145,12,14
146,13,14
147,14,14
148,15,14
149,16,14
150,17,14
151,1,15
152,2,15
153,3,15
154,4,15
155,5,15
156,6,15
157,7,15
158,8,15
159,9,15
160,1,16
161,2,16
162,3,16
163,4,16
164,1,17
165,2,17
166,3,17
167,4,17
168,1,18
169,2,18
170,3,18
171,4,18
172,5,18
173,6,18
174,1,19
175,2,19
176,3,19
177,4,19
178,5,19
179,6,19
180,1,20
181,2,20
182,1,21
183,2,21
184,3,21
185,4,21
186,5,21
187,6,21
188,7,21
189,8,21
190,1,22
191,2,22
192,3,22
193,4,22
194,5,22
195,6,22
196,7,22
197,8,22
198,9,22
199,1,23
200,2,23
201,3,23
202,4,23
203,5,23
204,6,23
205,7,23
206,8,23
207,9,23
208,10,23
209,11,23
210,12,23
211,13,23
212,1,24
213,2,24
214,3,24
215,4,24
216,5,24
217,6,24
218,7,24
219,8,24
220,1,25
221,2,25
222,3,25
223,4,25
224,1,26
225,2,26
226,3,26
227,4,26
228,5,26
229,6,26
230,7,26
231,8,26
232,1,27
233,2,27
234,1,28
235,2,28
236,3,28
237,1,29
238,2,29
239,3,29
240,4,29
241,1,30
242,2,30
243,1,31
244,2,31
245,3,31
246,4,31
247,5,31
248,6,31
249,7,31
250,8,31
251,9,31
252,10,31
253,11,31
254,12,31
255,1,32
256,2,32
257,3,32
258,1,33
259,2,33
260,3,33
261,4,33
262,5,33
263,6,33
264,7,33
265,8,33
266,9,33
267,10,33
268,11,33
269,12,33
270,13,33
271,14,33
272,15,33
273,16,33
274,17,33
275,18,33
276,19,33
277,20,33
278,21,33
279,22,33
280,23,33
281,24,33
282,25,33
283,26,33
284,1,34
285,2,34
286,3,34
287,4,34
288,5,34
289,6,34
290,7,34
291,8,34
292,9,34
293,10,34
294,11,34
295,12,34
296,13,34
297,14,34
298,1,35
299,1,36
300,2,36
301,3,36
302,4,36
303,5,36
304,6,36
305,7,36
306,8,36
307,9,36
308,10,36
309,11,36
310,12,36
311,13,36
312,14,36
313,15,36
314,1,37
315,2,37
316,3,37
317,4,37
318,5,37
319,1,38
320,2,38
321,3,38
322,4,38
323,5,38
324,6,38
325,1,39
326,2,39
327,3,39
328,4,39
329,5,39
330,6,39
331,7,39
332,8,39
333,9,39
334,10,39
335,11,39
336,12,39
337,13,39
338,14,39
339,15,39
340,16,39
341,17,39
342,1,40
343,2,40
344,1,41
345,2,41
346,3,41
347,4,41
348,5,41
349,6,41
350,7,41
351,1,42
352,1,43
353,2,43
354,3,43
355,4,43
356,5,43
357,6,43
358,7,43
359,8,43
360,9,43
361,1,44
362,2,44
363,3,44
364,4,44
365,5,44
366,6,44
367,7,44
368,8,44
369,9,44
370,10,44
371,11,44
372,12,44
373,13,44
374,14,44
375,15,44
376,16,44
377,17,44
378,18,44
379,19,44
380,20,44
381,21,44
382,22,44
383,23,44
384,24,44
385,25,44
386,26,44
387,27,44
388,28,44
389,29,44
390,30,44
391,31,44
392,32,44
393,33,44
394,34,44
395,35,44
396,36,44
397,37,44
398,38,44
399,1,45
400,2,45
401,3,45
402,4,45
403,1,46
404,1,47
405,2,47
406,3,47
407,4,47
408,5,47
409,6,47
410,7,47
411,8,47
412,9,47
413,10,47
414,11,47
415,1,48
416,2,48
417,3,48
418,4,48
419,5,48
420,6,48
421,7,48
422,8,48
423,9,48
424,10,48
425,1,49
426,2,49
427,1,50
428,2,50
429,3,50
430,4,50
431,5,50
432,6,50
433,7,50
434,8,50
435,1,51