{
  "outline": {
    "type": "geo_shape"
  },
  "resultType": {
    "type": "keyword"
  },
  "districtCodes": {
    "type": "keyword"
  },
  "stateCode": {
    "type": "keyword"
  },
  "electionCycleYear": {
    "type": "integer"
  },
  "electionDate": {
    "type": "date"
  },
  "comments": {
    "type": "text"
  },
  "extendedComments": {
    "type": "text"
  },
  "resultName": {
    "type": "text"
  },
  "candidatesWithAccess": {
    "properties": {
      "candidateName": {
        "type": "text"
      },
      "candidateId": {
        "type": "integer"
      },
      "partyName": {
        "type": "text"
      },
      "partyId": {
        "type": "integer"
      }
    }
  },
  "candidatesSeekingAccess": {
    "properties": {
      "candidateName": {
        "type": "text"
      },
      "candidateId": {
        "type": "integer"
      },
      "partyName": {
        "type": "text"
      },
      "partyId": {
        "type": "integer"
      }
    }
  },
  "priorResults": {
    "properties": {
      "partyResults": {
        "properties": {
          "partyName": {
            "type": "text"
          },
          "partyId": {
            "type": "integer"
          },
          "votes": {
            "type": "integer"
          }
        }
      },
      "registeredVoters": {
        "type": "integer"
      },
      "eligibleVoters": {
        "type": "integer"
      },
      "electionDescription": {
        "type": "text"
      }
    }
  },
  "ballotAccess": {
    "properties": {
      "filingDeadline": {
        "type": "date"
      },
      "filingFee": {
        "type": "integer"
      },
      "signatureRequirement": {
        "type": "integer"
      },
      "applicablePartyIds": {
        "type": "integer"
      },
      "appliesToUnlistedParties": {
        "type": "boolean"
      },
      "comments": {
        "type": "text"
      }
    }
  },
  "writeInAccess": {
    "properties": {
      "filingDeadline": {
        "type": "date"
      },
      "filingFee": {
        "type": "integer"
      },
      "signatureRequirement": {
        "type": "integer"
      },
      "comments": {
        "type": "text"
      }
    }
  }
}
