<svg width="40" height="40" viewBox="0 0 40 40" fill="none" xmlns="http://www.w3.org/2000/svg">
<path d="M39.375 7.24125L32.7587 0.625H15.625V5.625H12.5C10.7768 5.625 9.37496 7.02688 9.37496 8.75V19.1163L6.03246 22.4587C5.38434 23.1069 4.96184 23.9281 4.81059 24.8331L4.41621 27.2L3.74996 27.8662L3.12496 27.2412L0.366211 30L8.74996 38.3838L9.63746 37.4963C10.1206 38.6 11.22 39.375 12.5 39.375H30C31.7231 39.375 33.125 37.9731 33.125 36.25V33.125H39.375V7.24125ZM33.125 2.75875L37.2412 6.875H33.125V2.75875ZM12.5 6.875H15.625V10.625H12.5C11.4662 10.625 10.625 9.78375 10.625 8.75C10.625 7.71625 11.4662 6.875 12.5 6.875ZM11.0668 21.1744C10.9187 21.3238 10.625 21.2025 10.625 20.9912V11.2338C11.1487 11.6306 11.7937 11.875 12.5 11.875H13.125V19.1163L11.0668 21.1744ZM5.58371 27.8L6.04371 25.0381C6.15184 24.3919 6.45309 23.805 6.91621 23.3419L9.37496 20.8838V20.9912C9.37496 21.8231 10.0518 22.5 10.8837 22.5C11.2812 22.5 11.67 22.3387 11.9506 22.0581L15.6787 18.33C15.8093 18.2 15.99 18.125 16.1743 18.125C16.5606 18.125 16.875 18.4394 16.875 18.8256C16.875 19.0131 16.8025 19.1887 16.67 19.3212L11.4331 24.5581L12.3168 25.4419L17.5537 20.205L18.8037 18.955C18.9343 18.825 19.115 18.75 19.2993 18.75C19.6856 18.75 20 19.0644 20 19.4506C20 19.6381 19.9275 19.8137 19.795 19.9462L18.545 21.1963L13.3081 26.4331L14.1918 27.3169L19.4287 22.08C19.5593 21.9494 19.74 21.875 19.9243 21.875C20.3106 21.875 20.625 22.1894 20.625 22.5756C20.625 22.76 20.5506 22.9406 20.42 23.0713L19.17 24.3213L15.1831 28.3081L16.0668 29.1919L20.0537 25.205C20.1843 25.0744 20.365 25 20.5493 25C20.9356 25 21.25 25.3144 21.25 25.7006C21.25 25.885 21.1756 26.0656 21.045 26.1963L16.0325 31.2087C15.5693 31.6719 14.9825 31.9738 14.3368 32.0813L11.5743 32.5413L9.99996 34.1162L4.63371 28.75L5.58371 27.8ZM2.13371 30L3.12496 29.0088L9.74121 35.625L8.74996 36.6162L2.13371 30ZM10.6487 36.485L11.5087 35.625L10.8837 35L12.175 33.7087L13.125 33.5506V38.125H12.5C11.5462 38.125 10.7656 37.4069 10.6487 36.485ZM31.875 36.25C31.875 37.2837 31.0337 38.125 30 38.125H14.375V33.3419L14.5431 33.3137C15.4475 33.1625 16.2687 32.74 16.9168 32.0919L21.9293 27.0794C22.2918 26.7169 22.5 26.2144 22.5 25.7006C22.5 24.905 22.0193 24.2206 21.3343 23.9175C21.6762 23.5575 21.875 23.0737 21.875 22.5756C21.875 21.78 21.3943 21.0956 20.7093 20.7931C21.0562 20.4288 21.25 19.9556 21.25 19.4506C21.25 18.375 20.375 17.5 19.2993 17.5C18.8018 17.5 18.3175 17.6987 17.9575 18.0406C17.6543 17.3556 16.97 16.875 16.1743 16.875C15.6606 16.875 15.1581 17.0831 14.795 17.4462L14.375 17.8663V11.875H27.5C28.5337 11.875 29.375 12.7163 29.375 13.75V20.3125L31.875 22.1875V36.25ZM30.625 19.6875V14.375H35.625V29.375H33.125V21.5625L30.625 19.6875ZM33.125 31.875V30.625H36.875V13.125H30.5618C30.2712 11.7006 29.0093 10.625 27.5 10.625H16.875V1.875H31.875V8.125H38.125V31.875H33.125Z" fill="#777777"/>
</svg>
