{
  "kind": "collectionType",
  "collectionName": "footer_options",
  "info": {
    "singularName": "footer-option",
    "pluralName": "footer-options",
    "displayName": "Footer Option"
  },
  "options": {
    "draftAndPublish": true
  },
  "pluginOptions": {},
  "attributes": {
    "to": {
      "type": "string",
      "required": true
    },
    "label": {
      "type": "string",
      "required": true
    }
  }
}
