{
  "spacing-none": {
    "value": "0px",
    "type": "spacing"
  },
  "spacing-xx-small": {
    "value": "4px",
    "type": "spacing"
  },
  "spacing-x-small": {
    "value": "8px",
    "type": "spacing"
  },
  "spacing-small": {
    "value": "12px",
    "type": "spacing"
  },
  "spacing-default": {
    "value": "16px",
    "type": "spacing"
  },
  "spacing-large": {
    "value": "24px",
    "type": "spacing"
  },
  "spacing-x-large": {
    "value": "32px",
    "type": "spacing"
  },
  "spacing-xx-large": {
    "value": "40px",
    "type": "spacing"
  },
  "spacing-xxx-large": {
    "value": "48px",
    "type": "spacing"
  }
}