\relax 
\providecommand\hyper@newdestlabel[2]{}
\providecommand\HyperFirstAtBeginDocument{\AtBeginDocument}
\HyperFirstAtBeginDocument{\ifx\hyper@anchor\@undefined
\global\let\oldcontentsline\contentsline
\gdef\contentsline#1#2#3#4{\oldcontentsline{#1}{#2}{#3}}
\global\let\oldnewlabel\newlabel
\gdef\newlabel#1#2{\newlabelxx{#1}#2}
\gdef\newlabelxx#1#2#3#4#5#6{\oldnewlabel{#1}{{#2}{#3}}}
\AtEndDocument{\ifx\hyper@anchor\@undefined
\let\contentsline\oldcontentsline
\let\newlabel\oldnewlabel
\fi}
\fi}
\global\let\hyper@last\relax 
\gdef\HyperFirstAtBeginDocument#1{#1}
\providecommand\HyField@AuxAddToFields[1]{}
\providecommand\HyField@AuxAddToCoFields[2]{}
\babel@aux{english}{}
\@writefile{nav}{\headcommand {\slideentry {0}{0}{1}{1/1}{}{0}}}
\@writefile{nav}{\headcommand {\beamer@framepages {1}{1}}}
\@writefile{toc}{\beamer@sectionintoc {1}{Importance of Thermodynamics}{2}{0}{1}}
\@writefile{nav}{\headcommand {\beamer@sectionpages {1}{1}}}
\@writefile{nav}{\headcommand {\beamer@subsectionpages {1}{1}}}
\@writefile{nav}{\headcommand {\sectionentry {1}{Importance of Thermodynamics}{2}{Importance of Thermodynamics}{0}}}
\@writefile{nav}{\headcommand {\slideentry {1}{0}{1}{2/4}{}{0}}}
\@writefile{nav}{\headcommand {\beamer@framepages {2}{4}}}
\citation{henry_thermodynamics-based_2007}
\citation{peres_how_2017}
\@writefile{nav}{\headcommand {\slideentry {1}{0}{2}{5/5}{}{0}}}
\@writefile{nav}{\headcommand {\beamer@framepages {5}{5}}}
\@writefile{toc}{\beamer@sectionintoc {2}{Short introduction to extreme pathways}{6}{0}{2}}
\@writefile{nav}{\headcommand {\beamer@sectionpages {2}{5}}}
\@writefile{nav}{\headcommand {\beamer@subsectionpages {2}{5}}}
\@writefile{nav}{\headcommand {\sectionentry {2}{Short introduction to extreme pathways}{6}{Short introduction to extreme pathways}{0}}}
\@writefile{nav}{\headcommand {\slideentry {2}{0}{1}{6/6}{}{0}}}
\@writefile{nav}{\headcommand {\beamer@framepages {6}{6}}}
\@writefile{nav}{\headcommand {\slideentry {2}{0}{2}{7/7}{}{0}}}
\@writefile{nav}{\headcommand {\beamer@framepages {7}{7}}}
\@writefile{nav}{\headcommand {\slideentry {2}{0}{3}{8/8}{}{0}}}
\@writefile{nav}{\headcommand {\beamer@framepages {8}{8}}}
\@writefile{toc}{\beamer@sectionintoc {3}{Thermodynamics and Energy Generating Cycles}{9}{0}{3}}
\@writefile{nav}{\headcommand {\beamer@sectionpages {6}{8}}}
\@writefile{nav}{\headcommand {\beamer@subsectionpages {6}{8}}}
\@writefile{nav}{\headcommand {\sectionentry {3}{Thermodynamics and Energy Generating Cycles}{9}{Thermodynamics and Energy Generating Cycles}{0}}}
\@writefile{nav}{\headcommand {\slideentry {3}{0}{1}{9/11}{}{0}}}
\@writefile{nav}{\headcommand {\beamer@framepages {9}{11}}}
\newlabel{table:egc_example}{{8}{12}{Thermodynamics and Energy Generating Cycles}{Doc-Start}{}}
\@writefile{snm}{\beamer@slide {table:egc_example}{12}}
\@writefile{nav}{\headcommand {\slideentry {3}{0}{2}{12/14}{}{0}}}
\@writefile{nav}{\headcommand {\beamer@framepages {12}{14}}}
\citation{fritzemeier_erroneous_2017}
\@writefile{nav}{\headcommand {\slideentry {3}{0}{3}{15/15}{}{0}}}
\@writefile{nav}{\headcommand {\beamer@framepages {15}{15}}}
\@writefile{nav}{\headcommand {\slideentry {3}{0}{4}{16/16}{}{0}}}
\@writefile{nav}{\headcommand {\beamer@framepages {16}{16}}}
\@writefile{nav}{\headcommand {\slideentry {3}{0}{5}{17/19}{}{0}}}
\@writefile{nav}{\headcommand {\beamer@framepages {17}{19}}}
\@writefile{nav}{\headcommand {\slideentry {3}{0}{6}{20/21}{}{0}}}
\@writefile{nav}{\headcommand {\beamer@framepages {20}{21}}}
\@writefile{nav}{\headcommand {\slideentry {3}{0}{7}{22/22}{}{0}}}
\@writefile{nav}{\headcommand {\beamer@framepages {22}{22}}}
\citation{henry_thermodynamics-based_2007}
\citation{henry_thermodynamics-based_2007}
\citation{henry_thermodynamics-based_2007}
\@writefile{nav}{\headcommand {\slideentry {3}{0}{8}{23/25}{}{0}}}
\@writefile{nav}{\headcommand {\beamer@framepages {23}{25}}}
\citation{schellenberger_elimination_2011}
\citation{noor_proof_2012}
\citation{schellenberger_elimination_2011}
\citation{noor_proof_2012}
\citation{schellenberger_elimination_2011}
\citation{noor_proof_2012}
\@writefile{nav}{\headcommand {\slideentry {3}{0}{9}{26/28}{}{0}}}
\@writefile{nav}{\headcommand {\beamer@framepages {26}{28}}}
\citation{noor_proof_2012}
\@writefile{nav}{\headcommand {\slideentry {3}{0}{10}{29/29}{}{0}}}
\@writefile{nav}{\headcommand {\beamer@framepages {29}{29}}}
\@writefile{nav}{\headcommand {\slideentry {3}{0}{11}{30/30}{}{0}}}
\@writefile{nav}{\headcommand {\beamer@framepages {30}{30}}}
\citation{noor_removing_2018}
\@writefile{nav}{\headcommand {\slideentry {3}{0}{12}{31/31}{}{0}}}
\@writefile{nav}{\headcommand {\beamer@framepages {31}{31}}}
\newlabel{table:potentials}{{19}{32}{Thermodynamics and Energy Generating Cycles}{Doc-Start}{}}
\@writefile{snm}{\beamer@slide {table:potentials}{32}}
\@writefile{nav}{\headcommand {\slideentry {3}{0}{13}{32/32}{}{0}}}
\@writefile{nav}{\headcommand {\beamer@framepages {32}{32}}}
\@writefile{nav}{\headcommand {\slideentry {3}{0}{14}{33/33}{}{0}}}
\@writefile{nav}{\headcommand {\beamer@framepages {33}{33}}}
\@writefile{toc}{\beamer@sectionintoc {4}{Gibbs Energy Dissipation}{34}{0}{4}}
\@writefile{nav}{\headcommand {\beamer@sectionpages {9}{33}}}
\@writefile{nav}{\headcommand {\beamer@subsectionpages {9}{33}}}
\@writefile{nav}{\headcommand {\sectionentry {4}{Gibbs Energy Dissipation}{34}{Gibbs Energy Dissipation}{0}}}
\@writefile{nav}{\headcommand {\slideentry {4}{0}{1}{34/35}{}{0}}}
\@writefile{nav}{\headcommand {\beamer@framepages {34}{35}}}
\@writefile{nav}{\headcommand {\slideentry {4}{0}{2}{36/36}{}{0}}}
\@writefile{nav}{\headcommand {\beamer@framepages {36}{36}}}
\bibstyle{apalike}
\bibdata{thermo.bib}
\bibcite{fritzemeier_erroneous_2017}{\hyperlink {beamerbibfritzemeier_erroneous_2017}{Fritzemeier et~al., 2017}}
\bibcite{henry_thermodynamics-based_2007}{\hyperlink {beamerbibhenry_thermodynamics-based_2007}{Henry et~al., 2007}}
\bibcite{noor_removing_2018}{\hyperlink {beamerbibnoor_removing_2018}{Noor, 2018}}
\bibcite{noor_proof_2012}{\hyperlink {beamerbibnoor_proof_2012}{Noor et~al., 2012}}
\bibcite{peres_how_2017}{\hyperlink {beamerbibperes_how_2017}{Peres et~al., 2017}}
\bibcite{schellenberger_elimination_2011}{\hyperlink {beamerbibschellenberger_elimination_2011}{Schellenberger et~al., 2011}}
\@writefile{nav}{\headcommand {\slideentry {4}{0}{3}{37/37}{}{0}}}
\@writefile{nav}{\headcommand {\beamer@framepages {37}{37}}}
\@writefile{nav}{\headcommand {\slideentry {4}{0}{4}{38/38}{}{0}}}
\@writefile{nav}{\headcommand {\beamer@framepages {38}{38}}}
\@writefile{nav}{\headcommand {\beamer@partpages {1}{38}}}
\@writefile{nav}{\headcommand {\beamer@subsectionpages {34}{38}}}
\@writefile{nav}{\headcommand {\beamer@sectionpages {34}{38}}}
\@writefile{nav}{\headcommand {\beamer@documentpages {38}}}
\@writefile{nav}{\headcommand {\gdef \inserttotalframenumber {24}}}
