!!!SBtab Document='pathways' SBtabVersion='1.0' Date='2019-11-8'
!!SBtab TableID='Pathway_000_reactions' TableType='Reaction' TableName='Pathway_000_reactions' DocumentName=' Document=' Unit=' SBtabVersion='1.0' Date='2019-11-8'
!reaction_id	!type	!primal	!formula
CYTBDpp	flux	3.0	0.5 o2_c + q8h2_c --> h2o_c + q8_c
EDA	flux	1.0	2ddg6p_c <=> g3p_c + pyr_c
EDD	flux	1.0	6pgc_c --> 2ddg6p_c + h2o_c
G6PDH2r	flux	1.0	g6p_c + nadp_c <=> 6pgl_c + nadph_c
GLYOX3	flux	1.0	h2o_c + mthgxl_c --> lac__D_c
HEX1	flux	1.0	atp_c + glc__D_c <=> adp_c + g6p_c
LDH_D2	flux	1.0	lac__D_c + q8_c <=> pyr_c + q8h2_c
MGSA	flux	1.0	dhap_c <=> mthgxl_c + pi_c
PGL	flux	1.0	6pgl_c + h2o_c <=> 6pgc_c
POX	flux	2.0	h2o_c + pyr_c + q8_c <=> ac_c + co2_c + q8h2_c
TPI	flux	-1.0	dhap_c <=> g3p_c

!!SBtab TableID='Pathway_000_stats' TableType='Quantity' TableName='Pathway_000_stats' DocumentName=' Document=' Unit=' SBtabVersion='1.0' Date='2019-11-8'
!ID	!QuantityType	!Unit	!Value
mdf	max-min driving force	kJ/mol	23.05
nr	number of reactions	dimensionless	11.0
sum_flux	sum of fluxes	dimensionless	14.0

!!SBtab TableID='Pathway_001_reactions' TableType='Reaction' TableName='Pathway_001_reactions' DocumentName=' Document=' Unit=' SBtabVersion='1.0' Date='2019-11-8'
!reaction_id	!type	!primal	!formula
CYTBDpp	flux	4.0	0.5 o2_c + q8h2_c --> h2o_c + q8_c
FBA	flux	1.0	fdp_c <=> dhap_c + g3p_c
GLYOX3	flux	2.0	h2o_c + mthgxl_c --> lac__D_c
HEX7	flux	1.0	atp_c + fru_c <=> adp_c + f6p_c
LDH_D2	flux	2.0	lac__D_c + q8_c <=> pyr_c + q8h2_c
MGSA	flux	2.0	dhap_c <=> mthgxl_c + pi_c
PFK	flux	1.0	atp_c + f6p_c <=> adp_c + fdp_c
POX	flux	2.0	h2o_c + pyr_c + q8_c <=> ac_c + co2_c + q8h2_c
TPI	flux	-1.0	dhap_c <=> g3p_c
XYLI2	flux	1.0	glc__D_c <=> fru_c

!!SBtab TableID='Pathway_001_stats' TableType='Quantity' TableName='Pathway_001_stats' DocumentName=' Document=' Unit=' SBtabVersion='1.0' Date='2019-11-8'
!ID	!QuantityType	!Unit	!Value
mdf	max-min driving force	kJ/mol	17.56
nr	number of reactions	dimensionless	10.0
sum_flux	sum of fluxes	dimensionless	17.0

!!SBtab TableID='Pathway_002_reactions' TableType='Reaction' TableName='Pathway_002_reactions' DocumentName=' Document=' Unit=' SBtabVersion='1.0' Date='2019-11-8'
!reaction_id	!type	!primal	!formula
CYTBDpp	flux	4.0	0.5 o2_c + q8h2_c --> h2o_c + q8_c
FBA	flux	1.0	fdp_c <=> dhap_c + g3p_c
HEX1	flux	1.0	atp_c + glc__D_c <=> adp_c + g6p_c
LALDO3	flux	2.0	mthgxl_c + nadph_c --> lald__L_c + nadp_c
LCADi	flux	2.0	h2o_c + lald__L_c + nad_c <=> lac__L_c + nadh_c
L_LACD2	flux	2.0	lac__L_c + q8_c <=> pyr_c + q8h2_c
MGSA	flux	2.0	dhap_c <=> mthgxl_c + pi_c
PFK	flux	1.0	atp_c + f6p_c <=> adp_c + fdp_c
PGI	flux	1.0	g6p_c <=> f6p_c
POX	flux	2.0	h2o_c + pyr_c + q8_c <=> ac_c + co2_c + q8h2_c
TPI	flux	-1.0	dhap_c <=> g3p_c

!!SBtab TableID='Pathway_002_stats' TableType='Quantity' TableName='Pathway_002_stats' DocumentName=' Document=' Unit=' SBtabVersion='1.0' Date='2019-11-8'
!ID	!QuantityType	!Unit	!Value
mdf	max-min driving force	kJ/mol	15.71
nr	number of reactions	dimensionless	11.0
sum_flux	sum of fluxes	dimensionless	19.0

!!SBtab TableID='Pathway_003_reactions' TableType='Reaction' TableName='Pathway_003_reactions' DocumentName=' Document=' Unit=' SBtabVersion='1.0' Date='2019-11-8'
!reaction_id	!type	!primal	!formula
FACOAE60	flux	2.0	h2o_c + hxcoa_c <=> coa_c + hxa_c
FBA	flux	1.0	fdp_c <=> dhap_c + g3p_c
GLYOX3	flux	2.0	h2o_c + mthgxl_c --> lac__D_c
HEX1	flux	1.0	atp_c + glc__D_c <=> adp_c + g6p_c
HXCT	flux	2.0	accoa_c + hxa_c <=> ac_c + hxcoa_c
LDH_D	flux	2.0	lac__D_c + nad_c <=> nadh_c + pyr_c
MGSA	flux	2.0	dhap_c <=> mthgxl_c + pi_c
PDH	flux	2.0	coa_c + nad_c + pyr_c --> accoa_c + co2_c + nadh_c
PFK	flux	1.0	atp_c + f6p_c <=> adp_c + fdp_c
PGI	flux	1.0	g6p_c <=> f6p_c
TPI	flux	-1.0	dhap_c <=> g3p_c

!!SBtab TableID='Pathway_003_stats' TableType='Quantity' TableName='Pathway_003_stats' DocumentName=' Document=' Unit=' SBtabVersion='1.0' Date='2019-11-8'
!ID	!QuantityType	!Unit	!Value
mdf	max-min driving force	kJ/mol	13.68
nr	number of reactions	dimensionless	11.0
sum_flux	sum of fluxes	dimensionless	17.0

!!SBtab TableID='Pathway_004_reactions' TableType='Reaction' TableName='Pathway_004_reactions' DocumentName=' Document=' Unit=' SBtabVersion='1.0' Date='2019-11-8'
!reaction_id	!type	!primal	!formula
CYTBDpp	flux	2.0	0.5 o2_c + q8h2_c --> h2o_c + q8_c
FBA3	flux	1.0	s17bp_c <=> dhap_c + e4p_c
GLYOX3	flux	2.0	h2o_c + mthgxl_c --> lac__D_c
HEX1	flux	1.0	atp_c + glc__D_c <=> adp_c + g6p_c
LDH_D	flux	2.0	lac__D_c + nad_c <=> nadh_c + pyr_c
MGSA	flux	2.0	dhap_c <=> mthgxl_c + pi_c
PFK_3	flux	1.0	atp_c + s7p_c <=> adp_c + s17bp_c
PGI	flux	1.0	g6p_c <=> f6p_c
POX	flux	2.0	h2o_c + pyr_c + q8_c <=> ac_c + co2_c + q8h2_c
TALA	flux	-1.0	g3p_c + s7p_c <=> e4p_c + f6p_c
TPI	flux	-1.0	dhap_c <=> g3p_c

!!SBtab TableID='Pathway_004_stats' TableType='Quantity' TableName='Pathway_004_stats' DocumentName=' Document=' Unit=' SBtabVersion='1.0' Date='2019-11-8'
!ID	!QuantityType	!Unit	!Value
mdf	max-min driving force	kJ/mol	12.57
nr	number of reactions	dimensionless	11.0
sum_flux	sum of fluxes	dimensionless	16.0

