!!!SBtab Document='pathways' SBtabVersion='1.0' Date='2019-11-8'
!!SBtab TableID='Pathway_000_reactions' TableType='Reaction' TableName='Pathway_000_reactions' DocumentName=' Document=' Unit=' SBtabVersion='1.0' Date='2019-11-8'
!reaction_id	!type	!primal	!formula
ALKP	flux	1.0	dhap_c + h2o_c <=> dha_c + pi_c
CYTBDpp	flux	3.0	0.5 o2_c + q8h2_c --> h2o_c + q8_c
EDA	flux	3.0	2ddg6p_c <=> g3p_c + pyr_c
EDD	flux	3.0	6pgc_c --> 2ddg6p_c + h2o_c
F6PA	flux	-1.0	f6p_c <=> dha_c + g3p_c
GND	flux	-3.0	6pgc_c + nadp_c <=> co2_c + nadph_c + ru5p__D_c
HEX7	flux	1.0	atp_c + fru_c <=> adp_c + f6p_c
POX	flux	3.0	h2o_c + pyr_c + q8_c <=> ac_c + co2_c + q8h2_c
RPE	flux	-2.0	ru5p__D_c <=> xu5p__D_c
RPI	flux	1.0	r5p_c <=> ru5p__D_c
TALA	flux	-1.0	g3p_c + s7p_c <=> e4p_c + f6p_c
TKT1	flux	-1.0	r5p_c + xu5p__D_c <=> g3p_c + s7p_c
TKT2	flux	-1.0	e4p_c + xu5p__D_c <=> f6p_c + g3p_c
TPI	flux	-1.0	dhap_c <=> g3p_c
XYLI2	flux	1.0	glc__D_c <=> fru_c

!!SBtab TableID='Pathway_000_stats' TableType='Quantity' TableName='Pathway_000_stats' DocumentName=' Document=' Unit=' SBtabVersion='1.0' Date='2019-11-8'
!ID	!QuantityType	!Unit	!Value
mdf	max-min driving force	kJ/mol	6.29
nr	number of reactions	dimensionless	15.0
sum_flux	sum of fluxes	dimensionless	26.0

!!SBtab TableID='Pathway_001_reactions' TableType='Reaction' TableName='Pathway_001_reactions' DocumentName=' Document=' Unit=' SBtabVersion='1.0' Date='2019-11-8'
!reaction_id	!type	!primal	!formula
CYTBDpp	flux	3.0	0.5 o2_c + q8h2_c --> h2o_c + q8_c
EDA	flux	3.0	2ddg6p_c <=> g3p_c + pyr_c
EDD	flux	3.0	6pgc_c --> 2ddg6p_c + h2o_c
FBA3	flux	-1.0	s17bp_c <=> dhap_c + e4p_c
GND	flux	-3.0	6pgc_c + nadp_c <=> co2_c + nadph_c + ru5p__D_c
HEX1	flux	1.0	atp_c + glc__D_c <=> adp_c + g6p_c
PFK_3	flux	-1.0	atp_c + s7p_c <=> adp_c + s17bp_c
PGI	flux	1.0	g6p_c <=> f6p_c
POX	flux	3.0	h2o_c + pyr_c + q8_c <=> ac_c + co2_c + q8h2_c
RPE	flux	-2.0	ru5p__D_c <=> xu5p__D_c
RPI	flux	1.0	r5p_c <=> ru5p__D_c
TKT1	flux	-1.0	r5p_c + xu5p__D_c <=> g3p_c + s7p_c
TKT2	flux	-1.0	e4p_c + xu5p__D_c <=> f6p_c + g3p_c
TPI	flux	-1.0	dhap_c <=> g3p_c

!!SBtab TableID='Pathway_001_stats' TableType='Quantity' TableName='Pathway_001_stats' DocumentName=' Document=' Unit=' SBtabVersion='1.0' Date='2019-11-8'
!ID	!QuantityType	!Unit	!Value
mdf	max-min driving force	kJ/mol	3.53
nr	number of reactions	dimensionless	14.0
sum_flux	sum of fluxes	dimensionless	25.0

!!SBtab TableID='Pathway_002_reactions' TableType='Reaction' TableName='Pathway_002_reactions' DocumentName=' Document=' Unit=' SBtabVersion='1.0' Date='2019-11-8'
!reaction_id	!type	!primal	!formula
ACALD	flux	-3.0	acald_c + coa_c + nad_c <=> accoa_c + nadh_c
ALDD2y	flux	3.0	acald_c + h2o_c + nadp_c <=> ac_c + nadph_c
EDA	flux	3.0	2ddg6p_c <=> g3p_c + pyr_c
EDD	flux	3.0	6pgc_c --> 2ddg6p_c + h2o_c
FBA	flux	-1.0	fdp_c <=> dhap_c + g3p_c
FBP	flux	1.0	fdp_c + h2o_c <=> f6p_c + pi_c
GND	flux	-3.0	6pgc_c + nadp_c <=> co2_c + nadph_c + ru5p__D_c
HEX7	flux	1.0	atp_c + fru_c <=> adp_c + f6p_c
PDH	flux	3.0	coa_c + nad_c + pyr_c --> accoa_c + co2_c + nadh_c
RPE	flux	-2.0	ru5p__D_c <=> xu5p__D_c
RPI	flux	1.0	r5p_c <=> ru5p__D_c
TALA	flux	-1.0	g3p_c + s7p_c <=> e4p_c + f6p_c
TKT1	flux	-1.0	r5p_c + xu5p__D_c <=> g3p_c + s7p_c
TKT2	flux	-1.0	e4p_c + xu5p__D_c <=> f6p_c + g3p_c
TPI	flux	-1.0	dhap_c <=> g3p_c
XYLI2	flux	1.0	glc__D_c <=> fru_c

!!SBtab TableID='Pathway_002_stats' TableType='Quantity' TableName='Pathway_002_stats' DocumentName=' Document=' Unit=' SBtabVersion='1.0' Date='2019-11-8'
!ID	!QuantityType	!Unit	!Value
mdf	max-min driving force	kJ/mol	6.29
nr	number of reactions	dimensionless	16.0
sum_flux	sum of fluxes	dimensionless	29.0

!!SBtab TableID='Pathway_003_reactions' TableType='Reaction' TableName='Pathway_003_reactions' DocumentName=' Document=' Unit=' SBtabVersion='1.0' Date='2019-11-8'
!reaction_id	!type	!primal	!formula
EDA	flux	3.0	2ddg6p_c <=> g3p_c + pyr_c
EDD	flux	3.0	6pgc_c --> 2ddg6p_c + h2o_c
FACOAE60	flux	3.0	h2o_c + hxcoa_c <=> coa_c + hxa_c
FBA3	flux	-1.0	s17bp_c <=> dhap_c + e4p_c
GND	flux	-3.0	6pgc_c + nadp_c <=> co2_c + nadph_c + ru5p__D_c
HEX7	flux	1.0	atp_c + fru_c <=> adp_c + f6p_c
HXCT	flux	3.0	accoa_c + hxa_c <=> ac_c + hxcoa_c
PDH	flux	3.0	coa_c + nad_c + pyr_c --> accoa_c + co2_c + nadh_c
PFK_3	flux	-1.0	atp_c + s7p_c <=> adp_c + s17bp_c
RPE	flux	-2.0	ru5p__D_c <=> xu5p__D_c
RPI	flux	1.0	r5p_c <=> ru5p__D_c
TKT1	flux	-1.0	r5p_c + xu5p__D_c <=> g3p_c + s7p_c
TKT2	flux	-1.0	e4p_c + xu5p__D_c <=> f6p_c + g3p_c
TPI	flux	-1.0	dhap_c <=> g3p_c
XYLI2	flux	1.0	glc__D_c <=> fru_c

!!SBtab TableID='Pathway_003_stats' TableType='Quantity' TableName='Pathway_003_stats' DocumentName=' Document=' Unit=' SBtabVersion='1.0' Date='2019-11-8'
!ID	!QuantityType	!Unit	!Value
mdf	max-min driving force	kJ/mol	3.53
nr	number of reactions	dimensionless	15.0
sum_flux	sum of fluxes	dimensionless	28.0

!!SBtab TableID='Pathway_004_reactions' TableType='Reaction' TableName='Pathway_004_reactions' DocumentName=' Document=' Unit=' SBtabVersion='1.0' Date='2019-11-8'
!reaction_id	!type	!primal	!formula
CITL	flux	3.0	cit_c <=> ac_c + oaa_c
CS	flux	3.0	accoa_c + h2o_c + oaa_c <=> cit_c + coa_c
EDA	flux	3.0	2ddg6p_c <=> g3p_c + pyr_c
EDD	flux	3.0	6pgc_c --> 2ddg6p_c + h2o_c
FBA	flux	-1.0	fdp_c <=> dhap_c + g3p_c
FBP	flux	1.0	fdp_c + h2o_c <=> f6p_c + pi_c
GND	flux	-3.0	6pgc_c + nadp_c <=> co2_c + nadph_c + ru5p__D_c
HEX1	flux	1.0	atp_c + glc__D_c <=> adp_c + g6p_c
PDH	flux	3.0	coa_c + nad_c + pyr_c --> accoa_c + co2_c + nadh_c
PGI	flux	1.0	g6p_c <=> f6p_c
RPE	flux	-2.0	ru5p__D_c <=> xu5p__D_c
RPI	flux	1.0	r5p_c <=> ru5p__D_c
TALA	flux	-1.0	g3p_c + s7p_c <=> e4p_c + f6p_c
TKT1	flux	-1.0	r5p_c + xu5p__D_c <=> g3p_c + s7p_c
TKT2	flux	-1.0	e4p_c + xu5p__D_c <=> f6p_c + g3p_c
TPI	flux	-1.0	dhap_c <=> g3p_c

!!SBtab TableID='Pathway_004_stats' TableType='Quantity' TableName='Pathway_004_stats' DocumentName=' Document=' Unit=' SBtabVersion='1.0' Date='2019-11-8'
!ID	!QuantityType	!Unit	!Value
mdf	max-min driving force	kJ/mol	4.69
nr	number of reactions	dimensionless	16.0
sum_flux	sum of fluxes	dimensionless	29.0

!!SBtab TableID='Pathway_005_reactions' TableType='Reaction' TableName='Pathway_005_reactions' DocumentName=' Document=' Unit=' SBtabVersion='1.0' Date='2019-11-8'
!reaction_id	!type	!primal	!formula
ACALD	flux	-3.0	acald_c + coa_c + nad_c <=> accoa_c + nadh_c
ALCD19	flux	1.0	glyald_c + nadh_c <=> glyc_c + nad_c
ALDD2y	flux	3.0	acald_c + h2o_c + nadp_c <=> ac_c + nadph_c
EDA	flux	3.0	2ddg6p_c <=> g3p_c + pyr_c
EDD	flux	3.0	6pgc_c --> 2ddg6p_c + h2o_c
F6PA	flux	-1.0	f6p_c <=> dha_c + g3p_c
GAPP	flux	1.0	g3p_c + h2o_c <=> glyald_c + pi_c
GLYCDx	flux	1.0	glyc_c + nad_c <=> dha_c + nadh_c
GND	flux	-3.0	6pgc_c + nadp_c <=> co2_c + nadph_c + ru5p__D_c
HEX1	flux	1.0	atp_c + glc__D_c <=> adp_c + g6p_c
PDH	flux	3.0	coa_c + nad_c + pyr_c --> accoa_c + co2_c + nadh_c
PGI	flux	1.0	g6p_c <=> f6p_c
RPE	flux	-2.0	ru5p__D_c <=> xu5p__D_c
RPI	flux	1.0	r5p_c <=> ru5p__D_c
TALA	flux	-1.0	g3p_c + s7p_c <=> e4p_c + f6p_c
TKT1	flux	-1.0	r5p_c + xu5p__D_c <=> g3p_c + s7p_c
TKT2	flux	-1.0	e4p_c + xu5p__D_c <=> f6p_c + g3p_c

!!SBtab TableID='Pathway_005_stats' TableType='Quantity' TableName='Pathway_005_stats' DocumentName=' Document=' Unit=' SBtabVersion='1.0' Date='2019-11-8'
!ID	!QuantityType	!Unit	!Value
mdf	max-min driving force	kJ/mol	3.89
nr	number of reactions	dimensionless	17.0
sum_flux	sum of fluxes	dimensionless	30.0

!!SBtab TableID='Pathway_006_reactions' TableType='Reaction' TableName='Pathway_006_reactions' DocumentName=' Document=' Unit=' SBtabVersion='1.0' Date='2019-11-8'
!reaction_id	!type	!primal	!formula
FACOAE60	flux	3.0	h2o_c + hxcoa_c <=> coa_c + hxa_c
FBA	flux	1.0	fdp_c <=> dhap_c + g3p_c
GARFT	flux	-2.0	10fthf_c + gar_c <=> fgam_c + thf_c
GART	flux	2.0	atp_c + for_c + gar_c <=> adp_c + fgam_c + pi_c
GHMT2r	flux	-1.0	ser__L_c + thf_c <=> gly_c + h2o_c + mlthf_c
GLYCL	flux	-1.0	gly_c + nad_c + thf_c <=> co2_c + mlthf_c + nadh_c + nh4_c
GLYOX3	flux	2.0	h2o_c + mthgxl_c --> lac__D_c
HEX7	flux	1.0	atp_c + fru_c <=> adp_c + f6p_c
HXCT	flux	3.0	accoa_c + hxa_c <=> ac_c + hxcoa_c
LDH_D	flux	2.0	lac__D_c + nad_c <=> nadh_c + pyr_c
MGSA	flux	2.0	dhap_c <=> mthgxl_c + pi_c
MTHFC	flux	-2.0	h2o_c + methf_c <=> 10fthf_c
MTHFD	flux	-2.0	mlthf_c + nadp_c <=> methf_c + nadph_c
PDH	flux	1.0	coa_c + nad_c + pyr_c --> accoa_c + co2_c + nadh_c
PFK	flux	1.0	atp_c + f6p_c <=> adp_c + fdp_c
PFL	flux	2.0	coa_c + pyr_c <=> accoa_c + for_c
SERD_L	flux	1.0	ser__L_c <=> nh4_c + pyr_c
TPI	flux	-1.0	dhap_c <=> g3p_c
XYLI2	flux	1.0	glc__D_c <=> fru_c

!!SBtab TableID='Pathway_006_stats' TableType='Quantity' TableName='Pathway_006_stats' DocumentName=' Document=' Unit=' SBtabVersion='1.0' Date='2019-11-8'
!ID	!QuantityType	!Unit	!Value
mdf	max-min driving force	kJ/mol	6.05
nr	number of reactions	dimensionless	19.0
sum_flux	sum of fluxes	dimensionless	31.0

!!SBtab TableID='Pathway_007_reactions' TableType='Reaction' TableName='Pathway_007_reactions' DocumentName=' Document=' Unit=' SBtabVersion='1.0' Date='2019-11-8'
!reaction_id	!type	!primal	!formula
CITL	flux	3.0	cit_c <=> ac_c + oaa_c
CS	flux	3.0	accoa_c + h2o_c + oaa_c <=> cit_c + coa_c
FBA	flux	1.0	fdp_c <=> dhap_c + g3p_c
GARFT	flux	-2.0	10fthf_c + gar_c <=> fgam_c + thf_c
GART	flux	2.0	atp_c + for_c + gar_c <=> adp_c + fgam_c + pi_c
GHMT2r	flux	-1.0	ser__L_c + thf_c <=> gly_c + h2o_c + mlthf_c
GLYCL	flux	-1.0	gly_c + nad_c + thf_c <=> co2_c + mlthf_c + nadh_c + nh4_c
GLYOX3	flux	2.0	h2o_c + mthgxl_c --> lac__D_c
HEX1	flux	1.0	atp_c + glc__D_c <=> adp_c + g6p_c
LDH_D	flux	2.0	lac__D_c + nad_c <=> nadh_c + pyr_c
MGSA	flux	2.0	dhap_c <=> mthgxl_c + pi_c
MTHFC	flux	-2.0	h2o_c + methf_c <=> 10fthf_c
MTHFD	flux	-2.0	mlthf_c + nadp_c <=> methf_c + nadph_c
PDH	flux	1.0	coa_c + nad_c + pyr_c --> accoa_c + co2_c + nadh_c
PFK	flux	1.0	atp_c + f6p_c <=> adp_c + fdp_c
PFL	flux	2.0	coa_c + pyr_c <=> accoa_c + for_c
PGI	flux	1.0	g6p_c <=> f6p_c
SERD_L	flux	1.0	ser__L_c <=> nh4_c + pyr_c
TPI	flux	-1.0	dhap_c <=> g3p_c

!!SBtab TableID='Pathway_007_stats' TableType='Quantity' TableName='Pathway_007_stats' DocumentName=' Document=' Unit=' SBtabVersion='1.0' Date='2019-11-8'
!ID	!QuantityType	!Unit	!Value
mdf	max-min driving force	kJ/mol	6.06
nr	number of reactions	dimensionless	19.0
sum_flux	sum of fluxes	dimensionless	31.0

!!SBtab TableID='Pathway_008_reactions' TableType='Reaction' TableName='Pathway_008_reactions' DocumentName=' Document=' Unit=' SBtabVersion='1.0' Date='2019-11-8'
!reaction_id	!type	!primal	!formula
CITL	flux	3.0	cit_c <=> ac_c + oaa_c
CS	flux	3.0	accoa_c + h2o_c + oaa_c <=> cit_c + coa_c
EDA	flux	1.0	2ddg6p_c <=> g3p_c + pyr_c
EDD	flux	1.0	6pgc_c --> 2ddg6p_c + h2o_c
ENO	flux	2.0	2pg_c <=> h2o_c + pep_c
G6PDH2r	flux	1.0	g6p_c + nadp_c <=> 6pgl_c + nadph_c
GAPD	flux	1.0	g3p_c + nad_c + pi_c <=> 13dpg_c + nadh_c
GLXCL	flux	1.0	2.0 glx_c <=> 2h3oppan_c + co2_c
GLYCK	flux	1.0	atp_c + glyc__R_c --> 3pg_c + adp_c
HEX1	flux	1.0	atp_c + glc__D_c <=> adp_c + g6p_c
MALS	flux	-2.0	accoa_c + glx_c + h2o_c <=> coa_c + mal__L_c
MDH	flux	-2.0	mal__L_c + nad_c <=> nadh_c + oaa_c
PDH	flux	1.0	coa_c + nad_c + pyr_c --> accoa_c + co2_c + nadh_c
PGK	flux	-1.0	3pg_c + atp_c <=> 13dpg_c + adp_c
PGL	flux	1.0	6pgl_c + h2o_c <=> 6pgc_c
PGM	flux	-2.0	2pg_c <=> 3pg_c
PPC	flux	2.0	co2_c + h2o_c + pep_c <=> oaa_c + pi_c
TRSARr	flux	1.0	2h3oppan_c + nadh_c <=> glyc__R_c + nad_c

!!SBtab TableID='Pathway_008_stats' TableType='Quantity' TableName='Pathway_008_stats' DocumentName=' Document=' Unit=' SBtabVersion='1.0' Date='2019-11-8'
!ID	!QuantityType	!Unit	!Value
mdf	max-min driving force	kJ/mol	2.79
nr	number of reactions	dimensionless	18.0
sum_flux	sum of fluxes	dimensionless	27.0

!!SBtab TableID='Pathway_009_reactions' TableType='Reaction' TableName='Pathway_009_reactions' DocumentName=' Document=' Unit=' SBtabVersion='1.0' Date='2019-11-9'
!reaction_id	!type	!primal	!formula
DHAPT	flux	1.0	dha_c + pep_c <=> dhap_c + pyr_c
ENO	flux	3.0	2pg_c <=> h2o_c + pep_c
F6PA	flux	1.0	f6p_c <=> dha_c + g3p_c
FACOAE60	flux	3.0	h2o_c + hxcoa_c <=> coa_c + hxa_c
GAPD	flux	2.0	g3p_c + nad_c + pi_c <=> 13dpg_c + nadh_c
GLXCL	flux	1.0	2.0 glx_c <=> 2h3oppan_c + co2_c
GLYCK2	flux	1.0	atp_c + glyc__R_c <=> 2pg_c + adp_c
HEX1	flux	1.0	atp_c + glc__D_c <=> adp_c + g6p_c
HXCT	flux	3.0	accoa_c + hxa_c <=> ac_c + hxcoa_c
MALS	flux	-2.0	accoa_c + glx_c + h2o_c <=> coa_c + mal__L_c
MDH	flux	-2.0	mal__L_c + nad_c <=> nadh_c + oaa_c
PDH	flux	1.0	coa_c + nad_c + pyr_c --> accoa_c + co2_c + nadh_c
PGI	flux	1.0	g6p_c <=> f6p_c
PGK	flux	-2.0	3pg_c + atp_c <=> 13dpg_c + adp_c
PGM	flux	-2.0	2pg_c <=> 3pg_c
PPCK	flux	-2.0	atp_c + oaa_c <=> adp_c + co2_c + pep_c
TPI	flux	1.0	dhap_c <=> g3p_c
TRSARr	flux	1.0	2h3oppan_c + nadh_c <=> glyc__R_c + nad_c

!!SBtab TableID='Pathway_009_stats' TableType='Quantity' TableName='Pathway_009_stats' DocumentName=' Document=' Unit=' SBtabVersion='1.0' Date='2019-11-9'
!ID	!QuantityType	!Unit	!Value
mdf	max-min driving force	kJ/mol	2.79
nr	number of reactions	dimensionless	18.0
sum_flux	sum of fluxes	dimensionless	30.0

!!SBtab TableID='Pathway_010_reactions' TableType='Reaction' TableName='Pathway_010_reactions' DocumentName=' Document=' Unit=' SBtabVersion='1.0' Date='2019-11-9'
!reaction_id	!type	!primal	!formula
EDA	flux	1.0	2ddg6p_c <=> g3p_c + pyr_c
EDD	flux	1.0	6pgc_c --> 2ddg6p_c + h2o_c
ENO	flux	2.0	2pg_c <=> h2o_c + pep_c
FACOAE60	flux	3.0	h2o_c + hxcoa_c <=> coa_c + hxa_c
G6PDH2r	flux	1.0	g6p_c + nadp_c <=> 6pgl_c + nadph_c
GAPD	flux	1.0	g3p_c + nad_c + pi_c <=> 13dpg_c + nadh_c
GLXCL	flux	1.0	2.0 glx_c <=> 2h3oppan_c + co2_c
GLYCK2	flux	1.0	atp_c + glyc__R_c <=> 2pg_c + adp_c
HEX1	flux	1.0	atp_c + glc__D_c <=> adp_c + g6p_c
HXCT	flux	3.0	accoa_c + hxa_c <=> ac_c + hxcoa_c
MALS	flux	-2.0	accoa_c + glx_c + h2o_c <=> coa_c + mal__L_c
MDH	flux	-2.0	mal__L_c + nad_c <=> nadh_c + oaa_c
PDH	flux	1.0	coa_c + nad_c + pyr_c --> accoa_c + co2_c + nadh_c
PGK	flux	-1.0	3pg_c + atp_c <=> 13dpg_c + adp_c
PGL	flux	1.0	6pgl_c + h2o_c <=> 6pgc_c
PGM	flux	-1.0	2pg_c <=> 3pg_c
PPCK	flux	-2.0	atp_c + oaa_c <=> adp_c + co2_c + pep_c
TRSARr	flux	1.0	2h3oppan_c + nadh_c <=> glyc__R_c + nad_c

!!SBtab TableID='Pathway_010_stats' TableType='Quantity' TableName='Pathway_010_stats' DocumentName=' Document=' Unit=' SBtabVersion='1.0' Date='2019-11-9'
!ID	!QuantityType	!Unit	!Value
mdf	max-min driving force	kJ/mol	2.79
nr	number of reactions	dimensionless	18.0
sum_flux	sum of fluxes	dimensionless	26.0

!!SBtab TableID='Pathway_011_reactions' TableType='Reaction' TableName='Pathway_011_reactions' DocumentName=' Document=' Unit=' SBtabVersion='1.0' Date='2019-11-9'
!reaction_id	!type	!primal	!formula
CITL	flux	3.0	cit_c <=> ac_c + oaa_c
CS	flux	3.0	accoa_c + h2o_c + oaa_c <=> cit_c + coa_c
DHAPT	flux	1.0	dha_c + pep_c <=> dhap_c + pyr_c
ENO	flux	3.0	2pg_c <=> h2o_c + pep_c
F6PA	flux	1.0	f6p_c <=> dha_c + g3p_c
GAPD	flux	2.0	g3p_c + nad_c + pi_c <=> 13dpg_c + nadh_c
GLXCL	flux	1.0	2.0 glx_c <=> 2h3oppan_c + co2_c
GLYCK	flux	1.0	atp_c + glyc__R_c --> 3pg_c + adp_c
HEX7	flux	1.0	atp_c + fru_c <=> adp_c + f6p_c
MALS	flux	-2.0	accoa_c + glx_c + h2o_c <=> coa_c + mal__L_c
MDH	flux	-2.0	mal__L_c + nad_c <=> nadh_c + oaa_c
PDH	flux	1.0	coa_c + nad_c + pyr_c --> accoa_c + co2_c + nadh_c
PGK	flux	-2.0	3pg_c + atp_c <=> 13dpg_c + adp_c
PGM	flux	-3.0	2pg_c <=> 3pg_c
PPCK	flux	-2.0	atp_c + oaa_c <=> adp_c + co2_c + pep_c
TPI	flux	1.0	dhap_c <=> g3p_c
TRSARr	flux	1.0	2h3oppan_c + nadh_c <=> glyc__R_c + nad_c
XYLI2	flux	1.0	glc__D_c <=> fru_c

!!SBtab TableID='Pathway_011_stats' TableType='Quantity' TableName='Pathway_011_stats' DocumentName=' Document=' Unit=' SBtabVersion='1.0' Date='2019-11-9'
!ID	!QuantityType	!Unit	!Value
mdf	max-min driving force	kJ/mol	2.79
nr	number of reactions	dimensionless	18.0
sum_flux	sum of fluxes	dimensionless	31.0

!!SBtab TableID='Pathway_012_reactions' TableType='Reaction' TableName='Pathway_012_reactions' DocumentName=' Document=' Unit=' SBtabVersion='1.0' Date='2019-11-9'
!reaction_id	!type	!primal	!formula
CYTBDpp	flux	3.0	0.5 o2_c + q8h2_c --> h2o_c + q8_c
FACOAE60	flux	2.0	h2o_c + hxcoa_c <=> coa_c + hxa_c
FBA	flux	1.0	fdp_c <=> dhap_c + g3p_c
GARFT	flux	-2.0	10fthf_c + gar_c <=> fgam_c + thf_c
GART	flux	2.0	atp_c + for_c + gar_c <=> adp_c + fgam_c + pi_c
GHMT2r	flux	-1.0	ser__L_c + thf_c <=> gly_c + h2o_c + mlthf_c
GLYCL	flux	-1.0	gly_c + nad_c + thf_c <=> co2_c + mlthf_c + nadh_c + nh4_c
GLYOX3	flux	2.0	h2o_c + mthgxl_c --> lac__D_c
HEX1	flux	1.0	atp_c + glc__D_c <=> adp_c + g6p_c
HXCT	flux	2.0	accoa_c + hxa_c <=> ac_c + hxcoa_c
LDH_D2	flux	2.0	lac__D_c + q8_c <=> pyr_c + q8h2_c
MGSA	flux	2.0	dhap_c <=> mthgxl_c + pi_c
MTHFC	flux	-2.0	h2o_c + methf_c <=> 10fthf_c
MTHFD	flux	-2.0	mlthf_c + nadp_c <=> methf_c + nadph_c
PFK	flux	1.0	atp_c + f6p_c <=> adp_c + fdp_c
PFL	flux	2.0	coa_c + pyr_c <=> accoa_c + for_c
PGI	flux	1.0	g6p_c <=> f6p_c
POX	flux	1.0	h2o_c + pyr_c + q8_c <=> ac_c + co2_c + q8h2_c
SERD_L	flux	1.0	ser__L_c <=> nh4_c + pyr_c
TPI	flux	-1.0	dhap_c <=> g3p_c

!!SBtab TableID='Pathway_012_stats' TableType='Quantity' TableName='Pathway_012_stats' DocumentName=' Document=' Unit=' SBtabVersion='1.0' Date='2019-11-9'
!ID	!QuantityType	!Unit	!Value
mdf	max-min driving force	kJ/mol	6.06
nr	number of reactions	dimensionless	20.0
sum_flux	sum of fluxes	dimensionless	32.0

!!SBtab TableID='Pathway_013_reactions' TableType='Reaction' TableName='Pathway_013_reactions' DocumentName=' Document=' Unit=' SBtabVersion='1.0' Date='2019-11-9'
!reaction_id	!type	!primal	!formula
CITL	flux	2.0	cit_c <=> ac_c + oaa_c
CS	flux	2.0	accoa_c + h2o_c + oaa_c <=> cit_c + coa_c
CYTBDpp	flux	3.0	0.5 o2_c + q8h2_c --> h2o_c + q8_c
FBA	flux	1.0	fdp_c <=> dhap_c + g3p_c
GARFT	flux	-2.0	10fthf_c + gar_c <=> fgam_c + thf_c
GART	flux	2.0	atp_c + for_c + gar_c <=> adp_c + fgam_c + pi_c
GHMT2r	flux	-1.0	ser__L_c + thf_c <=> gly_c + h2o_c + mlthf_c
GLYCL	flux	-1.0	gly_c + nad_c + thf_c <=> co2_c + mlthf_c + nadh_c + nh4_c
GLYOX3	flux	2.0	h2o_c + mthgxl_c --> lac__D_c
HEX7	flux	1.0	atp_c + fru_c <=> adp_c + f6p_c
LDH_D2	flux	2.0	lac__D_c + q8_c <=> pyr_c + q8h2_c
MGSA	flux	2.0	dhap_c <=> mthgxl_c + pi_c
MTHFC	flux	-2.0	h2o_c + methf_c <=> 10fthf_c
MTHFD	flux	-2.0	mlthf_c + nadp_c <=> methf_c + nadph_c
PFK	flux	1.0	atp_c + f6p_c <=> adp_c + fdp_c
PFL	flux	2.0	coa_c + pyr_c <=> accoa_c + for_c
POX	flux	1.0	h2o_c + pyr_c + q8_c <=> ac_c + co2_c + q8h2_c
SERD_L	flux	1.0	ser__L_c <=> nh4_c + pyr_c
TPI	flux	-1.0	dhap_c <=> g3p_c
XYLI2	flux	1.0	glc__D_c <=> fru_c

!!SBtab TableID='Pathway_013_stats' TableType='Quantity' TableName='Pathway_013_stats' DocumentName=' Document=' Unit=' SBtabVersion='1.0' Date='2019-11-9'
!ID	!QuantityType	!Unit	!Value
mdf	max-min driving force	kJ/mol	6.05
nr	number of reactions	dimensionless	20.0
sum_flux	sum of fluxes	dimensionless	32.0

!!SBtab TableID='Pathway_014_reactions' TableType='Reaction' TableName='Pathway_014_reactions' DocumentName=' Document=' Unit=' SBtabVersion='1.0' Date='2019-11-9'
!reaction_id	!type	!primal	!formula
EDA	flux	1.0	2ddg6p_c <=> g3p_c + pyr_c
EDD	flux	1.0	6pgc_c --> 2ddg6p_c + h2o_c
FACOAE60	flux	3.0	h2o_c + hxcoa_c <=> coa_c + hxa_c
G6PDH2r	flux	1.0	g6p_c + nadp_c <=> 6pgl_c + nadph_c
GARFT	flux	-2.0	10fthf_c + gar_c <=> fgam_c + thf_c
GART	flux	2.0	atp_c + for_c + gar_c <=> adp_c + fgam_c + pi_c
GHMT2r	flux	-1.0	ser__L_c + thf_c <=> gly_c + h2o_c + mlthf_c
GLYCL	flux	-1.0	gly_c + nad_c + thf_c <=> co2_c + mlthf_c + nadh_c + nh4_c
GLYOX3	flux	1.0	h2o_c + mthgxl_c --> lac__D_c
HEX1	flux	1.0	atp_c + glc__D_c <=> adp_c + g6p_c
HXCT	flux	3.0	accoa_c + hxa_c <=> ac_c + hxcoa_c
LDH_D	flux	1.0	lac__D_c + nad_c <=> nadh_c + pyr_c
MGSA	flux	1.0	dhap_c <=> mthgxl_c + pi_c
MTHFC	flux	-2.0	h2o_c + methf_c <=> 10fthf_c
MTHFD	flux	-2.0	mlthf_c + nadp_c <=> methf_c + nadph_c
PDH	flux	1.0	coa_c + nad_c + pyr_c --> accoa_c + co2_c + nadh_c
PFL	flux	2.0	coa_c + pyr_c <=> accoa_c + for_c
PGL	flux	1.0	6pgl_c + h2o_c <=> 6pgc_c
SERD_L	flux	1.0	ser__L_c <=> nh4_c + pyr_c
TPI	flux	-1.0	dhap_c <=> g3p_c

!!SBtab TableID='Pathway_014_stats' TableType='Quantity' TableName='Pathway_014_stats' DocumentName=' Document=' Unit=' SBtabVersion='1.0' Date='2019-11-9'
!ID	!QuantityType	!Unit	!Value
mdf	max-min driving force	kJ/mol	6.05
nr	number of reactions	dimensionless	20.0
sum_flux	sum of fluxes	dimensionless	29.0

!!SBtab TableID='Pathway_015_reactions' TableType='Reaction' TableName='Pathway_015_reactions' DocumentName=' Document=' Unit=' SBtabVersion='1.0' Date='2019-11-10'
!reaction_id	!type	!primal	!formula
ACALD	flux	-3.0	acald_c + coa_c + nad_c <=> accoa_c + nadh_c
ALDD2y	flux	3.0	acald_c + h2o_c + nadp_c <=> ac_c + nadph_c
ALKP	flux	1.0	dhap_c + h2o_c <=> dha_c + pi_c
EDA	flux	2.0	2ddg6p_c <=> g3p_c + pyr_c
EDD	flux	2.0	6pgc_c --> 2ddg6p_c + h2o_c
F6PA	flux	-1.0	f6p_c <=> dha_c + g3p_c
G6PDH2r	flux	2.0	g6p_c + nadp_c <=> 6pgl_c + nadph_c
GARFT	flux	-2.0	10fthf_c + gar_c <=> fgam_c + thf_c
GART	flux	2.0	atp_c + for_c + gar_c <=> adp_c + fgam_c + pi_c
GHMT2r	flux	-1.0	ser__L_c + thf_c <=> gly_c + h2o_c + mlthf_c
GLYCL	flux	-1.0	gly_c + nad_c + thf_c <=> co2_c + mlthf_c + nadh_c + nh4_c
HEX1	flux	1.0	atp_c + glc__D_c <=> adp_c + g6p_c
MTHFC	flux	-2.0	h2o_c + methf_c <=> 10fthf_c
MTHFD	flux	-2.0	mlthf_c + nadp_c <=> methf_c + nadph_c
PDH	flux	1.0	coa_c + nad_c + pyr_c --> accoa_c + co2_c + nadh_c
PFL	flux	2.0	coa_c + pyr_c <=> accoa_c + for_c
PGI	flux	-1.0	g6p_c <=> f6p_c
PGL	flux	2.0	6pgl_c + h2o_c <=> 6pgc_c
SERD_L	flux	1.0	ser__L_c <=> nh4_c + pyr_c
TPI	flux	-1.0	dhap_c <=> g3p_c

!!SBtab TableID='Pathway_015_stats' TableType='Quantity' TableName='Pathway_015_stats' DocumentName=' Document=' Unit=' SBtabVersion='1.0' Date='2019-11-10'
!ID	!QuantityType	!Unit	!Value
mdf	max-min driving force	kJ/mol	6.06
nr	number of reactions	dimensionless	20.0
sum_flux	sum of fluxes	dimensionless	33.0

!!SBtab TableID='Pathway_016_reactions' TableType='Reaction' TableName='Pathway_016_reactions' DocumentName=' Document=' Unit=' SBtabVersion='1.0' Date='2019-11-10'
!reaction_id	!type	!primal	!formula
CITL	flux	3.0	cit_c <=> ac_c + oaa_c
CS	flux	3.0	accoa_c + h2o_c + oaa_c <=> cit_c + coa_c
EDA	flux	2.0	2ddg6p_c <=> g3p_c + pyr_c
EDD	flux	2.0	6pgc_c --> 2ddg6p_c + h2o_c
FBA	flux	-1.0	fdp_c <=> dhap_c + g3p_c
FBP	flux	1.0	fdp_c + h2o_c <=> f6p_c + pi_c
G6PDH2r	flux	2.0	g6p_c + nadp_c <=> 6pgl_c + nadph_c
GARFT	flux	-2.0	10fthf_c + gar_c <=> fgam_c + thf_c
GART	flux	2.0	atp_c + for_c + gar_c <=> adp_c + fgam_c + pi_c
GHMT2r	flux	-1.0	ser__L_c + thf_c <=> gly_c + h2o_c + mlthf_c
GLYCL	flux	-1.0	gly_c + nad_c + thf_c <=> co2_c + mlthf_c + nadh_c + nh4_c
HEX1	flux	1.0	atp_c + glc__D_c <=> adp_c + g6p_c
MTHFC	flux	-2.0	h2o_c + methf_c <=> 10fthf_c
MTHFD	flux	-2.0	mlthf_c + nadp_c <=> methf_c + nadph_c
PDH	flux	1.0	coa_c + nad_c + pyr_c --> accoa_c + co2_c + nadh_c
PFL	flux	2.0	coa_c + pyr_c <=> accoa_c + for_c
PGI	flux	-1.0	g6p_c <=> f6p_c
PGL	flux	2.0	6pgl_c + h2o_c <=> 6pgc_c
SERD_L	flux	1.0	ser__L_c <=> nh4_c + pyr_c
TPI	flux	-1.0	dhap_c <=> g3p_c

!!SBtab TableID='Pathway_016_stats' TableType='Quantity' TableName='Pathway_016_stats' DocumentName=' Document=' Unit=' SBtabVersion='1.0' Date='2019-11-10'
!ID	!QuantityType	!Unit	!Value
mdf	max-min driving force	kJ/mol	6.05
nr	number of reactions	dimensionless	20.0
sum_flux	sum of fluxes	dimensionless	33.0

!!SBtab TableID='Pathway_017_reactions' TableType='Reaction' TableName='Pathway_017_reactions' DocumentName=' Document=' Unit=' SBtabVersion='1.0' Date='2019-11-10'
!reaction_id	!type	!primal	!formula
CITL	flux	3.0	cit_c <=> ac_c + oaa_c
CS	flux	3.0	accoa_c + h2o_c + oaa_c <=> cit_c + coa_c
FBA3	flux	1.0	s17bp_c <=> dhap_c + e4p_c
GARFT	flux	-2.0	10fthf_c + gar_c <=> fgam_c + thf_c
GART	flux	2.0	atp_c + for_c + gar_c <=> adp_c + fgam_c + pi_c
GHMT2r	flux	-1.0	ser__L_c + thf_c <=> gly_c + h2o_c + mlthf_c
GLYCL	flux	-1.0	gly_c + nad_c + thf_c <=> co2_c + mlthf_c + nadh_c + nh4_c
GLYOX3	flux	2.0	h2o_c + mthgxl_c --> lac__D_c
HEX7	flux	1.0	atp_c + fru_c <=> adp_c + f6p_c
LDH_D	flux	2.0	lac__D_c + nad_c <=> nadh_c + pyr_c
MGSA	flux	2.0	dhap_c <=> mthgxl_c + pi_c
MTHFC	flux	-2.0	h2o_c + methf_c <=> 10fthf_c
MTHFD	flux	-2.0	mlthf_c + nadp_c <=> methf_c + nadph_c
PDH	flux	1.0	coa_c + nad_c + pyr_c --> accoa_c + co2_c + nadh_c
PFK_3	flux	1.0	atp_c + s7p_c <=> adp_c + s17bp_c
PFL	flux	2.0	coa_c + pyr_c <=> accoa_c + for_c
SERD_L	flux	1.0	ser__L_c <=> nh4_c + pyr_c
TALA	flux	-1.0	g3p_c + s7p_c <=> e4p_c + f6p_c
TPI	flux	-1.0	dhap_c <=> g3p_c
XYLI2	flux	1.0	glc__D_c <=> fru_c

!!SBtab TableID='Pathway_017_stats' TableType='Quantity' TableName='Pathway_017_stats' DocumentName=' Document=' Unit=' SBtabVersion='1.0' Date='2019-11-10'
!ID	!QuantityType	!Unit	!Value
mdf	max-min driving force	kJ/mol	6.06
nr	number of reactions	dimensionless	20.0
sum_flux	sum of fluxes	dimensionless	32.0

!!SBtab TableID='Pathway_018_reactions' TableType='Reaction' TableName='Pathway_018_reactions' DocumentName=' Document=' Unit=' SBtabVersion='1.0' Date='2019-11-10'
!reaction_id	!type	!primal	!formula
AACPS1	flux	-6.0	ACP_c + atp_c + ttdca_c <=> amp_c + myrsACP_c + ppi_c
ADPT	flux	3.0	ade_c + prpp_c <=> amp_c + ppi_c
ALDD2y	flux	3.0	acald_c + h2o_c + nadp_c <=> ac_c + nadph_c
DRPA	flux	3.0	2dr5p_c <=> acald_c + g3p_c
FA140ACPHi	flux	-6.0	h2o_c + myrsACP_c <=> ACP_c + ttdca_c
FBA	flux	-1.0	fdp_c <=> dhap_c + g3p_c
FBP	flux	1.0	fdp_c + h2o_c <=> f6p_c + pi_c
HEX7	flux	1.0	atp_c + fru_c <=> adp_c + f6p_c
NTD6	flux	3.0	damp_c + h2o_c <=> dad_2_c + pi_c
NTPP5	flux	3.0	datp_c + h2o_c --> damp_c + ppi_c
PPM2	flux	3.0	2dr1p_c <=> 2dr5p_c
PRPPS	flux	3.0	atp_c + r5p_c <=> amp_c + prpp_c
PUNP2	flux	3.0	dad_2_c + pi_c <=> 2dr1p_c + ade_c
RNTR1c2	flux	3.0	atp_c + nadph_c <=> datp_c + h2o_c + nadp_c
RPE	flux	-2.0	ru5p__D_c <=> xu5p__D_c
RPI	flux	-2.0	r5p_c <=> ru5p__D_c
TALA	flux	-1.0	g3p_c + s7p_c <=> e4p_c + f6p_c
TKT1	flux	-1.0	r5p_c + xu5p__D_c <=> g3p_c + s7p_c
TKT2	flux	-1.0	e4p_c + xu5p__D_c <=> f6p_c + g3p_c
TPI	flux	-1.0	dhap_c <=> g3p_c
XYLI2	flux	1.0	glc__D_c <=> fru_c

!!SBtab TableID='Pathway_018_stats' TableType='Quantity' TableName='Pathway_018_stats' DocumentName=' Document=' Unit=' SBtabVersion='1.0' Date='2019-11-10'
!ID	!QuantityType	!Unit	!Value
mdf	max-min driving force	kJ/mol	8.32
nr	number of reactions	dimensionless	21.0
sum_flux	sum of fluxes	dimensionless	51.0

!!SBtab TableID='Pathway_019_reactions' TableType='Reaction' TableName='Pathway_019_reactions' DocumentName=' Document=' Unit=' SBtabVersion='1.0' Date='2019-11-11'
!reaction_id	!type	!primal	!formula
EDA	flux	3.0	2ddg6p_c <=> g3p_c + pyr_c
EDD	flux	3.0	6pgc_c --> 2ddg6p_c + h2o_c
F1PP	flux	-1.0	f1p_c + h2o_c <=> fru_c + pi_c
FBA	flux	-1.0	fdp_c <=> dhap_c + g3p_c
FBP	flux	2.0	fdp_c + h2o_c <=> f6p_c + pi_c
FRUK	flux	1.0	atp_c + f1p_c <=> adp_c + fdp_c
GND	flux	-3.0	6pgc_c + nadp_c <=> co2_c + nadph_c + ru5p__D_c
NADPHQR3	flux	-3.0	mqn8_c + nadph_c <=> mql8_c + nadp_c
POX	flux	3.0	h2o_c + pyr_c + q8_c <=> ac_c + co2_c + q8h2_c
QMO2	flux	3.0	2.0 o2_c + q8h2_c --> 2.0 o2s_c + q8_c
QMO3	flux	-3.0	mql8_c + 2.0 o2_c <=> mqn8_c + 2.0 o2s_c
RPE	flux	-2.0	ru5p__D_c <=> xu5p__D_c
RPI	flux	1.0	r5p_c <=> ru5p__D_c
TALA	flux	-1.0	g3p_c + s7p_c <=> e4p_c + f6p_c
TKT1	flux	-1.0	r5p_c + xu5p__D_c <=> g3p_c + s7p_c
TKT2	flux	-1.0	e4p_c + xu5p__D_c <=> f6p_c + g3p_c
TPI	flux	-1.0	dhap_c <=> g3p_c
XYLI2	flux	1.0	glc__D_c <=> fru_c

!!SBtab TableID='Pathway_019_stats' TableType='Quantity' TableName='Pathway_019_stats' DocumentName=' Document=' Unit=' SBtabVersion='1.0' Date='2019-11-11'
!ID	!QuantityType	!Unit	!Value
mdf	max-min driving force	kJ/mol	0.52
nr	number of reactions	dimensionless	18.0
sum_flux	sum of fluxes	dimensionless	34.0

!!SBtab TableID='Pathway_020_reactions' TableType='Reaction' TableName='Pathway_020_reactions' DocumentName=' Document=' Unit=' SBtabVersion='1.0' Date='2019-11-11'
!reaction_id	!type	!primal	!formula
ADK1	flux	6.0	amp_c + atp_c <=> 2.0 adp_c
ADPT	flux	3.0	ade_c + prpp_c <=> amp_c + ppi_c
ALDD2y	flux	3.0	acald_c + h2o_c + nadp_c <=> ac_c + nadph_c
DADK	flux	-3.0	atp_c + damp_c <=> adp_c + dadp_c
DRPA	flux	3.0	2dr5p_c <=> acald_c + g3p_c
FBA	flux	-1.0	fdp_c <=> dhap_c + g3p_c
FBP	flux	1.0	fdp_c + h2o_c <=> f6p_c + pi_c
HEX7	flux	1.0	atp_c + fru_c <=> adp_c + f6p_c
NTD6	flux	3.0	damp_c + h2o_c <=> dad_2_c + pi_c
PPA	flux	3.0	h2o_c + ppi_c <=> 2.0 pi_c
PPM2	flux	3.0	2dr1p_c <=> 2dr5p_c
PRPPS	flux	3.0	atp_c + r5p_c <=> amp_c + prpp_c
PUNP2	flux	3.0	dad_2_c + pi_c <=> 2dr1p_c + ade_c
RNDR1	flux	3.0	adp_c + nadph_c <=> dadp_c + h2o_c + nadp_c
RPE	flux	-2.0	ru5p__D_c <=> xu5p__D_c
RPI	flux	-2.0	r5p_c <=> ru5p__D_c
TALA	flux	-1.0	g3p_c + s7p_c <=> e4p_c + f6p_c
TKT1	flux	-1.0	r5p_c + xu5p__D_c <=> g3p_c + s7p_c
TKT2	flux	-1.0	e4p_c + xu5p__D_c <=> f6p_c + g3p_c
TPI	flux	-1.0	dhap_c <=> g3p_c
XYLI2	flux	1.0	glc__D_c <=> fru_c

!!SBtab TableID='Pathway_020_stats' TableType='Quantity' TableName='Pathway_020_stats' DocumentName=' Document=' Unit=' SBtabVersion='1.0' Date='2019-11-11'
!ID	!QuantityType	!Unit	!Value
mdf	max-min driving force	kJ/mol	7.95
nr	number of reactions	dimensionless	21.0
sum_flux	sum of fluxes	dimensionless	48.0

!!SBtab TableID='Pathway_021_reactions' TableType='Reaction' TableName='Pathway_021_reactions' DocumentName=' Document=' Unit=' SBtabVersion='1.0' Date='2019-11-11'
!reaction_id	!type	!primal	!formula
CITL	flux	2.0	cit_c <=> ac_c + oaa_c
CS	flux	2.0	accoa_c + h2o_c + oaa_c <=> cit_c + coa_c
CYTBDpp	flux	1.0	0.5 o2_c + q8h2_c --> h2o_c + q8_c
DHAPT	flux	1.0	dha_c + pep_c <=> dhap_c + pyr_c
ENO	flux	3.0	2pg_c <=> h2o_c + pep_c
F6PA	flux	1.0	f6p_c <=> dha_c + g3p_c
GAPD	flux	2.0	g3p_c + nad_c + pi_c <=> 13dpg_c + nadh_c
GLXCL	flux	1.0	2.0 glx_c <=> 2h3oppan_c + co2_c
GLYCK2	flux	1.0	atp_c + glyc__R_c <=> 2pg_c + adp_c
HEX1	flux	1.0	atp_c + glc__D_c <=> adp_c + g6p_c
MALS	flux	-2.0	accoa_c + glx_c + h2o_c <=> coa_c + mal__L_c
MDH	flux	-2.0	mal__L_c + nad_c <=> nadh_c + oaa_c
PGI	flux	1.0	g6p_c <=> f6p_c
PGK	flux	-2.0	3pg_c + atp_c <=> 13dpg_c + adp_c
PGM	flux	-2.0	2pg_c <=> 3pg_c
POX	flux	1.0	h2o_c + pyr_c + q8_c <=> ac_c + co2_c + q8h2_c
PPC	flux	2.0	co2_c + h2o_c + pep_c <=> oaa_c + pi_c
TPI	flux	1.0	dhap_c <=> g3p_c
TRSARr	flux	1.0	2h3oppan_c + nadh_c <=> glyc__R_c + nad_c

!!SBtab TableID='Pathway_021_stats' TableType='Quantity' TableName='Pathway_021_stats' DocumentName=' Document=' Unit=' SBtabVersion='1.0' Date='2019-11-11'
!ID	!QuantityType	!Unit	!Value
mdf	max-min driving force	kJ/mol	2.79
nr	number of reactions	dimensionless	19.0
sum_flux	sum of fluxes	dimensionless	29.0

!!SBtab TableID='Pathway_022_reactions' TableType='Reaction' TableName='Pathway_022_reactions' DocumentName=' Document=' Unit=' SBtabVersion='1.0' Date='2019-11-12'
!reaction_id	!type	!primal	!formula
ENO	flux	3.0	2pg_c <=> h2o_c + pep_c
FACOAE60	flux	3.0	h2o_c + hxcoa_c <=> coa_c + hxa_c
FBA	flux	1.0	fdp_c <=> dhap_c + g3p_c
GAPD	flux	2.0	g3p_c + nad_c + pi_c <=> 13dpg_c + nadh_c
GLXCL	flux	1.0	2.0 glx_c <=> 2h3oppan_c + co2_c
GLYCK	flux	1.0	atp_c + glyc__R_c --> 3pg_c + adp_c
HEX7	flux	1.0	atp_c + fru_c <=> adp_c + f6p_c
HXCT	flux	3.0	accoa_c + hxa_c <=> ac_c + hxcoa_c
MALS	flux	-2.0	accoa_c + glx_c + h2o_c <=> coa_c + mal__L_c
MDH	flux	-2.0	mal__L_c + nad_c <=> nadh_c + oaa_c
PDH	flux	1.0	coa_c + nad_c + pyr_c --> accoa_c + co2_c + nadh_c
PFK	flux	1.0	atp_c + f6p_c <=> adp_c + fdp_c
PGK	flux	-2.0	3pg_c + atp_c <=> 13dpg_c + adp_c
PGM	flux	-3.0	2pg_c <=> 3pg_c
PPC	flux	2.0	co2_c + h2o_c + pep_c <=> oaa_c + pi_c
PYK	flux	1.0	adp_c + pep_c <=> atp_c + pyr_c
TPI	flux	1.0	dhap_c <=> g3p_c
TRSARr	flux	1.0	2h3oppan_c + nadh_c <=> glyc__R_c + nad_c
XYLI2	flux	1.0	glc__D_c <=> fru_c

!!SBtab TableID='Pathway_022_stats' TableType='Quantity' TableName='Pathway_022_stats' DocumentName=' Document=' Unit=' SBtabVersion='1.0' Date='2019-11-12'
!ID	!QuantityType	!Unit	!Value
mdf	max-min driving force	kJ/mol	2.79
nr	number of reactions	dimensionless	19.0
sum_flux	sum of fluxes	dimensionless	32.0

