,bigg_id,standard_dg_prime,standard_dg_prime_error,comment
0,ACALD,-8.363323482207532,0.4936955817421646,
1,ACALDt,,,reaction is not purely in the cytoplasm
2,ACKr,5.9427812791828725,0.22605297675308622,
3,ACONTa,3.359667063007025,0.4664529526750659,
4,ACONTb,-0.28116711578305215,0.46678739861690677,
5,ACt2r,,,reaction is not purely in the cytoplasm
6,ADK1,-0.4117520670031787,0.06572416799354268,
7,AKGDH,-11.937640124256642,1.5979463612555003,
8,AKGt2r,,,reaction is not purely in the cytoplasm
9,ALCD2x,7.193773392759136,0.13299939673173453,
10,ATPM,-11.282871619994152,0.12515390171957028,
11,ATPS4r,,,reaction is not purely in the cytoplasm
12,Biomass_Ecoli_core,,,reaction cannot be balanced: 1.496 3pg_c + 3.7478 accoa_c + 59.81 atp_c + 0.361 e4p_c + 0.0709 f6p_c + 0.129 g3p_c + 0.205 g6p_c + 0.2557 gln__L_c + 4.9414 glu__L_c + 59.81 h2o_c + 3.547 nad_c + 13.0279 nadph_c + 1.7867 oaa_c + 0.5191 pep_c + 2.8328 pyr_c + 0.8977 r5p_c --> 59.81 adp_c + 4.1182 akg_c + 3.7478 coa_c + 59.81 h_c + 3.547 nadh_c + 13.0279 nadp_c + 59.81 pi_c
13,CO2t,,,reaction is not purely in the cytoplasm
14,CS,-15.778004564839481,0.17987584383897612,
15,CYTBD,,,reaction is not purely in the cytoplasm
16,D_LACt2,,,reaction is not purely in the cytoplasm
17,ENO,-1.6486551719594458,0.12541407155522816,
18,ETOHt2r,,,reaction is not purely in the cytoplasm
19,EX_ac_e,,,reaction is not purely in the cytoplasm
20,EX_acald_e,,,reaction is not purely in the cytoplasm
21,EX_akg_e,,,reaction is not purely in the cytoplasm
22,EX_co2_e,,,reaction is not purely in the cytoplasm
23,EX_etoh_e,,,reaction is not purely in the cytoplasm
24,EX_for_e,,,reaction is not purely in the cytoplasm
25,EX_fru_e,,,reaction is not purely in the cytoplasm
26,EX_fum_e,,,reaction is not purely in the cytoplasm
27,EX_glc__D_e,,,reaction is not purely in the cytoplasm
28,EX_gln__L_e,,,reaction is not purely in the cytoplasm
29,EX_glu__L_e,,,reaction is not purely in the cytoplasm
30,EX_h_e,,,reaction is not purely in the cytoplasm
31,EX_h2o_e,,,reaction is not purely in the cytoplasm
32,EX_lac__D_e,,,reaction is not purely in the cytoplasm
33,EX_mal__L_e,,,reaction is not purely in the cytoplasm
34,EX_nh4_e,,,reaction is not purely in the cytoplasm
35,EX_o2_e,,,reaction is not purely in the cytoplasm
36,EX_pi_e,,,reaction is not purely in the cytoplasm
37,EX_pyr_e,,,reaction is not purely in the cytoplasm
38,EX_succ_e,,,reaction is not purely in the cytoplasm
39,FBA,8.884096630833863,0.21760214288238375,
40,FBP,-3.583741994114626,0.2846483454106755,
41,FORt2,,,reaction is not purely in the cytoplasm
42,FORti,,,reaction is not purely in the cytoplasm
43,FRD7,28.714261316880176,2.6208360713579077,
44,FRUpts2,,,reaction is not purely in the cytoplasm
45,FUM,-1.385268634622597,0.11444543744145824,
46,FUMt2_2,,,reaction is not purely in the cytoplasm
47,G6PDH2r,-2.916179111697995,0.5435813901326866,
48,GAPD,0.5055965116424831,0.1668400052738267,
49,GLCpts,,,reaction is not purely in the cytoplasm
50,GLNS,-6.449497348769829,0.3401988479274685,
51,GLNabc,,,reaction is not purely in the cytoplasm
52,GLUDy,13.33495978041996,0.15408721319558194,
53,GLUN,-4.833374271224143,0.3536645063607412,
54,GLUSy,-18.16833405164401,0.38814604369710093,
55,GLUt2r,,,reaction is not purely in the cytoplasm
56,GND,4.244685612824781,1.3064748873200538,
57,H2Ot,,,reaction is not purely in the cytoplasm
58,ICDHyr,2.3204917345783156,1.3107675267887833,
59,ICL,3.875537927925652,0.55577848228727,
60,LDH_D,8.29261837030559,0.8527149366801675,
61,MALS,-14.89565681270172,0.8562575582594146,
62,MALt2_2,,,reaction is not purely in the cytoplasm
63,MDH,10.669794392663682,0.12540479395824047,
64,ME1,5.19390604575325,1.2826138353503131,
65,ME2,5.187887130957842,1.2903363257687777,
66,NADH16,,,reaction is not purely in the cytoplasm
67,NADTRHD,0.006018914795397155,0.13810416783609486,
68,NH4t,,,reaction is not purely in the cytoplasm
69,O2t,,,reaction is not purely in the cytoplasm
70,PDH,-14.427412858051868,1.3255296274867199,
71,PFK,-7.699129625879526,0.2774607886125789,
72,PFL,-8.350243961460635,0.6125448823918882,
73,PGI,1.0094112531430075,0.15739599475645313,
74,PGK,7.550767167727188,0.18150378006357107,
75,PGL,-10.222806345426777,0.6823229238337725,
76,PGM,-1.670935158509369,0.14842304900678358,
77,PIt2r,,,reaction is not purely in the cytoplasm
78,PPC,-15.75171768580167,1.279971792740164,
79,PPCK,4.468846065807627,1.2833844487404034,
80,PPS,-0.9263851402726039,0.2048292987356612,
81,PTAr,3.713787666415182,0.24944282774938453,
82,PYK,-9.94473441271823,0.1742057897328459,
83,PYRt2,,,reaction is not purely in the cytoplasm
84,RPE,-1.358434774824427,0.4745418025555393,
85,RPI,1.785342002078721,0.6742056570631629,
86,SUCCt2_2,,,reaction is not purely in the cytoplasm
87,SUCCt3,,,reaction is not purely in the cytoplasm
88,SUCDi,-28.714261316880062,2.6208360713579077,
89,SUCOAS,-0.6403753978024658,0.548458356417908,
90,TALA,-0.28255257417318785,0.5813030735250745,
91,THD2,,,reaction is not purely in the cytoplasm
92,TKT1,-0.5697390275896885,0.9666261879042073,
93,TKT2,-4.090273869603056,0.790272288468557,
94,TPI,2.2311727520754014,0.2256743820063493,
