,standard chemical potential,standard chemical potential,standard chemical potential,standard chemical potential,standard chemical potential,standard chemical potential,standard chemical potential,standard chemical potential,standard chemical potential,standard chemical potential,standard chemical potential,standard chemical potential,standard chemical potential,standard chemical potential,standard chemical potential,standard chemical potential,standard chemical potential,standard chemical potential,standard chemical potential,standard chemical potential,standard chemical potential,standard chemical potential,standard chemical potential,standard chemical potential,standard chemical potential,catalytic rate constant geometric mean,catalytic rate constant geometric mean,catalytic rate constant geometric mean,catalytic rate constant geometric mean,catalytic rate constant geometric mean,catalytic rate constant geometric mean,catalytic rate constant geometric mean,catalytic rate constant geometric mean,catalytic rate constant geometric mean,catalytic rate constant geometric mean,catalytic rate constant geometric mean,catalytic rate constant geometric mean,catalytic rate constant geometric mean,catalytic rate constant geometric mean,catalytic rate constant geometric mean,catalytic rate constant geometric mean,catalytic rate constant geometric mean,catalytic rate constant geometric mean,catalytic rate constant geometric mean,catalytic rate constant geometric mean,catalytic rate constant geometric mean,catalytic rate constant geometric mean,catalytic rate constant geometric mean,catalytic rate constant geometric mean,Michaelis constant,Michaelis constant,Michaelis constant,Michaelis constant,Michaelis constant,Michaelis constant,Michaelis constant,Michaelis constant,Michaelis constant,Michaelis constant,Michaelis constant,Michaelis constant,Michaelis constant,Michaelis constant,Michaelis constant,Michaelis constant,Michaelis constant,Michaelis constant,Michaelis constant,Michaelis constant,Michaelis constant,Michaelis constant,Michaelis constant,Michaelis constant,Michaelis constant,Michaelis constant,Michaelis constant,Michaelis constant,Michaelis constant,Michaelis constant,Michaelis constant,Michaelis constant,Michaelis constant,Michaelis constant,Michaelis constant,Michaelis constant,Michaelis constant,Michaelis constant,Michaelis constant,Michaelis constant,Michaelis constant,Michaelis constant,Michaelis constant,Michaelis constant,Michaelis constant,Michaelis constant,Michaelis constant,Michaelis constant,Michaelis constant,Michaelis constant,Michaelis constant,Michaelis constant,Michaelis constant,Michaelis constant,Michaelis constant,Michaelis constant,Michaelis constant,Michaelis constant,Michaelis constant,Michaelis constant,Michaelis constant,Michaelis constant,Michaelis constant,Michaelis constant,Michaelis constant,Michaelis constant,concentration,concentration,concentration,concentration,concentration,concentration,concentration,concentration,concentration,concentration,concentration,concentration,concentration,concentration,concentration,concentration,concentration,concentration,concentration,concentration,concentration,concentration,concentration,concentration,concentration,concentration of enzyme,concentration of enzyme,concentration of enzyme,concentration of enzyme,concentration of enzyme,concentration of enzyme,concentration of enzyme,concentration of enzyme,concentration of enzyme,concentration of enzyme,concentration of enzyme,concentration of enzyme,concentration of enzyme,concentration of enzyme,concentration of enzyme,concentration of enzyme,concentration of enzyme,concentration of enzyme,concentration of enzyme,concentration of enzyme,concentration of enzyme,concentration of enzyme,concentration of enzyme,concentration of enzyme
standard chemical potential,484.2,391.4,-148.4,242.9,0.02006,242.8,94.34,46.56,47.43,-59.04,-75.69,59.04,63.5,201.8,183.7,290.2,254.6,183.8,201.4,201.4,17.71,148.4,219.1,17.7,484,0,0,0,0,0,0,-0.0001142,0,-1.047,0,0,0,0,0,0,0,0,0,0,0,0,0,0,0,-0.00727,-3.741,3.741,-0.00023,-0.00023,-1.744e-08,0.08329,0.3406,-3.465,5.989,0.001734,0.00023,-0.005847,-3.465,0.00023,1.744e-08,-0.2557,-0.3406,3.465,-5.989,-0.003468,0.005847,-1.744e-08,1.744e-08,-0.01274,0.01274,0.2919,-0.1402,0.01274,-0.0587,0.4191,-0.1402,0.3892,-0.6327,0.1402,-0.6545,0.1402,-0.3892,0.6327,0.6545,-0.3406,0.3406,-0.7308,0.7308,-0.3892,0.7125,0.3892,-1.436,1.436,-1.432,-0.6327,0.7106,-0.7106,0.7136,-0.7125,0.715,0.0004965,0.0004965,-0.0002659,0.001734,1.432,-0.7136,-0.715,-0.0004965,0.0002659,0.00727,0,0,0,0,0,0,0,0,0,0,0,0,0,0,0,0,0,0,0,0,0,0,0,0,0,0,0,0,0,0,0,0,0,0,0,0,0,0,0,0,0,0,0,0,0,0,0,0,0
standard chemical potential,391.4,391.7,-148.6,243.1,0.02008,243,94.41,46.6,47.47,-59.08,-75.74,59.08,63.55,202,183.9,290.4,254.8,183.9,201.6,201.5,17.72,148.5,219.3,17.72,391.3,0,0,0,0,0,0,-0.0001143,0,-1.048,0,0,0,0,0,0,0,0,0,0,0,0,0,0,0,-0.005877,0.01176,-0.01176,-0.0002302,-0.0002302,-1.746e-08,0.08335,0.3409,-3.467,5.994,0.001735,0.0002302,-0.005851,-3.467,0.0002302,1.746e-08,-0.2559,-0.3409,3.467,-5.994,-0.003471,0.005851,-1.746e-08,1.746e-08,-0.01275,0.01275,0.2921,-0.1403,0.01275,-0.05874,0.4194,-0.1403,0.3895,-0.6331,0.1403,-0.655,0.1403,-0.3895,0.6331,0.655,-0.3409,0.3409,-0.7314,0.7314,-0.3895,0.7131,0.3895,-1.437,1.437,-1.433,-0.6331,0.7111,-0.7111,0.7141,-0.7131,0.7156,0.0004969,0.0004969,-0.0002661,0.001735,1.433,-0.7141,-0.7156,-0.0004969,0.0002661,0.005877,0,0,0,0,0,0,0,0,0,0,0,0,0,0,0,0,0,0,0,0,0,0,0,0,0,0,0,0,0,0,0,0,0,0,0,0,0,0,0,0,0,0,0,0,0,0,0,0,0
standard chemical potential,-148.4,-148.6,8.342e+04,-74.11,8.334e+04,-74.06,0.3915,0.4735,0.03773,29.6,61.76,-29.6,-8.063,-77.45,-68.39,-121.8,-103.9,-68.38,-77.24,-77.25,-8.875,8.324e+04,-86.13,-8.872,-148.4,0,0,0,0,0,0,5.722e-05,0,0.5228,0,0,0,0,0,0,0,0,0,0,0,0,0,0,0,0.002229,-0.004459,0.004459,-4.121e-07,-4.121e-07,5.439e-09,-0.04158,-0.1702,-0.01271,-3.003,0.9724,4.121e-07,0.001815,-0.01271,4.121e-07,-5.439e-09,0.1277,0.1702,0.01271,3.003,-1.945,-0.001815,5.439e-09,-5.439e-09,0.004391,-0.004391,-0.1463,0.06989,-0.004391,0.02941,-0.2111,0.06989,-0.195,0.3186,-0.06989,0.3267,-0.06989,0.195,-0.3186,-0.3267,0.1702,-0.1702,0.3655,-0.3655,0.195,-0.3574,-0.195,0.7201,-0.7201,0.7185,0.3186,-0.3575,0.3575,-0.3587,0.3574,-0.3583,-0.0002488,-0.0002488,0.0001333,0.9724,-0.7185,0.3587,0.3583,0.0002488,-0.0001333,-0.002229,0,0,0,0,0,0,0,0,0,0,0,0,0,0,0,0,0,0,0,0,0,0,0,0,0,0,0,0,0,0,0,0,0,0,0,0,0,0,0,0,0,0,0,0,0,0,0,0,0
standard chemical potential,242.9,243.1,-74.11,169,0.01001,168.9,94.8,47.07,47.5,-29.48,-13.98,29.48,55.48,124.5,115.5,168.6,150.8,115.5,124.3,124.3,8.848,74.1,133.1,8.845,242.9,0,0,0,0,0,0,-5.705e-05,0,-0.5252,0,0,0,0,0,0,0,0,0,0,0,0,0,0,0,-0.003648,0.007297,-0.007297,6.744e-07,6.744e-07,-1.202e-08,0.04177,0.1707,-3.48,2.99,0.0008656,-6.744e-07,-0.004036,-3.48,-6.744e-07,1.202e-08,-0.1283,-0.1707,3.48,-2.99,-0.001731,0.004036,-1.202e-08,1.202e-08,-0.008361,0.008361,0.1458,-0.07036,0.008361,-0.02932,0.2083,-0.07036,0.1944,-0.3145,0.07036,-0.3283,0.07036,-0.1944,0.3145,0.3283,-0.1707,0.1707,-0.3658,0.3658,-0.1944,0.3556,0.1944,-0.7172,0.7172,-0.7149,-0.3145,0.3536,-0.3536,0.3554,-0.3556,0.3572,0.000248,0.000248,-0.0001329,0.0008656,0.7149,-0.3554,-0.3572,-0.000248,0.0001329,0.003648,0,0,0,0,0,0,0,0,0,0,0,0,0,0,0,0,0,0,0,0,0,0,0,0,0,0,0,0,0,0,0,0,0,0,0,0,0,0,0,0,0,0,0,0,0,0,0,0,0
standard chemical potential,0.02006,0.02008,8.334e+04,0.01001,8.334e+04,0.01001,-5.288e-05,-6.397e-05,-5.078e-06,-0.004001,-0.008346,0.004001,0.00109,0.01047,0.009242,0.01646,0.01405,0.009241,0.01044,0.01044,0.001199,8.331e+04,0.01164,0.001199,0.02005,0,0,0,0,0,0,-7.733e-09,0,-7.065e-05,0,0,0,0,0,0,0,0,0,0,0,0,0,0,0,-3.012e-07,6.026e-07,-6.026e-07,5.569e-11,5.569e-11,-7.342e-13,5.619e-06,2.3e-05,1.717e-06,0.0004059,0.9733,-5.569e-11,-2.451e-07,1.717e-06,-5.569e-11,7.342e-13,-1.725e-05,-2.3e-05,-1.717e-06,-0.0004059,-1.947,2.451e-07,-7.342e-13,7.342e-13,-5.927e-07,5.927e-07,1.976e-05,-9.445e-06,5.927e-07,-3.975e-06,2.853e-05,-9.445e-06,2.636e-05,-4.306e-05,9.445e-06,-4.416e-05,9.445e-06,-2.636e-05,4.306e-05,4.416e-05,-2.3e-05,2.3e-05,-4.94e-05,4.94e-05,-2.636e-05,4.83e-05,2.636e-05,-9.731e-05,9.731e-05,-9.71e-05,-4.306e-05,4.831e-05,-4.831e-05,4.847e-05,-4.83e-05,4.842e-05,3.362e-08,3.362e-08,-1.801e-08,0.9733,9.71e-05,-4.847e-05,-4.842e-05,-3.362e-08,1.801e-08,3.012e-07,0,0,0,0,0,0,0,0,0,0,0,0,0,0,0,0,0,0,0,0,0,0,0,0,0,0,0,0,0,0,0,0,0,0,0,0,0,0,0,0,0,0,0,0,0,0,0,0,0
standard chemical potential,242.8,243,-74.06,168.9,0.01001,197.9,123.8,61.56,61.99,-29.46,0.5337,29.46,69.94,138.9,129.8,183,165.2,130,138.7,138.7,8.847,74.05,147.5,8.844,242.7,0,0,0,0,0,0,-5.704e-05,0,-0.5263,0,0,0,0,0,0,0,0,0,0,0,0,0,0,0,-0.003646,0.007293,-0.007293,6.74e-07,6.74e-07,-1.403e-08,0.04186,0.1709,-3.478,2.988,0.0008651,-6.74e-07,1.168,-3.478,-6.74e-07,1.403e-08,-0.1285,-0.1709,3.478,-2.988,-0.00173,-1.168,-1.403e-08,1.403e-08,-0.009574,0.009574,0.1458,-0.07055,0.009574,-0.02932,0.2077,-0.07055,0.1944,-0.3135,0.07055,-0.329,0.07055,-0.1944,0.3135,0.329,-0.1709,0.1709,-0.3662,0.3662,-0.1944,0.3553,0.1944,-0.7168,0.7168,-0.7143,-0.3135,0.3526,-0.3526,0.3547,-0.3553,0.3571,0.000248,0.000248,-0.0001328,0.0008651,0.7143,-0.3547,-0.3571,-0.000248,0.0001328,0.003646,0,0,0,0,0,0,0,0,0,0,0,0,0,0,0,0,0,0,0,0,0,0,0,0,0,0,0,0,0,0,0,0,0,0,0,0,0,0,0,0,0,0,0,0,0,0,0,0,0
standard chemical potential,94.34,94.41,0.3915,94.8,-5.288e-05,123.8,124.2,62.03,62.03,0.145,62.3,-0.145,61.88,61.46,61.45,61.18,61.26,61.59,61.47,61.4,-0.02962,-0.3914,61.37,-0.02961,94.3,0,0,0,0,0,0,1.919e-07,0,-0.003526,0,0,0,0,0,0,0,0,0,0,0,0,0,0,0,-0.001417,0.002834,-0.002834,2.619e-07,2.619e-07,4.338e-06,0.0002805,0.0007171,-3.491,-0.01579,-4.573e-06,-2.619e-07,1.17,-3.491,-2.619e-07,-4.338e-06,-0.0008612,-0.0007171,3.491,0.01579,9.146e-06,-1.17,4.338e-06,-4.338e-06,-0.005183,0.005183,-0.0004905,-0.0006514,0.005183,9.865e-05,-0.003454,-0.0006514,-0.0006539,0.005214,0.0006514,-0.002204,0.0006514,0.0006539,-0.005214,0.002204,-0.0007171,0.0007171,-0.0006217,0.0006217,0.0006539,-0.002119,-0.0006539,0.003339,-0.003339,0.004259,0.005214,-0.004908,0.004908,-0.003984,0.002119,-0.001196,-8.305e-07,-8.305e-07,4.448e-07,-4.573e-06,-0.004259,0.003984,0.001196,8.305e-07,-4.448e-07,0.001417,0,0,0,0,0,0,0,0,0,0,0,0,0,0,0,0,0,0,0,0,0,0,0,0,0,0,0,0,0,0,0,0,0,0,0,0,0,0,0,0,0,0,0,0,0,0,0,0,0
standard chemical potential,46.56,46.6,0.4735,47.07,-6.397e-05,61.56,62.03,55.98,53.71,-0.2723,55.39,0.2723,54.82,54.26,54.13,54.61,54.45,54.25,54.26,54.2,0.09406,-0.4734,54.3,0.09403,46.54,0,0,0,0,0,0,0.0002969,0,-0.01006,0,0,0,0,0,0,0,0,0,0,0,0,0,0,0,-0.0006991,0.001398,-0.001398,1.292e-07,1.292e-07,2.167e-06,0.0007998,0.002893,-1.743,-0.0191,-5.531e-06,-1.292e-07,0.5844,-1.743,-1.292e-07,-2.167e-06,-0.002456,-0.002893,1.743,0.0191,1.106e-05,-0.5844,2.167e-06,-2.167e-06,1.748,-1.748,-0.7588,-0.001507,-1.748,0.1526,-0.0001738,-0.001507,0.002051,0.0002624,0.001507,-0.006285,0.001507,-0.002051,-0.0002624,0.006285,-0.002893,0.002893,-0.005417,0.005417,-0.002051,0.002986,0.002051,-0.00677,0.00677,-0.005952,0.0002624,0.0005214,-0.0005214,0.001336,-0.002986,0.003797,2.637e-06,2.637e-06,-1.412e-06,-5.531e-06,0.005952,-0.001336,-0.003797,-2.637e-06,1.412e-06,0.0006991,0,0,0,0,0,0,0,0,0,0,0,0,0,0,0,0,0,0,0,0,0,0,0,0,0,0,0,0,0,0,0,0,0,0,0,0,0,0,0,0,0,0,0,0,0,0,0,0,0
standard chemical potential,47.43,47.47,0.03773,47.5,-5.078e-06,61.99,62.03,53.71,55.97,0.4567,54.63,-0.4567,54.62,54.62,54.7,53.87,54.14,54.82,54.62,54.56,-0.1249,-0.03773,54.43,-0.1248,47.41,0,0,0,0,0,0,-0.0002967,0,0.002548,0,0,0,0,0,0,0,0,0,0,0,0,0,0,0,-0.0007122,0.001425,-0.001425,1.317e-07,1.317e-07,2.167e-06,-0.0002027,-0.001211,-1.743,-0.001522,-4.407e-07,-1.317e-07,0.5844,-1.743,-1.317e-07,-2.167e-06,0.0006223,0.001211,1.743,0.001522,8.815e-07,-0.5844,2.167e-06,-2.167e-06,1.748,-1.748,0.7583,0.0001848,-1.748,-0.1525,-0.00542,0.0001848,-0.002732,0.008182,-0.0001848,0.001593,-0.0001848,0.002732,-0.008182,-0.001593,0.001211,-0.001211,0.003429,-0.003429,0.002732,-0.005864,-0.002732,0.01092,-0.01092,0.01174,0.008182,-0.00833,0.00833,-0.00751,0.005864,-0.005041,-3.5e-06,-3.5e-06,1.875e-06,-4.407e-07,-0.01174,0.00751,0.005041,3.5e-06,-1.875e-06,0.0007122,0,0,0,0,0,0,0,0,0,0,0,0,0,0,0,0,0,0,0,0,0,0,0,0,0,0,0,0,0,0,0,0,0,0,0,0,0,0,0,0,0,0,0,0,0,0,0,0,0
standard chemical potential,-59.04,-59.08,29.6,-29.48,-0.004001,-29.46,0.145,-0.2723,0.4567,1.251e+05,97.59,1.249e+05,60.39,22.5,7.629,-88.29,-71.75,-85.18,-70.19,-23.81,-31.4,-29.6,-55.24,-31.39,-59.02,0,0,0,0,0,0,-9.572e-05,0,-0.8567,0,0,0,0,0,0,0,0,0,0,0,0,0,0,0,0.0008865,-0.001773,0.001773,-1.639e-07,-1.639e-07,1.79e-09,0.06814,0.2786,-0.004753,-1.194,-0.0003458,1.639e-07,0.0006212,-0.004753,1.639e-07,-1.79e-09,-0.2092,-0.2786,0.004753,1.194,0.0006916,-0.0006212,1.79e-09,-1.79e-09,0.001445,-0.001445,0.2447,-0.1151,-0.001445,-0.04921,0.3587,-0.1151,-0.1806,-0.5414,0.1151,-0.5355,0.1151,0.1806,0.5414,0.5355,-0.2786,0.2786,-0.5999,0.5999,0.1806,-1.268,-0.1806,0.6672,-0.6672,0.6661,-0.5414,0.6044,-0.6044,0.6034,1.268,-1.268,-0.0008803,-0.0008803,0.0004715,-0.0003458,-0.6661,-0.6034,1.268,0.0008803,-0.0004715,-0.0008865,0,0,0,0,0,0,0,0,0,0,0,0,0,0,0,0,0,0,0,0,0,0,0,0,0,0,0,0,0,0,0,0,0,0,0,0,0,0,0,0,0,0,0,0,0,0,0,0,0
standard chemical potential,-75.69,-75.74,61.76,-13.98,-0.008346,0.5337,62.3,55.39,54.63,97.59,264.8,-97.59,187.2,108.2,77.28,-107.9,-77.05,-108.2,-77.2,15.5,-61.68,-61.75,-46.23,-61.66,-75.66,0,0,0,0,0,0,9.882e-05,0,-1.784,0,0,0,0,0,0,0,0,0,0,0,0,0,0,0,0.001136,-0.002273,0.002273,-2.101e-07,-2.101e-07,2.169e-06,0.1419,0.5796,-1.752,-2.492,-0.0007214,2.101e-07,0.5854,-1.752,2.101e-07,-2.169e-06,-0.4356,-0.5796,1.752,2.492,0.001443,-0.5854,2.169e-06,-2.169e-06,1.75,-1.75,-0.2526,0.4775,-1.75,0.0508,0.7414,0.4775,-0.3366,-1.119,-0.4775,-1.115,-0.4775,0.3366,1.119,1.115,-0.5796,0.5796,-1.247,1.247,0.3366,-2.492,-0.3366,1.244,-1.244,1.243,-1.119,1.25,-1.25,1.249,2.492,-2.49,-0.001729,-0.001729,0.0009261,-0.0007214,-1.243,-1.249,2.49,0.001729,-0.0009261,-0.001136,0,0,0,0,0,0,0,0,0,0,0,0,0,0,0,0,0,0,0,0,0,0,0,0,0,0,0,0,0,0,0,0,0,0,0,0,0,0,0,0,0,0,0,0,0,0,0,0,0
standard chemical potential,59.04,59.08,-29.6,29.48,0.004001,29.46,-0.145,0.2723,-0.4567,1.249e+05,-97.59,1.251e+05,-60.39,-22.5,-7.629,88.29,71.75,85.18,70.19,23.81,31.4,29.6,55.24,31.39,59.02,0,0,0,0,0,0,9.572e-05,0,0.8567,0,0,0,0,0,0,0,0,0,0,0,0,0,0,0,-0.0008865,0.001773,-0.001773,1.639e-07,1.639e-07,-1.79e-09,-0.06814,-0.2786,0.004753,1.194,0.0003458,-1.639e-07,-0.0006212,0.004753,-1.639e-07,1.79e-09,0.2092,0.2786,-0.004753,-1.194,-0.0006916,0.0006212,-1.79e-09,1.79e-09,-0.001445,0.001445,-0.2447,0.1151,0.001445,0.04921,-0.3587,0.1151,0.1806,0.5414,-0.1151,0.5355,-0.1151,-0.1806,-0.5414,-0.5355,0.2786,-0.2786,0.5999,-0.5999,-0.1806,1.268,0.1806,-0.6672,0.6672,-0.6661,0.5414,-0.6044,0.6044,-0.6034,-1.268,1.268,0.0008803,0.0008803,-0.0004715,0.0003458,0.6661,0.6034,-1.268,-0.0008803,0.0004715,0.0008865,0,0,0,0,0,0,0,0,0,0,0,0,0,0,0,0,0,0,0,0,0,0,0,0,0,0,0,0,0,0,0,0,0,0,0,0,0,0,0,0,0,0,0,0,0,0,0,0,0
standard chemical potential,63.5,63.55,-8.063,55.48,0.00109,69.94,61.88,54.82,54.62,60.39,187.2,-60.39,221.1,205.5,163.2,45.16,53.58,-22.25,19.88,112.6,-50.52,8.061,62.02,-50.5,63.48,0,0,0,0,0,0,2.693e-05,0,2.911,0,0,0,0,0,0,0,0,0,0,0,0,0,0,0,-0.0009535,0.001907,-0.001907,1.763e-07,1.763e-07,2.162e-06,-0.2315,0.7934,-1.739,0.3253,9.418e-05,-1.763e-07,0.5832,-1.739,-1.763e-07,-2.162e-06,0.7109,-0.7934,1.739,-0.3253,-0.0001884,-0.5832,2.162e-06,-2.162e-06,1.744,-1.744,-0.06882,0.3896,-1.744,0.01384,1.007,0.3896,-0.09159,-1.519,-0.3896,1.819,-0.3896,0.09159,1.519,-1.819,-0.7934,0.7934,-1.706,1.706,0.09159,-2.043,-0.09159,0.3397,-0.3397,0.3405,-1.519,1.699,-1.699,1.7,2.043,-2.04,-0.001416,-0.001416,0.0007586,9.418e-05,-0.3405,-1.7,2.04,0.001416,-0.0007586,0.0009535,0,0,0,0,0,0,0,0,0,0,0,0,0,0,0,0,0,0,0,0,0,0,0,0,0,0,0,0,0,0,0,0,0,0,0,0,0,0,0,0,0,0,0,0,0,0,0,0,0
standard chemical potential,201.8,202,-77.45,124.5,0.01047,138.9,61.46,54.26,54.62,22.5,108.2,-22.5,205.5,304.7,250.8,201.1,186.7,65.34,118.8,211.5,-39.17,77.44,172.3,-39.15,201.8,0,0,0,0,0,0,-4.633e-05,0,2.242,0,0,0,0,0,0,0,0,0,0,0,0,0,0,0,-0.003031,0.006062,-0.006062,5.603e-07,5.603e-07,2.156e-06,-0.1783,-0.7316,-1.726,3.125,0.0009047,-5.603e-07,0.581,-1.726,-5.603e-07,-2.156e-06,0.5475,0.7316,1.726,-3.125,-0.001809,-0.581,2.156e-06,-2.156e-06,1.739,-1.739,0.1184,0.3002,-1.739,-0.02382,1.277,0.3002,0.1581,-1.927,-0.3002,1.401,-0.3002,-0.1581,1.927,-1.401,0.7316,-0.7316,-2.174,2.174,-0.1581,-1.585,0.1581,-0.5822,0.5822,-0.5794,-1.927,2.157,-2.157,2.159,1.585,-1.581,-0.001098,-0.001098,0.0005881,0.0009047,0.5794,-2.159,1.581,0.001098,-0.0005881,0.003031,0,0,0,0,0,0,0,0,0,0,0,0,0,0,0,0,0,0,0,0,0,0,0,0,0,0,0,0,0,0,0,0,0,0,0,0,0,0,0,0,0,0,0,0,0,0,0,0,0
standard chemical potential,183.7,183.9,-68.39,115.5,0.009242,129.8,61.45,54.13,54.7,7.629,77.28,-7.629,163.2,250.8,285.4,262.6,239.1,99.83,157.8,250.6,-34.72,68.38,215.8,-34.71,183.6,0,0,0,0,0,0,-7.513e-05,0,1.98,0,0,0,0,0,0,0,0,0,0,0,0,0,0,0,-0.002759,0.005518,-0.005518,5.1e-07,5.1e-07,2.154e-06,-0.1575,-0.6461,-1.726,2.759,0.0007989,-5.1e-07,0.5807,-1.726,-5.1e-07,-2.154e-06,0.4836,0.6461,1.726,-2.759,-0.001598,-0.5807,2.154e-06,-2.154e-06,1.738,-1.738,0.192,0.2652,-1.738,-0.03862,1.384,0.2652,0.2562,-2.089,-0.2652,1.238,-0.2652,-0.2562,2.089,-1.238,0.6461,-0.6461,1.396,-1.396,-0.2562,-1.407,0.2562,-0.9446,0.9446,-0.941,-2.089,2.338,-2.338,2.341,1.407,-1.402,-0.0009735,-0.0009735,0.0005214,0.0007989,0.941,-2.341,1.402,0.0009735,-0.0005214,0.002759,0,0,0,0,0,0,0,0,0,0,0,0,0,0,0,0,0,0,0,0,0,0,0,0,0,0,0,0,0,0,0,0,0,0,0,0,0,0,0,0,0,0,0,0,0,0,0,0,0
standard chemical potential,290.2,290.4,-121.8,168.6,0.01646,183,61.18,54.61,53.87,-88.29,-107.9,88.29,45.16,201.1,262.6,449,386.7,262.6,293.5,293.5,31,121.8,324.5,30.99,290.1,0,0,0,0,0,0,9.763e-05,0,3.526,0,0,0,0,0,0,0,0,0,0,0,0,0,0,0,-0.004358,0.008717,-0.008717,8.056e-07,8.056e-07,2.15e-06,-0.2804,-1.149,-1.717,4.914,0.001423,-8.056e-07,0.5795,-1.717,-8.056e-07,-2.15e-06,0.8611,1.149,1.717,-4.914,-0.002845,-0.5795,2.15e-06,-2.15e-06,1.735,-1.735,-0.2495,0.4729,-1.735,0.05019,0.7362,0.4729,-0.3333,-1.111,-0.4729,2.204,-0.4729,0.3333,1.111,-2.204,1.149,-1.149,2.478,-2.478,0.3333,1.248,-0.3333,-2.515,2.515,-2.509,-1.111,1.247,-1.247,1.252,-1.248,1.251,0.000869,0.000869,-0.0004655,0.001423,2.509,-1.252,-1.251,-0.000869,0.0004655,0.004358,0,0,0,0,0,0,0,0,0,0,0,0,0,0,0,0,0,0,0,0,0,0,0,0,0,0,0,0,0,0,0,0,0,0,0,0,0,0,0,0,0,0,0,0,0,0,0,0,0
standard chemical potential,254.6,254.8,-103.9,150.8,0.01405,165.2,61.26,54.45,54.14,-71.75,-77.05,71.75,53.58,186.7,239.1,386.7,399.4,239.2,279.1,279.1,40.02,103.9,319.2,40,254.5,0,0,0,0,0,0,4.003e-05,0,3.01,0,0,0,0,0,0,0,0,0,0,0,0,0,0,0,-0.003823,0.007648,-0.007648,7.068e-07,7.068e-07,2.151e-06,-0.2394,-0.9806,-1.72,4.194,0.001214,-7.068e-07,0.5798,-1.72,-7.068e-07,-2.151e-06,0.735,0.9806,1.72,-4.194,-0.002428,-0.5798,2.151e-06,-2.151e-06,1.736,-1.736,-0.1023,0.4036,-1.736,0.02058,0.9519,0.4036,-0.1368,-1.437,-0.4036,1.881,-0.4036,0.1368,1.437,-1.881,0.9806,-0.9806,2.115,-2.115,0.1368,1.613,-0.1368,0.5123,-0.5123,-3.237,-1.437,1.611,-1.611,1.615,-1.613,1.616,0.001122,0.001122,-0.0006009,0.001214,3.237,-1.615,-1.616,-0.001122,0.0006009,0.003823,0,0,0,0,0,0,0,0,0,0,0,0,0,0,0,0,0,0,0,0,0,0,0,0,0,0,0,0,0,0,0,0,0,0,0,0,0,0,0,0,0,0,0,0,0,0,0,0,0
standard chemical potential,183.8,183.9,-68.38,115.5,0.009241,130,61.59,54.25,54.82,-85.18,-108.2,85.18,-22.25,65.34,99.83,262.6,239.2,285.7,250.7,157.8,57.99,68.37,215.9,57.97,183.7,0,0,0,0,0,0,-7.516e-05,0,1.982,0,0,0,0,0,0,0,0,0,0,0,0,0,0,0,-0.00276,0.005521,-0.005521,5.102e-07,5.102e-07,2.159e-06,-0.1576,-0.6453,-1.729,2.759,0.0007988,-5.102e-07,0.582,-1.729,-5.102e-07,-2.159e-06,0.484,0.6453,1.729,-2.759,-0.001598,-0.582,2.159e-06,-2.159e-06,1.742,-1.742,0.1921,0.266,-1.742,-0.03864,1.386,0.266,0.256,-2.093,-0.266,1.239,-0.266,-0.256,2.093,-1.239,0.6453,-0.6453,1.391,-1.391,-0.256,2.34,0.256,-0.9436,0.9436,-0.94,-2.093,-1.41,1.41,-1.406,-2.34,2.341,0.001626,0.001626,-0.0008707,0.0007988,0.94,1.406,-2.341,-0.001626,0.0008707,0.00276,0,0,0,0,0,0,0,0,0,0,0,0,0,0,0,0,0,0,0,0,0,0,0,0,0,0,0,0,0,0,0,0,0,0,0,0,0,0,0,0,0,0,0,0,0,0,0,0,0
standard chemical potential,201.4,201.6,-77.24,124.3,0.01044,138.7,61.47,54.26,54.62,-70.19,-77.2,70.19,19.88,118.8,157.8,293.5,279.1,250.7,304.3,211.3,53.51,77.23,264.9,53.49,201.3,0,0,0,0,0,0,-4.635e-05,0,2.238,0,0,0,0,0,0,0,0,0,0,0,0,0,0,0,-0.003024,0.00605,-0.00605,5.591e-07,5.591e-07,2.156e-06,-0.178,-0.7289,-1.726,3.116,0.0009023,-5.591e-07,0.581,-1.726,-5.591e-07,-2.156e-06,0.5465,0.7289,1.726,-3.116,-0.001805,-0.581,2.156e-06,-2.156e-06,1.739,-1.739,0.1185,0.3002,-1.739,-0.02382,1.277,0.3002,0.1578,-1.928,-0.3002,1.399,-0.3002,-0.1578,1.928,-1.399,0.7289,-0.7289,1.572,-1.572,-0.1578,2.159,0.1578,-0.5796,0.5796,-0.5754,-1.928,2.16,-2.16,-1.59,-2.159,2.16,0.0015,0.0015,-0.0008035,0.0009023,0.5754,1.59,-2.16,-0.0015,0.0008035,0.003024,0,0,0,0,0,0,0,0,0,0,0,0,0,0,0,0,0,0,0,0,0,0,0,0,0,0,0,0,0,0,0,0,0,0,0,0,0,0,0,0,0,0,0,0,0,0,0,0,0
standard chemical potential,201.4,201.5,-77.25,124.3,0.01044,138.7,61.4,54.2,54.56,-23.81,15.5,23.81,112.6,211.5,250.6,293.5,279.1,157.8,211.3,304.2,-39.31,77.24,264.8,-39.29,201.3,0,0,0,0,0,0,-4.632e-05,0,2.237,0,0,0,0,0,0,0,0,0,0,0,0,0,0,0,-0.003024,0.006049,-0.006049,5.59e-07,5.59e-07,2.153e-06,-0.1779,-0.7293,-1.724,3.117,0.0009024,-5.59e-07,0.5804,-1.724,-5.59e-07,-2.153e-06,0.5463,0.7293,1.724,-3.117,-0.001805,-0.5804,2.153e-06,-2.153e-06,1.737,-1.737,0.1184,0.2998,-1.737,-0.02381,1.276,0.2998,0.1579,-1.926,-0.2998,1.398,-0.2998,-0.1579,1.926,-1.398,0.7293,-0.7293,1.575,-1.575,-0.1579,2.163,0.1579,-0.5799,0.5799,-0.5758,-1.926,2.157,-2.157,2.16,-2.163,-1.587,-0.001102,-0.001102,0.0005902,0.0009024,0.5758,-2.16,1.587,0.001102,-0.0005902,0.003024,0,0,0,0,0,0,0,0,0,0,0,0,0,0,0,0,0,0,0,0,0,0,0,0,0,0,0,0,0,0,0,0,0,0,0,0,0,0,0,0,0,0,0,0,0,0,0,0,0
standard chemical potential,17.71,17.72,-8.875,8.848,0.001199,8.847,-0.02962,0.09406,-0.1249,-31.4,-61.68,31.4,-50.52,-39.17,-34.72,31,40.02,57.99,53.51,-39.31,183.8,8.874,49.05,183.7,17.7,0,0,0,0,0,0,2.875e-05,0,0.2572,0,0,0,0,0,0,0,0,0,0,0,0,0,0,0,-0.0002659,0.000532,-0.000532,4.916e-08,4.916e-08,-5.287e-11,-0.02046,-0.08342,0.001036,0.3581,0.0001037,-4.916e-08,-5.578e-05,0.001036,-4.916e-08,5.287e-11,0.06281,0.08342,-0.001036,-0.3581,-0.0002073,5.578e-05,-5.287e-11,5.287e-11,-4.305e-05,4.305e-05,-0.07348,0.03465,4.305e-05,0.01478,-0.1075,0.03465,-0.09817,0.1622,-0.03465,0.1608,-0.03465,0.09817,-0.1622,-0.1608,0.08342,-0.08342,0.1791,-0.1791,0.09817,-0.1848,-0.09817,0.3638,-0.3638,0.3644,0.1622,-0.1806,0.1806,-0.1798,0.1848,3.564,-3.5,-3.5,-0.00276,0.0001037,-0.3644,0.1798,-3.564,3.5,0.00276,0.0002659,0,0,0,0,0,0,0,0,0,0,0,0,0,0,0,0,0,0,0,0,0,0,0,0,0,0,0,0,0,0,0,0,0,0,0,0,0,0,0,0,0,0,0,0,0,0,0,0,0
standard chemical potential,148.4,148.5,8.324e+04,74.1,8.331e+04,74.05,-0.3914,-0.4734,-0.03773,-29.6,-61.75,29.6,8.061,77.44,68.38,121.8,103.9,68.37,77.23,77.24,8.874,8.345e+04,86.12,8.871,148.4,0,0,0,0,0,0,-5.721e-05,0,-0.5227,0,0,0,0,0,0,0,0,0,0,0,0,0,0,0,-0.002229,0.004458,-0.004458,4.12e-07,4.12e-07,-5.438e-09,0.04157,0.1702,0.0127,3.003,-1.946,-4.12e-07,-0.001815,0.0127,-4.12e-07,5.438e-09,-0.1276,-0.1702,-0.0127,-3.003,3.891,0.001815,-5.438e-09,5.438e-09,-0.00439,0.00439,0.1462,-0.06988,0.00439,-0.02941,0.2111,-0.06988,0.195,-0.3186,0.06988,-0.3267,0.06988,-0.195,0.3186,0.3267,-0.1702,0.1702,-0.3655,0.3655,-0.195,0.3574,0.195,-0.72,0.72,-0.7184,-0.3186,0.3574,-0.3574,0.3586,-0.3574,0.3582,0.0002488,0.0002488,-0.0001332,-1.946,0.7184,-0.3586,-0.3582,-0.0002488,0.0001332,0.002229,0,0,0,0,0,0,0,0,0,0,0,0,0,0,0,0,0,0,0,0,0,0,0,0,0,0,0,0,0,0,0,0,0,0,0,0,0,0,0,0,0,0,0,0,0,0,0,0,0
standard chemical potential,219.1,219.3,-86.13,133.1,0.01164,147.5,61.37,54.3,54.43,-55.24,-46.23,55.24,62.02,172.3,215.8,324.5,319.2,215.9,264.9,264.8,49.05,86.12,313.9,49.03,219,0,0,0,0,0,0,-1.755e-05,0,2.494,0,0,0,0,0,0,0,0,0,0,0,0,0,0,0,-0.00329,0.006581,-0.006581,6.082e-07,6.082e-07,2.153e-06,-0.1984,-0.8128,-1.723,3.475,0.001006,-6.082e-07,0.5803,-1.723,-6.082e-07,-2.153e-06,0.6092,0.8128,1.723,-3.475,-0.002012,-0.5803,2.153e-06,-2.153e-06,1.737,-1.737,0.04485,0.3345,-1.737,-0.009021,1.168,0.3345,0.05962,-1.763,-0.3345,1.559,-0.3345,-0.05962,1.763,-1.559,0.8128,-0.8128,1.754,-1.754,-0.05962,1.978,0.05962,-0.2158,0.2158,-0.211,-1.763,1.976,-1.976,1.98,-1.978,1.98,0.001375,0.001375,-0.0007365,0.001006,0.211,-1.98,-1.98,-0.001375,0.0007365,0.00329,0,0,0,0,0,0,0,0,0,0,0,0,0,0,0,0,0,0,0,0,0,0,0,0,0,0,0,0,0,0,0,0,0,0,0,0,0,0,0,0,0,0,0,0,0,0,0,0,0
standard chemical potential,17.7,17.72,-8.872,8.845,0.001199,8.844,-0.02961,0.09403,-0.1248,-31.39,-61.66,31.39,-50.5,-39.15,-34.71,30.99,40,57.97,53.49,-39.29,183.7,8.871,49.03,276.7,17.7,0,0,0,0,0,0,2.874e-05,0,0.2571,0,0,0,0,0,0,0,0,0,0,0,0,0,0,0,-0.0002658,0.0005318,-0.0005318,4.915e-08,4.915e-08,-5.285e-11,-0.02045,-0.08339,0.001035,0.3579,0.0001036,-4.915e-08,-5.576e-05,0.001035,-4.915e-08,5.285e-11,0.06279,0.08339,-0.001035,-0.3579,-0.0002073,5.576e-05,-5.285e-11,5.285e-11,-4.303e-05,4.303e-05,-0.07345,0.03464,4.303e-05,0.01477,-0.1074,0.03464,-0.09813,0.1622,-0.03464,0.1607,-0.03464,0.09813,-0.1622,-0.1607,0.08339,-0.08339,0.1791,-0.1791,0.09813,-0.1847,-0.09813,0.3637,-0.3637,0.3643,0.1622,-0.1806,0.1806,-0.1798,0.1847,3.563,-3.498,-3.498,3.751,0.0001036,-0.3643,0.1798,-3.563,3.498,-3.751,0.0002658,0,0,0,0,0,0,0,0,0,0,0,0,0,0,0,0,0,0,0,0,0,0,0,0,0,0,0,0,0,0,0,0,0,0,0,0,0,0,0,0,0,0,0,0,0,0,0,0,0
standard chemical potential,484,391.3,-148.4,242.9,0.02005,242.7,94.3,46.54,47.41,-59.02,-75.66,59.02,63.48,201.8,183.6,290.1,254.5,183.7,201.3,201.3,17.7,148.4,219,17.7,576.8,0,0,0,0,0,0,-0.0001141,0,-1.047,0,0,0,0,0,0,0,0,0,0,0,0,0,0,0,3.747,-3.739,3.739,-0.00023,-0.00023,-1.744e-08,0.08326,0.3405,-3.464,5.987,0.001733,0.00023,-0.005845,-3.464,0.00023,1.744e-08,-0.2557,-0.3405,3.464,-5.987,-0.003467,0.005845,-1.744e-08,1.744e-08,-0.01274,0.01274,0.2917,-0.1401,0.01274,-0.05868,0.419,-0.1401,0.389,-0.6324,0.1401,-0.6543,0.1401,-0.389,0.6324,0.6543,-0.3405,0.3405,-0.7306,0.7306,-0.389,0.7123,0.389,-1.436,1.436,-1.432,-0.6324,0.7103,-0.7103,0.7133,-0.7123,0.7148,0.0004963,0.0004963,-0.0002658,0.001733,1.432,-0.7133,-0.7148,-0.0004963,0.0002658,-3.747,0,0,0,0,0,0,0,0,0,0,0,0,0,0,0,0,0,0,0,0,0,0,0,0,0,0,0,0,0,0,0,0,0,0,0,0,0,0,0,0,0,0,0,0,0,0,0,0,0
catalytic rate constant geometric mean,0,0,0,0,0,0,0,0,0,0,0,0,0,0,0,0,0,0,0,0,0,0,0,0,0,7.069,0,0,0,0,0,0,0,0,0,0,0,0,0,0,0,0,0,0,0,0,0,0,0,0,0,0,0,0,0,0,0,0,0,0,0,0,0,0,0,0,0,0,0,0,0,0,0,0,0,0,0,0,0,0,0,0,0,0,0,0,0,0,0,0,0,0,0,0,0,0,0,0,0,0,0,0,0,0,0,0,0,0,0,0,0,0,0,0,0,0,0,0,0,0,0,0,0,0,0,0,0,0,0,0,0,0,0,0,0,0,0,0,0,0,0,0,0,0,0,0,0,0,0,0,0,0,0,0,0,0,0,0,0,0,0,0,0,0
catalytic rate constant geometric mean,0,0,0,0,0,0,0,0,0,0,0,0,0,0,0,0,0,0,0,0,0,0,0,0,0,0,7.069,0,0,0,0,0,0,0,0,0,0,0,0,0,0,0,0,0,0,0,0,0,0,0,0,0,0,0,0,0,0,0,0,0,0,0,0,0,0,0,0,0,0,0,0,0,0,0,0,0,0,0,0,0,0,0,0,0,0,0,0,0,0,0,0,0,0,0,0,0,0,0,0,0,0,0,0,0,0,0,0,0,0,0,0,0,0,0,0,0,0,0,0,0,0,0,0,0,0,0,0,0,0,0,0,0,0,0,0,0,0,0,0,0,0,0,0,0,0,0,0,0,0,0,0,0,0,0,0,0,0,0,0,0,0,0,0,0
catalytic rate constant geometric mean,0,0,0,0,0,0,0,0,0,0,0,0,0,0,0,0,0,0,0,0,0,0,0,0,0,0,0,7.069,0,0,0,0,0,0,0,0,0,0,0,0,0,0,0,0,0,0,0,0,0,0,0,0,0,0,0,0,0,0,0,0,0,0,0,0,0,0,0,0,0,0,0,0,0,0,0,0,0,0,0,0,0,0,0,0,0,0,0,0,0,0,0,0,0,0,0,0,0,0,0,0,0,0,0,0,0,0,0,0,0,0,0,0,0,0,0,0,0,0,0,0,0,0,0,0,0,0,0,0,0,0,0,0,0,0,0,0,0,0,0,0,0,0,0,0,0,0,0,0,0,0,0,0,0,0,0,0,0,0,0,0,0,0,0,0
catalytic rate constant geometric mean,0,0,0,0,0,0,0,0,0,0,0,0,0,0,0,0,0,0,0,0,0,0,0,0,0,0,0,0,7.069,0,0,0,0,0,0,0,0,0,0,0,0,0,0,0,0,0,0,0,0,0,0,0,0,0,0,0,0,0,0,0,0,0,0,0,0,0,0,0,0,0,0,0,0,0,0,0,0,0,0,0,0,0,0,0,0,0,0,0,0,0,0,0,0,0,0,0,0,0,0,0,0,0,0,0,0,0,0,0,0,0,0,0,0,0,0,0,0,0,0,0,0,0,0,0,0,0,0,0,0,0,0,0,0,0,0,0,0,0,0,0,0,0,0,0,0,0,0,0,0,0,0,0,0,0,0,0,0,0,0,0,0,0,0,0
catalytic rate constant geometric mean,0,0,0,0,0,0,0,0,0,0,0,0,0,0,0,0,0,0,0,0,0,0,0,0,0,0,0,0,0,7.069,0,0,0,0,0,0,0,0,0,0,0,0,0,0,0,0,0,0,0,0,0,0,0,0,0,0,0,0,0,0,0,0,0,0,0,0,0,0,0,0,0,0,0,0,0,0,0,0,0,0,0,0,0,0,0,0,0,0,0,0,0,0,0,0,0,0,0,0,0,0,0,0,0,0,0,0,0,0,0,0,0,0,0,0,0,0,0,0,0,0,0,0,0,0,0,0,0,0,0,0,0,0,0,0,0,0,0,0,0,0,0,0,0,0,0,0,0,0,0,0,0,0,0,0,0,0,0,0,0,0,0,0,0,0
catalytic rate constant geometric mean,0,0,0,0,0,0,0,0,0,0,0,0,0,0,0,0,0,0,0,0,0,0,0,0,0,0,0,0,0,0,7.069,0,0,0,0,0,0,0,0,0,0,0,0,0,0,0,0,0,0,0,0,0,0,0,0,0,0,0,0,0,0,0,0,0,0,0,0,0,0,0,0,0,0,0,0,0,0,0,0,0,0,0,0,0,0,0,0,0,0,0,0,0,0,0,0,0,0,0,0,0,0,0,0,0,0,0,0,0,0,0,0,0,0,0,0,0,0,0,0,0,0,0,0,0,0,0,0,0,0,0,0,0,0,0,0,0,0,0,0,0,0,0,0,0,0,0,0,0,0,0,0,0,0,0,0,0,0,0,0,0,0,0,0,0
catalytic rate constant geometric mean,-0.0001142,-0.0001143,5.722e-05,-5.705e-05,-7.733e-09,-5.704e-05,1.919e-07,0.0002969,-0.0002967,-9.572e-05,9.882e-05,9.572e-05,2.693e-05,-4.633e-05,-7.513e-05,9.763e-05,4.003e-05,-7.516e-05,-4.635e-05,-4.632e-05,2.875e-05,-5.721e-05,-1.755e-05,2.874e-05,-0.0001141,0,0,0,0,0,0,0.0001257,0,-1.655e-06,0,0,0,0,0,0,0,0,0,0,0,0,0,0,0,1.715e-09,-3.43e-09,3.43e-09,-3.17e-13,-3.17e-13,3.724e-16,1.316e-07,5.389e-07,-6.703e-09,-2.309e-06,-6.684e-10,3.17e-13,3.681e-10,-6.703e-09,3.17e-13,-3.724e-16,-4.042e-07,-5.389e-07,6.703e-09,2.309e-06,1.337e-09,-3.681e-10,3.724e-16,-3.724e-16,3.03e-10,-3.03e-10,7.665e-06,-2.221e-07,-3.03e-10,-1.542e-06,6.89e-07,-2.221e-07,6.281e-07,-1.04e-06,2.221e-07,-1.034e-06,2.221e-07,-6.281e-07,1.04e-06,1.034e-06,-5.389e-07,5.389e-07,-1.162e-06,1.162e-06,-6.281e-07,1.162e-06,6.281e-07,-2.323e-06,2.323e-06,-2.323e-06,-1.04e-06,1.162e-06,-1.162e-06,1.162e-06,-1.162e-06,1.161e-06,8.059e-10,8.059e-10,-4.317e-10,-6.684e-10,2.323e-06,-1.162e-06,-1.161e-06,-8.059e-10,4.317e-10,-1.715e-09,0,0,0,0,0,0,0,0,0,0,0,0,0,0,0,0,0,0,0,0,0,0,0,0,0,0,0,0,0,0,0,0,0,0,0,0,0,0,0,0,0,0,0,0,0,0,0,0,0
catalytic rate constant geometric mean,0,0,0,0,0,0,0,0,0,0,0,0,0,0,0,0,0,0,0,0,0,0,0,0,0,0,0,0,0,0,0,0,7.069,0,0,0,0,0,0,0,0,0,0,0,0,0,0,0,0,0,0,0,0,0,0,0,0,0,0,0,0,0,0,0,0,0,0,0,0,0,0,0,0,0,0,0,0,0,0,0,0,0,0,0,0,0,0,0,0,0,0,0,0,0,0,0,0,0,0,0,0,0,0,0,0,0,0,0,0,0,0,0,0,0,0,0,0,0,0,0,0,0,0,0,0,0,0,0,0,0,0,0,0,0,0,0,0,0,0,0,0,0,0,0,0,0,0,0,0,0,0,0,0,0,0,0,0,0,0,0,0,0,0,0
catalytic rate constant geometric mean,-1.047,-1.048,0.5228,-0.5252,-7.065e-05,-0.5263,-0.003526,-0.01006,0.002548,-0.8567,-1.784,0.8567,2.911,2.242,1.98,3.526,3.01,1.982,2.238,2.237,0.2572,-0.5227,2.494,0.2571,-1.047,0,0,0,0,0,0,-1.655e-06,0,2.457,0,0,0,0,0,0,0,0,0,0,0,0,0,0,0,1.572e-05,-3.145e-05,3.145e-05,-2.907e-09,-2.907e-09,-1.81e-10,0.1419,0.004914,8.716e-05,-0.02109,-6.106e-06,2.907e-09,-4.638e-05,8.716e-05,2.907e-09,1.81e-10,-0.4358,-0.004914,-8.716e-05,0.02109,1.221e-05,4.638e-05,-1.81e-10,1.81e-10,-0.000146,0.000146,0.00423,-0.002025,0.000146,-0.0008508,0.006093,-0.002025,0.005641,-0.009198,0.002025,-1.115,0.002025,-0.005641,0.009198,1.115,-0.004914,0.004914,-0.01055,0.01055,-0.005641,0.01036,0.005641,-0.02083,0.02083,-0.02078,-0.009198,0.01032,-0.01032,0.01035,-0.01036,0.01038,7.21e-06,7.21e-06,-3.862e-06,-6.106e-06,0.02078,-0.01035,-0.01038,-7.21e-06,3.862e-06,-1.572e-05,0,0,0,0,0,0,0,0,0,0,0,0,0,0,0,0,0,0,0,0,0,0,0,0,0,0,0,0,0,0,0,0,0,0,0,0,0,0,0,0,0,0,0,0,0,0,0,0,0
catalytic rate constant geometric mean,0,0,0,0,0,0,0,0,0,0,0,0,0,0,0,0,0,0,0,0,0,0,0,0,0,0,0,0,0,0,0,0,0,0,7.069,0,0,0,0,0,0,0,0,0,0,0,0,0,0,0,0,0,0,0,0,0,0,0,0,0,0,0,0,0,0,0,0,0,0,0,0,0,0,0,0,0,0,0,0,0,0,0,0,0,0,0,0,0,0,0,0,0,0,0,0,0,0,0,0,0,0,0,0,0,0,0,0,0,0,0,0,0,0,0,0,0,0,0,0,0,0,0,0,0,0,0,0,0,0,0,0,0,0,0,0,0,0,0,0,0,0,0,0,0,0,0,0,0,0,0,0,0,0,0,0,0,0,0,0,0,0,0,0,0
catalytic rate constant geometric mean,0,0,0,0,0,0,0,0,0,0,0,0,0,0,0,0,0,0,0,0,0,0,0,0,0,0,0,0,0,0,0,0,0,0,0,7.069,0,0,0,0,0,0,0,0,0,0,0,0,0,0,0,0,0,0,0,0,0,0,0,0,0,0,0,0,0,0,0,0,0,0,0,0,0,0,0,0,0,0,0,0,0,0,0,0,0,0,0,0,0,0,0,0,0,0,0,0,0,0,0,0,0,0,0,0,0,0,0,0,0,0,0,0,0,0,0,0,0,0,0,0,0,0,0,0,0,0,0,0,0,0,0,0,0,0,0,0,0,0,0,0,0,0,0,0,0,0,0,0,0,0,0,0,0,0,0,0,0,0,0,0,0,0,0,0
catalytic rate constant geometric mean,0,0,0,0,0,0,0,0,0,0,0,0,0,0,0,0,0,0,0,0,0,0,0,0,0,0,0,0,0,0,0,0,0,0,0,0,7.069,0,0,0,0,0,0,0,0,0,0,0,0,0,0,0,0,0,0,0,0,0,0,0,0,0,0,0,0,0,0,0,0,0,0,0,0,0,0,0,0,0,0,0,0,0,0,0,0,0,0,0,0,0,0,0,0,0,0,0,0,0,0,0,0,0,0,0,0,0,0,0,0,0,0,0,0,0,0,0,0,0,0,0,0,0,0,0,0,0,0,0,0,0,0,0,0,0,0,0,0,0,0,0,0,0,0,0,0,0,0,0,0,0,0,0,0,0,0,0,0,0,0,0,0,0,0,0
catalytic rate constant geometric mean,0,0,0,0,0,0,0,0,0,0,0,0,0,0,0,0,0,0,0,0,0,0,0,0,0,0,0,0,0,0,0,0,0,0,0,0,0,7.069,0,0,0,0,0,0,0,0,0,0,0,0,0,0,0,0,0,0,0,0,0,0,0,0,0,0,0,0,0,0,0,0,0,0,0,0,0,0,0,0,0,0,0,0,0,0,0,0,0,0,0,0,0,0,0,0,0,0,0,0,0,0,0,0,0,0,0,0,0,0,0,0,0,0,0,0,0,0,0,0,0,0,0,0,0,0,0,0,0,0,0,0,0,0,0,0,0,0,0,0,0,0,0,0,0,0,0,0,0,0,0,0,0,0,0,0,0,0,0,0,0,0,0,0,0,0
catalytic rate constant geometric mean,0,0,0,0,0,0,0,0,0,0,0,0,0,0,0,0,0,0,0,0,0,0,0,0,0,0,0,0,0,0,0,0,0,0,0,0,0,0,7.069,0,0,0,0,0,0,0,0,0,0,0,0,0,0,0,0,0,0,0,0,0,0,0,0,0,0,0,0,0,0,0,0,0,0,0,0,0,0,0,0,0,0,0,0,0,0,0,0,0,0,0,0,0,0,0,0,0,0,0,0,0,0,0,0,0,0,0,0,0,0,0,0,0,0,0,0,0,0,0,0,0,0,0,0,0,0,0,0,0,0,0,0,0,0,0,0,0,0,0,0,0,0,0,0,0,0,0,0,0,0,0,0,0,0,0,0,0,0,0,0,0,0,0,0,0
catalytic rate constant geometric mean,0,0,0,0,0,0,0,0,0,0,0,0,0,0,0,0,0,0,0,0,0,0,0,0,0,0,0,0,0,0,0,0,0,0,0,0,0,0,0,7.069,0,0,0,0,0,0,0,0,0,0,0,0,0,0,0,0,0,0,0,0,0,0,0,0,0,0,0,0,0,0,0,0,0,0,0,0,0,0,0,0,0,0,0,0,0,0,0,0,0,0,0,0,0,0,0,0,0,0,0,0,0,0,0,0,0,0,0,0,0,0,0,0,0,0,0,0,0,0,0,0,0,0,0,0,0,0,0,0,0,0,0,0,0,0,0,0,0,0,0,0,0,0,0,0,0,0,0,0,0,0,0,0,0,0,0,0,0,0,0,0,0,0,0,0
catalytic rate constant geometric mean,0,0,0,0,0,0,0,0,0,0,0,0,0,0,0,0,0,0,0,0,0,0,0,0,0,0,0,0,0,0,0,0,0,0,0,0,0,0,0,0,7.069,0,0,0,0,0,0,0,0,0,0,0,0,0,0,0,0,0,0,0,0,0,0,0,0,0,0,0,0,0,0,0,0,0,0,0,0,0,0,0,0,0,0,0,0,0,0,0,0,0,0,0,0,0,0,0,0,0,0,0,0,0,0,0,0,0,0,0,0,0,0,0,0,0,0,0,0,0,0,0,0,0,0,0,0,0,0,0,0,0,0,0,0,0,0,0,0,0,0,0,0,0,0,0,0,0,0,0,0,0,0,0,0,0,0,0,0,0,0,0,0,0,0,0
catalytic rate constant geometric mean,0,0,0,0,0,0,0,0,0,0,0,0,0,0,0,0,0,0,0,0,0,0,0,0,0,0,0,0,0,0,0,0,0,0,0,0,0,0,0,0,0,7.069,0,0,0,0,0,0,0,0,0,0,0,0,0,0,0,0,0,0,0,0,0,0,0,0,0,0,0,0,0,0,0,0,0,0,0,0,0,0,0,0,0,0,0,0,0,0,0,0,0,0,0,0,0,0,0,0,0,0,0,0,0,0,0,0,0,0,0,0,0,0,0,0,0,0,0,0,0,0,0,0,0,0,0,0,0,0,0,0,0,0,0,0,0,0,0,0,0,0,0,0,0,0,0,0,0,0,0,0,0,0,0,0,0,0,0,0,0,0,0,0,0,0
catalytic rate constant geometric mean,0,0,0,0,0,0,0,0,0,0,0,0,0,0,0,0,0,0,0,0,0,0,0,0,0,0,0,0,0,0,0,0,0,0,0,0,0,0,0,0,0,0,7.069,0,0,0,0,0,0,0,0,0,0,0,0,0,0,0,0,0,0,0,0,0,0,0,0,0,0,0,0,0,0,0,0,0,0,0,0,0,0,0,0,0,0,0,0,0,0,0,0,0,0,0,0,0,0,0,0,0,0,0,0,0,0,0,0,0,0,0,0,0,0,0,0,0,0,0,0,0,0,0,0,0,0,0,0,0,0,0,0,0,0,0,0,0,0,0,0,0,0,0,0,0,0,0,0,0,0,0,0,0,0,0,0,0,0,0,0,0,0,0,0,0
catalytic rate constant geometric mean,0,0,0,0,0,0,0,0,0,0,0,0,0,0,0,0,0,0,0,0,0,0,0,0,0,0,0,0,0,0,0,0,0,0,0,0,0,0,0,0,0,0,0,7.069,0,0,0,0,0,0,0,0,0,0,0,0,0,0,0,0,0,0,0,0,0,0,0,0,0,0,0,0,0,0,0,0,0,0,0,0,0,0,0,0,0,0,0,0,0,0,0,0,0,0,0,0,0,0,0,0,0,0,0,0,0,0,0,0,0,0,0,0,0,0,0,0,0,0,0,0,0,0,0,0,0,0,0,0,0,0,0,0,0,0,0,0,0,0,0,0,0,0,0,0,0,0,0,0,0,0,0,0,0,0,0,0,0,0,0,0,0,0,0,0
catalytic rate constant geometric mean,0,0,0,0,0,0,0,0,0,0,0,0,0,0,0,0,0,0,0,0,0,0,0,0,0,0,0,0,0,0,0,0,0,0,0,0,0,0,0,0,0,0,0,0,7.069,0,0,0,0,0,0,0,0,0,0,0,0,0,0,0,0,0,0,0,0,0,0,0,0,0,0,0,0,0,0,0,0,0,0,0,0,0,0,0,0,0,0,0,0,0,0,0,0,0,0,0,0,0,0,0,0,0,0,0,0,0,0,0,0,0,0,0,0,0,0,0,0,0,0,0,0,0,0,0,0,0,0,0,0,0,0,0,0,0,0,0,0,0,0,0,0,0,0,0,0,0,0,0,0,0,0,0,0,0,0,0,0,0,0,0,0,0,0,0
catalytic rate constant geometric mean,0,0,0,0,0,0,0,0,0,0,0,0,0,0,0,0,0,0,0,0,0,0,0,0,0,0,0,0,0,0,0,0,0,0,0,0,0,0,0,0,0,0,0,0,0,7.069,0,0,0,0,0,0,0,0,0,0,0,0,0,0,0,0,0,0,0,0,0,0,0,0,0,0,0,0,0,0,0,0,0,0,0,0,0,0,0,0,0,0,0,0,0,0,0,0,0,0,0,0,0,0,0,0,0,0,0,0,0,0,0,0,0,0,0,0,0,0,0,0,0,0,0,0,0,0,0,0,0,0,0,0,0,0,0,0,0,0,0,0,0,0,0,0,0,0,0,0,0,0,0,0,0,0,0,0,0,0,0,0,0,0,0,0,0,0
catalytic rate constant geometric mean,0,0,0,0,0,0,0,0,0,0,0,0,0,0,0,0,0,0,0,0,0,0,0,0,0,0,0,0,0,0,0,0,0,0,0,0,0,0,0,0,0,0,0,0,0,0,7.069,0,0,0,0,0,0,0,0,0,0,0,0,0,0,0,0,0,0,0,0,0,0,0,0,0,0,0,0,0,0,0,0,0,0,0,0,0,0,0,0,0,0,0,0,0,0,0,0,0,0,0,0,0,0,0,0,0,0,0,0,0,0,0,0,0,0,0,0,0,0,0,0,0,0,0,0,0,0,0,0,0,0,0,0,0,0,0,0,0,0,0,0,0,0,0,0,0,0,0,0,0,0,0,0,0,0,0,0,0,0,0,0,0,0,0,0,0
catalytic rate constant geometric mean,0,0,0,0,0,0,0,0,0,0,0,0,0,0,0,0,0,0,0,0,0,0,0,0,0,0,0,0,0,0,0,0,0,0,0,0,0,0,0,0,0,0,0,0,0,0,0,7.069,0,0,0,0,0,0,0,0,0,0,0,0,0,0,0,0,0,0,0,0,0,0,0,0,0,0,0,0,0,0,0,0,0,0,0,0,0,0,0,0,0,0,0,0,0,0,0,0,0,0,0,0,0,0,0,0,0,0,0,0,0,0,0,0,0,0,0,0,0,0,0,0,0,0,0,0,0,0,0,0,0,0,0,0,0,0,0,0,0,0,0,0,0,0,0,0,0,0,0,0,0,0,0,0,0,0,0,0,0,0,0,0,0,0,0,0
catalytic rate constant geometric mean,0,0,0,0,0,0,0,0,0,0,0,0,0,0,0,0,0,0,0,0,0,0,0,0,0,0,0,0,0,0,0,0,0,0,0,0,0,0,0,0,0,0,0,0,0,0,0,0,7.069,0,0,0,0,0,0,0,0,0,0,0,0,0,0,0,0,0,0,0,0,0,0,0,0,0,0,0,0,0,0,0,0,0,0,0,0,0,0,0,0,0,0,0,0,0,0,0,0,0,0,0,0,0,0,0,0,0,0,0,0,0,0,0,0,0,0,0,0,0,0,0,0,0,0,0,0,0,0,0,0,0,0,0,0,0,0,0,0,0,0,0,0,0,0,0,0,0,0,0,0,0,0,0,0,0,0,0,0,0,0,0,0,0,0,0
Michaelis constant,-0.00727,-0.005877,0.002229,-0.003648,-3.012e-07,-0.003646,-0.001417,-0.0006991,-0.0007122,0.0008865,0.001136,-0.0008865,-0.0009535,-0.003031,-0.002759,-0.004358,-0.003823,-0.00276,-0.003024,-0.003024,-0.0002659,-0.002229,-0.00329,-0.0002658,3.747,0,0,0,0,0,0,1.715e-09,0,1.572e-05,0,0,0,0,0,0,0,0,0,0,0,0,0,0,0,4.923,5.617e-05,-5.617e-05,3.454e-09,3.454e-09,2.619e-13,-1.251e-06,-5.115e-06,5.203e-05,-8.993e-05,-2.604e-08,-3.454e-09,8.779e-08,5.203e-05,-3.454e-09,-2.619e-13,3.84e-06,5.115e-06,-5.203e-05,8.993e-05,5.207e-08,-8.779e-08,2.619e-13,-2.619e-13,1.913e-07,-1.913e-07,-4.382e-06,2.104e-06,-1.913e-07,8.814e-07,-6.293e-06,2.104e-06,-5.844e-06,9.5e-06,-2.104e-06,9.828e-06,-2.104e-06,5.844e-06,-9.5e-06,-9.828e-06,5.115e-06,-5.115e-06,1.097e-05,-1.097e-05,5.844e-06,-1.07e-05,-5.844e-06,2.157e-05,-2.157e-05,2.151e-05,9.5e-06,-1.067e-05,1.067e-05,-1.071e-05,1.07e-05,-1.074e-05,-7.455e-09,-7.455e-09,3.993e-09,-2.604e-08,-2.151e-05,1.071e-05,1.074e-05,7.455e-09,-3.993e-09,0.3788,0,0,0,0,0,0,0,0,0,0,0,0,0,0,0,0,0,0,0,0,0,0,0,0,0,0,0,0,0,0,0,0,0,0,0,0,0,0,0,0,0,0,0,0,0,0,0,0,0
Michaelis constant,-3.741,0.01176,-0.004459,0.007297,6.026e-07,0.007293,0.002834,0.001398,0.001425,-0.001773,-0.002273,0.001773,0.001907,0.006062,0.005518,0.008717,0.007648,0.005521,0.00605,0.006049,0.000532,0.004458,0.006581,0.0005318,-3.739,0,0,0,0,0,0,-3.43e-09,0,-3.145e-05,0,0,0,0,0,0,0,0,0,0,0,0,0,0,0,5.617e-05,4.923,0.3788,-6.909e-09,-6.909e-09,-5.24e-13,2.502e-06,1.023e-05,-0.0001041,0.0001799,5.208e-08,6.909e-09,-1.756e-07,-0.0001041,6.909e-09,5.24e-13,-7.682e-06,-1.023e-05,0.0001041,-0.0001799,-1.042e-07,1.756e-07,-5.24e-13,5.24e-13,-3.827e-07,3.827e-07,8.766e-06,-4.21e-06,3.827e-07,-1.763e-06,1.259e-05,-4.21e-06,1.169e-05,-1.9e-05,4.21e-06,-1.966e-05,4.21e-06,-1.169e-05,1.9e-05,1.966e-05,-1.023e-05,1.023e-05,-2.195e-05,2.195e-05,-1.169e-05,2.14e-05,1.169e-05,-4.314e-05,4.314e-05,-4.302e-05,-1.9e-05,2.134e-05,-2.134e-05,2.143e-05,-2.14e-05,2.148e-05,1.491e-08,1.491e-08,-7.988e-09,5.208e-08,4.302e-05,-2.143e-05,-2.148e-05,-1.491e-08,7.988e-09,-5.617e-05,0,0,0,0,0,0,0,0,0,0,0,0,0,0,0,0,0,0,0,0,0,0,0,0,0,0,0,0,0,0,0,0,0,0,0,0,0,0,0,0,0,0,0,0,0,0,0,0,0
Michaelis constant,3.741,-0.01176,0.004459,-0.007297,-6.026e-07,-0.007293,-0.002834,-0.001398,-0.001425,0.001773,0.002273,-0.001773,-0.001907,-0.006062,-0.005518,-0.008717,-0.007648,-0.005521,-0.00605,-0.006049,-0.000532,-0.004458,-0.006581,-0.0005318,3.739,0,0,0,0,0,0,3.43e-09,0,3.145e-05,0,0,0,0,0,0,0,0,0,0,0,0,0,0,0,-5.617e-05,0.3788,4.923,6.909e-09,6.909e-09,5.24e-13,-2.502e-06,-1.023e-05,0.0001041,-0.0001799,-5.208e-08,-6.909e-09,1.756e-07,0.0001041,-6.909e-09,-5.24e-13,7.682e-06,1.023e-05,-0.0001041,0.0001799,1.042e-07,-1.756e-07,5.24e-13,-5.24e-13,3.827e-07,-3.827e-07,-8.766e-06,4.21e-06,-3.827e-07,1.763e-06,-1.259e-05,4.21e-06,-1.169e-05,1.9e-05,-4.21e-06,1.966e-05,-4.21e-06,1.169e-05,-1.9e-05,-1.966e-05,1.023e-05,-1.023e-05,2.195e-05,-2.195e-05,1.169e-05,-2.14e-05,-1.169e-05,4.314e-05,-4.314e-05,4.302e-05,1.9e-05,-2.134e-05,2.134e-05,-2.143e-05,2.14e-05,-2.148e-05,-1.491e-08,-1.491e-08,7.988e-09,-5.208e-08,-4.302e-05,2.143e-05,2.148e-05,1.491e-08,-7.988e-09,5.617e-05,0,0,0,0,0,0,0,0,0,0,0,0,0,0,0,0,0,0,0,0,0,0,0,0,0,0,0,0,0,0,0,0,0,0,0,0,0,0,0,0,0,0,0,0,0,0,0,0,0
