,standard chemical potential,standard chemical potential,standard chemical potential,standard chemical potential,standard chemical potential,standard chemical potential,standard chemical potential,standard chemical potential,standard chemical potential,standard chemical potential,standard chemical potential,standard chemical potential,standard chemical potential,standard chemical potential,standard chemical potential,standard chemical potential,standard chemical potential,standard chemical potential,standard chemical potential,catalytic rate constant geometric mean,catalytic rate constant geometric mean,catalytic rate constant geometric mean,catalytic rate constant geometric mean,catalytic rate constant geometric mean,catalytic rate constant geometric mean,catalytic rate constant geometric mean,catalytic rate constant geometric mean,catalytic rate constant geometric mean,catalytic rate constant geometric mean,catalytic rate constant geometric mean,Michaelis constant,Michaelis constant,Michaelis constant,Michaelis constant,Michaelis constant,Michaelis constant,Michaelis constant,Michaelis constant,Michaelis constant,Michaelis constant,Michaelis constant,Michaelis constant,Michaelis constant,Michaelis constant,Michaelis constant,Michaelis constant,Michaelis constant,Michaelis constant,Michaelis constant,Michaelis constant,Michaelis constant,Michaelis constant,Michaelis constant,Michaelis constant,Michaelis constant,Michaelis constant,Michaelis constant,Michaelis constant,Michaelis constant,Michaelis constant,Michaelis constant,Michaelis constant,Michaelis constant,Michaelis constant,Michaelis constant,Michaelis constant,Michaelis constant,Michaelis constant,concentration,concentration,concentration,concentration,concentration,concentration,concentration,concentration,concentration,concentration,concentration,concentration,concentration,concentration,concentration,concentration,concentration,concentration,concentration
standard chemical potential,191860.942894524,-33509.1889419158,26323.0451018507,-24629.8681579773,24629.8681579773,-3996.68822688414,3996.68822659549,-2835.09404610005,10336.2788644206,58139.0570955274,-58139.0570955274,-5414.23366952571,5158.29990864282,-10828.4690236457,-5414.24459937522,18329.64694252,18329.6391209319,-2835.09215305962,18329.635961426,0.000375735847739591,0.00023412052833247,-5.14622597648245e-05,0,0,0,0,0,0.00219596838281921,0.00432394942984668,0,-5.833181797867e-05,-0.00137605187182171,-0.000235276603111395,-1.68696861143767e-05,5.83318179786663e-05,0.00137605187182171,-0.00936214215107891,-0.00137605187182171,5.83318179786671e-05,-2.0077759506279e-07,0.00108726244612231,-1.68696861154051e-05,2.0077759535793e-07,-0.00108726244610197,1.68696861141355e-05,-0.000235276603111394,0.000146600553637586,0.00137605187182171,-0.00108726244615179,5.83318179786699e-05,-0.00936214215107858,2.57831992288095e-06,-0.00109968153001126,0.000235276603111395,3.22244094468751e-05,-0.000413815280699149,2.57831992289599e-06,0.00109968153002846,-0.00137605187182171,0.000235276603111395,-8.56746776109325e-06,1.68696861120505e-05,0.00108726244628963,-0.000317886378785497,-0.000146600553661833,-3.22244094237903e-05,0.000317886378827709,8.56746775958708e-06,0,0,0,0,0,0,0,0,0,0,0,0,0,0,0,0,0,0,0
standard chemical potential,-33509.1889419158,155339.49098607,21775.0460526329,61151.3200616729,-61151.3200616729,1929.44229995989,-1929.44230037329,-10946.5811754027,29492.8763007819,33509.1889375502,-33509.1889375502,-3543.87614174794,-14805.4320980043,-7087.74746240839,-3543.90701761067,25633.9090433073,25633.9461507926,-10946.6021591661,25633.9203610078,-0.00107844283562765,-0.00259515313065277,-0.00368947888024622,0,0,0,0,0,-0.00226328199787544,0.00430478729013382,0,-3.36202891352735e-05,-0.00388722540684005,0.000675294541478369,-1.67949259258062e-05,3.36202891352735e-05,0.00388722540684005,-0.00539599033515298,-0.00388722540684005,3.36202891352736e-05,-1.43943289927572e-05,0.00305763581302895,-1.67949259256778e-05,1.4394328992899e-05,-0.00305763581333338,1.67949259248413e-05,0.000675294541478369,-0.00162502147291897,0.00388722540684005,-0.00305763581304432,3.36202891352737e-05,-0.00539599033515306,9.95517764594475e-06,-0.00310650352015848,-0.000675294541478368,0.00231026151551251,-0.00159778644812083,9.95517764597012e-06,0.00310650352016212,-0.00388722540684005,-0.000675294541478368,8.83008867527177e-06,1.67949259260615e-05,0.00305763581322573,-0.00259477955130671,0.00162502147278762,-0.00231026151549508,0.00259477955142054,-8.83008867502603e-06,0,0,0,0,0,0,0,0,0,0,0,0,0,0,0,0,0,0,0
standard chemical potential,26323.0451018507,21775.0460526329,88065.1548050052,4547.99904862521,-4547.99904862521,-23842.3289823419,23842.3289817254,7717.68981309146,-7304.34987045925,-26323.0450984213,26323.0450984213,-19983.4204657397,55402.3679280258,-39966.8589966272,-19983.4133632707,40380.4315309827,40380.3182080652,7717.74124582199,40380.3539901028,0.00403556521506998,0.0063609090927756,0.007121646420008,0,0,0,0,0,0.0155064076920166,0.0130101760836652,0,2.64103195329231e-05,0.000894190334826303,-0.00252697228957034,-5.07585924352213e-05,-2.64103195329221e-05,-0.000894190334826304,0.00423880438310785,0.000894190334826303,-2.64103195329225e-05,2.77847698433477e-05,-0.000678958511093429,-5.07585924319706e-05,-2.77847698442558e-05,0.000678958510796043,5.07585924359923e-05,-0.00252697228957034,0.00398304583258701,-0.000894190334826303,0.000678958511052158,-2.64103195329225e-05,0.00423880438310786,-7.0187535783173e-06,0.000714598495273726,0.00252697228957034,-0.00445940095690563,0.00112649615603684,-7.01875357860406e-06,-0.000714598495220598,0.000894190334826303,0.00252697228957034,-6.04975231043895e-05,5.07585924299378e-05,-0.000678958510949885,0.00360012695012617,-0.00398304583268128,0.00445940095682247,-0.00360012695042754,6.04975231043992e-05,0,0,0,0,0,0,0,0,0,0,0,0,0,0,0,0,0,0,0
standard chemical potential,-24629.8681579773,61151.3200616729,4547.99904862521,164218.811756581,85781.1882084748,-5926.13052607198,5926.13052619672,8111.48712824592,-19156.5974338656,24629.8681547685,-24629.8681547685,-1870.35752753411,19963.7320040462,-3740.72156075001,-1870.33758152089,-7304.26209983577,-7304.30702890913,8111.51000504978,-7304.28439863024,0.00145417868317779,0.00282927365867688,0.00363801662012034,0,0,0,0,0,0.00445925037982516,1.91621394634652e-05,0,-2.47115288367681e-05,0.00251117353455177,-0.000910571144471135,-7.47601882456475e-08,2.4711528836768e-05,-0.00251117353455177,-0.00396615181486212,0.00251117353455177,2.47115288367683e-05,1.41935513964479e-05,-0.00197037336689727,-7.47601884322588e-08,-1.4193551396294e-05,0.00197037336674503,7.47601886393529e-08,-0.000910571144471136,0.00177162202628021,-0.00251117353455177,0.0019703733667053,2.47115288367682e-05,-0.00396615181486221,-7.37685772198582e-06,0.00200682198979489,0.000910571144471136,-0.00227803710573352,0.00118397116728286,-7.37685772202879e-06,-0.00200682198980602,0.00251117353455177,0.000910571144471136,-1.73975564320094e-05,7.47601885644713e-08,-0.0019703733667323,0.00227689317244043,-0.00177162202628993,0.00227803710567281,-0.00227689317244451,1.73975564318671e-05,0,0,0,0,0,0,0,0,0,0,0,0,0,0,0,0,0,0,0
standard chemical potential,24629.8681579773,-61151.3200616729,-4547.99904862521,85781.1882084748,164218.811756581,5926.13052607198,-5926.13052619672,-8111.48712824592,19156.5974338656,-24629.8681547685,24629.8681547685,1870.35752753411,-19963.7320040462,3740.72156075001,1870.33758152088,7304.26209983577,7304.30702890914,-8111.51000504978,7304.28439863024,-0.0014541786831778,-0.00282927365867688,-0.00363801662028577,0,0,0,0,0,-0.00445925038007331,-1.91621390498862e-05,0,2.47115288367686e-05,-0.00251117353455177,0.000910571144471136,7.47601885688191e-08,-2.47115288367682e-05,0.00251117353455177,0.00396615181486216,-0.00251117353455177,-2.47115288367682e-05,-1.41935513961266e-05,0.00197037336662712,7.47601881097155e-08,1.41935513956489e-05,-0.00197037336674503,-7.47601876729625e-08,0.000910571144471136,-0.00177162202628021,0.00251117353455177,-0.00197037336657248,-2.47115288367682e-05,0.00396615181486216,7.37685772195148e-06,-0.00200682198982866,-0.000910571144471135,0.00227803710574049,-0.00118397116727515,7.37685772198845e-06,0.00200682198980602,-0.00251117353455177,-0.000910571144471136,1.73975564323314e-05,-7.47601879193786e-08,0.00197037336665683,-0.00227689317244043,0.00177162202628993,-0.00227803710564339,0.00227689317244452,-1.73975564321897e-05,0,0,0,0,0,0,0,0,0,0,0,0,0,0,0,0,0,0,0
standard chemical potential,-3996.68822688414,1929.44229995989,-23842.3289823419,-5926.13052607198,5926.13052607198,137127.918852148,112872.080959704,-2480.70261144815,24669.2438211566,3996.68822636346,-3996.68822636346,10887.5384629777,-26736.4742729905,21775.0856448944,10887.5390923129,413.464472398893,413.424520166233,-2480.72641876455,413.442141505927,-0.00194751216572303,-0.00294435418388622,-0.00318673452532835,0,0,0,0,0,0.00446566934708877,0.00885228504210161,0,-4.0099393036431e-06,7.92323769170882e-05,0.00121948451186109,-3.45367753473888e-05,4.00993930364291e-06,-7.9232376917088e-05,-0.00064358737784638,7.9232376917088e-05,4.00993930364304e-06,-1.24328954386567e-05,-0.00124799830689412,-3.45367753567282e-05,1.2432895438252e-05,0.00124799830709517,3.4536775353908e-05,0.00121948451186109,-0.00184368263903869,-7.92323769170881e-05,0.00124799830641626,4.00993930364305e-06,-0.000643587377846373,2.25603146391981e-06,6.33191103240755e-05,-0.00121948451186109,0.00199545528415772,-0.000362088616313492,2.25603146293037e-06,-6.33191103494196e-05,7.9232376917088e-05,-0.00121948451186109,-1.74225997340159e-05,3.45367753507134e-05,-0.00124799830646286,0.00177293033869354,0.00184368263905774,-0.00199545528459767,-0.00177293033869616,1.74225997340099e-05,0,0,0,0,0,0,0,0,0,0,0,0,0,0,0,0,0,0,0
standard chemical potential,3996.68822659549,-1929.44230037329,23842.3289817254,5926.13052619672,-5926.13052619672,112872.080959704,137127.918852953,2480.70260912541,-24669.2438233834,-3996.6882260748,3996.6882260748,-10887.5384645416,26736.4742714729,-21775.0856480223,-10887.5390938769,-413.464473820575,-413.424521587895,2480.7264164418,-413.442142927592,0.00194751216561249,0.00294435418346956,0.00318673452209701,0,0,0,0,0,-0.00446566934972238,-0.0088522850453656,0,4.00993930335351e-06,-7.92323769340642e-05,-0.00121948451179188,3.45367753594057e-05,-4.0099393033533e-06,7.92323769340643e-05,0.000643587377799897,-7.92323769340642e-05,-4.00993930335344e-06,1.24328954384515e-05,0.00124799830640171,3.45367753480847e-05,-1.2432895432876e-05,-0.0012479983070316,-3.4536775349135e-05,-0.00121948451179188,0.00184368263862749,7.92323769340641e-05,-0.00124799830714304,-4.00993930335344e-06,0.000643587377799891,-2.25603146140703e-06,-6.33191109538112e-05,0.00121948451179188,-0.00199545528472542,0.000362088615936899,-2.25603146233834e-06,6.33191110906082e-05,-7.92323769340641e-05,0.00121948451179188,1.74225997433097e-05,-3.45367753511011e-05,0.00124799830638387,-0.00177293033964639,-0.00184368263862538,0.00199545528425066,0.00177293033964239,-1.74225997433329e-05,0,0,0,0,0,0,0,0,0,0,0,0,0,0,0,0,0,0,0
standard chemical potential,-2835.09404610005,-10946.5811754027,7717.68981309146,8111.48712824592,-8111.48712824592,-2480.70261144815,2480.70260912541,54890.644341127,-2205.04572468368,2835.09404573069,-2835.09404573069,24964.5210885636,59851.9480660714,49929.063421136,24964.5175180659,2756.33730215644,2756.35030341106,54890.5341280182,2756.34352205648,0.00435967718894971,-0.013630533688348,-0.00807964764920733,0,0,0,0,0,-0.00124383816660616,-0.0105001094490652,0,-2.84449384080277e-06,-0.00044952038506725,-0.00272992328479984,4.09656850642442e-05,2.84449384080281e-06,0.00044952038506725,-0.000456535671410106,-0.00044952038506725,2.84449384080279e-06,-3.1522366757136e-05,0.000617068377972565,4.096568506486e-05,3.15223667575644e-05,-0.000617068377987796,-4.09656850639647e-05,-0.00272992328479984,-0.00853510710780058,0.00044952038506725,-0.000617068377980987,2.84449384080279e-06,-0.000456535671410116,6.9202780190356e-06,-0.000359237377956336,0.00272992328479984,0.00505927791624975,-0.00111069102220198,6.92027801981207e-06,0.000359237377884771,-0.00044952038506725,0.00272992328479984,4.85277633055762e-06,-4.09656850645091e-05,0.0006170683779948,-0.000682290307028123,0.00853510710779909,-0.00505927791600837,0.000682290307025905,-4.8527763305798e-06,0,0,0,0,0,0,0,0,0,0,0,0,0,0,0,0,0,0,0
standard chemical potential,10336.2788644206,29492.8763007819,-7304.34987045925,-19156.5974338656,19156.5974338656,24669.2438211566,-24669.2438233834,-2205.04572468368,91372.7696925543,-10336.278863074,10336.278863074,23566.6678597796,-51543.4518554211,47133.3525301091,23566.6774796095,42034.0982739208,42034.1917880927,-2205.08952109471,42034.1349683364,-0.00375447781659075,-0.00541649230554304,-0.00562526884007646,0,0,0,0,0,-0.00733804631596179,0.00786869374010938,0,1.03705489442613e-05,0.00121112234943807,0.00235096223173458,-3.06993399673757e-05,-1.03705489442613e-05,-0.00121112234943807,0.00166445272520735,0.00121112234943807,-1.03705489442613e-05,-2.19467228244945e-05,0.00605892540608015,-3.06993399668057e-05,2.19467228245881e-05,-0.00605892540596044,3.06993399645421e-05,0.00235096223173458,-0.00339167511939655,-0.00121112234943807,-0.00605892540578047,-1.03705489442614e-05,0.00166445272520737,2.00535043066707e-06,0.000967876941287424,-0.00235096223173458,0.00352240588368751,-0.000321854803265909,2.00535043065094e-06,-0.000967876941293195,0.00121112234943807,-0.00235096223173458,2.86290438981142e-05,3.06993399652816e-05,0.00605892540589323,-0.00571678837763946,0.00339167511932802,-0.00352240588342772,0.00571678837724317,-2.86290438958734e-05,0,0,0,0,0,0,0,0,0,0,0,0,0,0,0,0,0,0,0
standard chemical potential,58139.0570955274,33509.1889375502,-26323.0450984213,24629.8681547685,-24629.8681547685,3996.68822636346,-3996.6882260748,2835.09404573069,-10336.278863074,191860.942877102,58139.0570879531,5414.23366882035,-5158.29990797079,10828.469022235,5414.24459866986,-18329.646940132,-18329.6391185439,2835.09215269027,-18329.635959038,-0.000375735847690642,-0.00023412052831722,5.14622595133245e-05,0,0,0,0,0,-0.00219596838201443,-0.00432394942956502,0,5.83318179676611e-05,0.00137605187164244,0.000235276603080744,1.68696861119927e-05,-5.83318179676612e-05,-0.00137605187164244,0.0093621421493122,0.00137605187164244,-5.83318179676623e-05,2.00777595372892e-07,-0.00108726244605148,1.68696861117259e-05,-2.00777595022317e-07,0.00108726244603114,-1.6869686111749e-05,0.000235276603080743,-0.000146600553628037,-0.00137605187164244,0.00108726244591939,-5.83318179676618e-05,0.00936214214931215,-2.57831992258765e-06,0.00109968153000717,-0.000235276603080743,-3.22244094378059e-05,0.000413815280625916,-2.5783199224053e-06,-0.00109968152995682,0.00137605187164244,-0.000235276603080743,8.56746775795481e-06,-1.68696861096614e-05,-0.00108726244591696,0.000317886378812379,0.000146600553652283,3.22244094511127e-05,-0.000317886378663791,-8.56746775902899e-06,0,0,0,0,0,0,0,0,0,0,0,0,0,0,0,0,0,0,0
standard chemical potential,-58139.0570955274,-33509.1889375502,26323.0450984213,-24629.8681547685,24629.8681547685,-3996.68822636346,3996.6882260748,-2835.09404573069,10336.278863074,58139.0570879531,191860.942877102,-5414.23366882035,5158.29990797079,-10828.469022235,-5414.24459866986,18329.646940132,18329.6391185439,-2835.09215269027,18329.635959038,0.000375735847690642,0.000234120528441294,-5.14622595960404e-05,0,0,0,0,0,0.00219596838201443,0.00432394942956502,0,-5.83318179676619e-05,-0.00137605187164244,-0.000235276603080743,-1.68696861145705e-05,5.83318179676614e-05,0.00137605187164244,-0.00936214214931226,-0.00137605187164244,5.83318179676622e-05,-2.00777595050973e-07,0.00108726244591641,-1.68696861130161e-05,2.00777594699772e-07,-0.00108726244603114,1.68696861143219e-05,-0.000235276603080743,0.00014660055369628,0.00137605187164244,-0.00108726244584545,5.83318179676626e-05,-0.00936214214931217,2.57831992289838e-06,-0.00109968153000717,0.000235276603080743,3.22244094880054e-05,-0.000413815280641342,2.57831992272804e-06,0.00109968152995682,-0.00137605187164244,0.000235276603080743,-8.56746775924499e-06,1.6869686113532e-05,0.00108726244591696,-0.000317886378717202,-0.000146600553725818,-3.22244094805346e-05,0.000317886378950216,8.567467759029e-06,0,0,0,0,0,0,0,0,0,0,0,0,0,0,0,0,0,0,0
standard chemical potential,-5414.23366952571,-3543.87614174794,-19983.4204657397,-1870.35752753411,1870.35752753411,10887.5384629777,-10887.5384645416,24964.5210885636,23566.6678597796,5414.23366882035,-5414.23366882035,23369.9141747636,3189.4596441435,46739.664240273,23369.8314751669,1791.63837891633,1791.60492741771,24964.5440295456,1791.61915803073,0.000232323506668457,0.00283721084129492,0.00534024711656107,0,0,0,0,0,0.0038437387947654,0.0036022262526434,0,-5.4321846383962e-06,-0.000145528959438842,-0.000145475300801655,-1.40539169543235e-05,5.43218463839606e-06,0.000145528959438842,-0.000871854959057995,-0.000145528959438842,5.43218463839613e-06,2.08347239275483e-05,-0.000939460319399608,-1.40539169550576e-05,-2.08347239272896e-05,0.000939460319488315,1.40539169544287e-05,-0.000145475300801655,0.00177659209587993,0.000145528959438842,0.000939460319394658,5.43218463839613e-06,-0.000871854959057991,-2.2703553008989e-05,-0.00832062865586036,0.000145475300801655,-0.00334393224548803,0.00364387564047784,-2.27035530081203e-05,0.00832062865565354,-0.000145528959438842,0.000145475300801655,-1.49961668224916e-05,1.40539169562846e-05,-0.000939460319414444,0.00143178021718145,-0.00177659209580055,0.00334393224547064,-0.0014317802171908,1.49961668225405e-05,0,0,0,0,0,0,0,0,0,0,0,0,0,0,0,0,0,0,0
standard chemical potential,5158.29990864282,-14805.4320980043,55402.3679280258,19963.7320040462,-19963.7320040462,-26736.4742729905,26736.4742714729,59851.9480660714,-51543.4518554211,-5158.29990797079,5158.29990797079,3189.4596441435,113325.069991287,6378.92309442746,3189.45481498619,1929.35740806996,1929.45031373719,59851.8854676539,1929.40828974513,-0.00995554173496614,-0.00774181807658998,-0.00170618158001631,0,0,0,0,0,-0.0101751746990536,0.0123459289910716,0,5.1754023254827e-06,-0.000607983755945341,0.00623391701561069,-4.81670635243052e-05,-5.17540232548241e-06,0.000607983755945341,0.000830641902467531,-0.00060798375594534,-5.17540232548259e-06,-6.65658749166308e-06,0.00311305958661707,-4.81670635264183e-05,6.65658748996253e-06,-0.00311305958671774,4.81670635260697e-05,0.00623391701561072,-0.0048477372936861,0.00060798375594534,-0.00311305958678516,-5.17540232548262e-06,0.000830641902467512,2.40821478606443e-06,-0.000485874493843047,-0.00623391701561067,0.00106836921103688,-0.000386513740518637,2.40821478598786e-06,0.000485874493864319,-0.00060798375594534,-0.00623391701561056,3.96979673636134e-05,4.81670635215475e-05,0.00311305958646348,-0.0042281467689694,0.004847737294019,-0.00106836921096089,0.00422814676897222,-3.96979673636698e-05,0,0,0,0,0,0,0,0,0,0,0,0,0,0,0,0,0,0,0
standard chemical potential,-10828.4690236457,-7087.74746240839,-39966.8589966272,-3740.72156075001,3740.72156075001,21775.0856448944,-21775.0856480223,49929.063421136,47133.3525301091,10828.469022235,-10828.469022235,46739.664240273,6378.92309442746,93479.3671624909,46739.6619284291,3583.27613054989,3583.20922752236,49929.1093031202,3583.23768876211,0.000464647290580083,0.00567442420605484,0.0106804988878325,0,0,0,0,0,0.00768748090783813,0.0072044550920116,0,-1.08643709669719e-05,-0.000291057720900154,-0.000290950775206206,-2.81078440011271e-05,1.08643709669716e-05,0.000291057720900154,-0.00174371018938649,-0.000291057720900154,1.08643709669718e-05,4.16694660135546e-05,-0.00187892165362741,-2.81078440020639e-05,-4.16694660125853e-05,0.0018789216537088,2.81078439988189e-05,-0.000290950775206206,0.00355318577176393,0.000291057720900154,0.00187892165361103,1.08643709669719e-05,-0.00174371018938649,1.14323617841446e-05,-0.000232600826116946,0.000290950775206205,-0.00668786740551955,-0.00183487159905317,1.14323617849972e-05,0.000232600826509989,-0.000291057720900154,0.000290950775206205,-2.9992346591095e-05,2.81078440019564e-05,-0.00187892165401045,0.00286356181310678,-0.0035531857721342,0.00668786740566645,-0.00286356181314833,2.99923465910091e-05,0,0,0,0,0,0,0,0,0,0,0,0,0,0,0,0,0,0,0
standard chemical potential,-5414.24459937522,-3543.90701761067,-19983.4133632707,-1870.33758152089,1870.33758152088,10887.5390923129,-10887.5390938769,24964.5175180659,23566.6774796095,5414.24459866986,-5414.24459866986,23369.8314751669,3189.45481498619,46739.6619284291,23369.911862908,1791.64674004881,1791.61328856229,24964.5404590409,1791.62751916691,0.000232323154907693,0.00283720999422151,0.00534024591284671,0,0,0,0,0,0.00384373805663599,0.00360222765679313,0,-5.43219560448378e-06,-0.000145530227353407,-0.000145475080537663,-1.40539224322679e-05,5.43219560448365e-06,0.000145530227353407,-0.000871856719093501,-0.000145530227353407,5.43219560448371e-06,2.08347192306348e-05,-0.000939459321873971,-1.40539224318616e-05,-2.08347192316272e-05,0.000939459322160492,1.40539224324039e-05,-0.000145475080537663,0.00177659156563731,0.000145530227353407,0.000939459322046648,5.43219560448371e-06,-0.000871856719093497,-2.2703549762047e-05,0.00808802665808512,0.000145475080537663,-0.00334393149202436,0.00364387511951115,-2.27035497624354e-05,-0.00808802665795165,-0.000145530227353407,0.000145475080537663,-1.49961639426253e-05,1.40539224330988e-05,-0.000939459322250846,0.0014317793708502,-0.00177659156558702,0.00334393149197763,-0.0014317793708578,1.49961639425422e-05,0,0,0,0,0,0,0,0,0,0,0,0,0,0,0,0,0,0,0
standard chemical potential,18329.64694252,25633.9090433073,40380.4315309827,-7304.26209983577,7304.26209983577,413.464472398893,-413.464473820575,2756.33730215644,42034.0982739208,-18329.646940132,18329.646940132,1791.63837891633,1929.35740806996,3583.27613054989,1791.64674004881,41207.4098524284,41207.2166250226,2756.34112024662,41207.2876497319,0.000140536369376119,0.000472199790613288,0.000748181741258843,0,0,0,0,0,0.0244377525185452,-0.00983587242006883,0,1.83904191481089e-05,0.00105265420127874,-8.80004391365329e-05,3.83741954148286e-05,-1.83904191481087e-05,-0.00105265420127874,0.00295162613216473,0.00105265420127874,-1.83904191481089e-05,2.91899600952335e-06,-0.00317495225707675,3.83741954137162e-05,-2.91899600968797e-06,0.00317495225681177,-3.83741954131752e-05,-8.80004391365328e-05,0.000295679969677785,-0.00105265420127874,0.00317495225725798,-1.83904191481089e-05,0.00295162613216475,-2.50669230884421e-06,0.000841236007511891,8.80004391365329e-05,-0.000468493123051115,0.000402319189384719,-2.50669230890177e-06,-0.000841236007516687,0.00105265420127874,8.80004391365329e-05,-9.53427464956686e-05,-3.83741954144711e-05,-0.00317495225711326,0.00714598685857338,-0.000295679969732575,0.000468493123053345,-0.00714598685869418,9.53427464962935e-05,0,0,0,0,0,0,0,0,0,0,0,0,0,0,0,0,0,0,0
standard chemical potential,18329.6391209319,25633.9461507926,40380.3182080652,-7304.30702890913,7304.30702890914,413.424520166233,-413.424521587895,2756.35030341106,42034.1917880927,-18329.6391185439,18329.6391185439,1791.60492741771,1929.45031373719,3583.20922752236,1791.61328856229,41207.2166250226,41207.3900437512,2756.35412158754,41207.2979812577,0.000140543136720061,0.000472210463284452,0.000748193695594018,0,0,0,0,0,-0.0162693917239827,-0.0098358678396222,0,1.83904113005886e-05,0.00105265572509433,-8.80046766818837e-05,3.83741775431685e-05,-1.83904113005881e-05,-0.00105265572509433,0.00295162487265309,0.00105265572509433,-1.83904113005882e-05,2.91904264878924e-06,-0.00317495838562752,3.83741775453711e-05,-2.91904264888952e-06,0.00317495838562846,-3.83741775440002e-05,-8.80046766818838e-05,0.000295686652618349,-0.00105265572509433,0.00317495838574926,-1.83904113005882e-05,0.00295162487265309,-2.50670413248441e-06,0.000841237225258936,8.80046766818837e-05,-0.000468500608578668,0.000402321087060428,-2.50670413250171e-06,-0.000841237225233023,0.00105265572509433,8.80046766818837e-05,6.34742695578538e-05,-3.83741775435122e-05,-0.0031749583858281,-0.00926265486463017,-0.00029568665266861,0.000468500608569982,0.00926265486493315,-6.34742695558451e-05,0,0,0,0,0,0,0,0,0,0,0,0,0,0,0,0,0,0,0
standard chemical potential,-2835.09215305962,-10946.6021591661,7717.74124582199,8111.51000504978,-8111.51000504978,-2480.72641876455,2480.7264164418,54890.5341280182,-2205.08952109471,2835.09215269027,-2835.09215269027,24964.5440295456,59851.8854676539,49929.1093031202,24964.5404590409,2756.34112024662,2756.35412158754,54890.6276246999,2756.34734019319,0.00435967262921687,0.0115631405667265,-0.0080796556238454,0,0,0,0,0,-0.00124384747150688,-0.0105001079449879,0,-2.84449194148594e-06,-0.000449521246763635,-0.0027299204296066,4.09656791962743e-05,2.84449194148598e-06,0.000449521246763635,-0.000456535366573489,-0.000449521246763635,2.84449194148596e-06,-3.15223978667373e-05,0.000617071417422229,4.09656791963586e-05,3.15223978641093e-05,-0.000617071417398115,-4.09656791959606e-05,-0.00272992042960661,0.00724055605525166,0.000449521246763635,-0.000617071417408147,2.84449194148596e-06,-0.000456535366573497,6.92028561984345e-06,-0.000359238066089609,0.0027299204296066,0.00505928290868627,-0.00111069224219177,6.92028562043674e-06,0.000359238066339896,-0.000449521246763635,0.0027299204296066,4.85281263308198e-06,-4.09656791966419e-05,0.000617071417414236,-0.000682294308299312,-0.00724055605517741,-0.00505928290864717,0.000682294308279055,-4.85281263299431e-06,0,0,0,0,0,0,0,0,0,0,0,0,0,0,0,0,0,0,0
standard chemical potential,18329.635961426,25633.9203610078,40380.3539901028,-7304.28439863024,7304.28439863024,413.442141505927,-413.442142927592,2756.34352205648,42034.1349683364,-18329.635959038,18329.635959038,1791.61915803073,1929.40828974513,3583.23768876211,1791.62751916691,41207.2876497319,41207.2979812577,2756.34734019319,41207.3690060514,0.000140540075649444,0.000472205544881425,0.00074818810712432,0,0,0,0,0,-0.0162694086013766,-0.00983586631351759,0,1.83904081306071e-05,0.0010526546660391,-8.80027599142906e-05,3.83741715938833e-05,-1.83904081306067e-05,-0.0010526546660391,0.00295162436387733,0.0010526546660391,-1.83904081306069e-05,2.9190208458656e-06,-0.00317495451058834,3.83741715928903e-05,-2.91902084594675e-06,0.00317495450967508,-3.83741715946716e-05,-8.80027599142903e-05,0.000295683572830226,-0.0010526546660391,0.00317495450958741,-1.83904081306069e-05,0.00295162436387732,-2.50669796513051e-06,0.000841236378844229,8.80027599142903e-05,-0.000468497109243681,0.000402320097211218,-2.50669796510486e-06,-0.000841236378846314,0.0010526546660391,8.80027599142904e-05,6.3474335400688e-05,-3.83741715961811e-05,-0.00317495450966131,0.00714599534967207,-0.000295683572903561,0.000468497109253415,-0.00714599534989652,-6.34743354031969e-05,0,0,0,0,0,0,0,0,0,0,0,0,0,0,0,0,0,0,0
catalytic rate constant geometric mean,0.000375735847739591,-0.00107844283562765,0.00403556521506998,0.00145417868317779,-0.0014541786831778,-0.00194751216572303,0.00194751216561249,0.00435967718894971,-0.00375447781659075,-0.000375735847690642,0.000375735847690642,0.000232323506668457,-0.00995554173496614,0.000464647290580083,0.000232323154907693,0.000140536369376119,0.000140543136720061,0.00435967262921687,0.000140540075649444,2.37275416370952,-5.63921956812932e-10,-1.2428001343527e-10,0,0,0,0,0,-7.41170145067447e-10,8.99290110557264e-10,0,3.76981605296069e-13,-4.42861593931882e-11,1.17349866826119,-3.50853823321639e-12,-3.76981605296035e-13,4.42861593931883e-11,6.05048068005384e-11,-4.42861593931883e-11,-3.76981605296058e-13,-4.84872649612777e-13,2.26758448260396e-10,-3.50853823286129e-12,4.84872649594852e-13,-2.26758448236228e-10,3.50853823312127e-12,1.17349866826119,-3.53114148795586e-10,4.42861593931883e-11,-2.2675844823482e-10,-3.76981605296054e-13,6.05048068005361e-11,1.75416831155209e-13,-3.53915956973771e-11,-1.17349866826119,7.78211074062467e-11,-2.81540566711186e-11,1.75416831157219e-13,3.53915956971825e-11,-4.42861593931883e-11,-1.17349866826119,2.89164059586142e-12,3.50853823273092e-12,2.26758448234731e-10,-3.07982540524762e-10,3.53114148824542e-10,-7.78211074053108e-11,3.07982540526025e-10,-2.89164059585892e-12,0,0,0,0,0,0,0,0,0,0,0,0,0,0,0,0,0,0,0
catalytic rate constant geometric mean,0.00023412052833247,-0.00259515313065277,0.0063609090927756,0.00282927365867688,-0.00282927365867688,-0.00294435418388622,0.00294435418346956,-0.013630533688348,-0.00541649230554304,-0.00023412052831722,0.000234120528441294,0.00283721084129492,-0.00774181807658998,0.00567442420605484,0.00283720999422151,0.000472199790613288,0.000472210463284452,0.0115631405667265,0.000472205544881425,-5.63921956812932e-10,1.65406750559538,-9.86164657664325e-10,0,0,0,0,0,-1.15074835796314e-09,1.86012033241707e-10,0,2.34896758376237e-13,-1.06569733129669e-10,3.53114144384803e-10,-7.25717233698978e-13,-2.3489675837624e-13,1.06569733129669e-10,3.77004680803383e-11,-1.06569733129669e-10,-2.34896758299202e-13,-3.84747520852426e-12,3.75902775446327e-10,-7.25717234078696e-13,3.84747520858227e-12,-3.75902775465506e-10,7.25717233720448e-13,3.53114144384803e-10,-1.62352269107926,1.0656973313953e-10,-3.75902775477711e-10,-2.34896758299203e-13,3.77004680901992e-11,9.40076686692192e-13,-8.51659517811772e-11,-3.53114144463687e-10,6.17512209980422e-10,-1.50880460765682e-10,9.40076686389128e-13,8.5165951750656e-11,-1.06569733129669e-10,-3.53114144463687e-10,4.4895908041859e-12,7.25717234427087e-13,3.75902775457423e-10,-4.94848150837929e-10,1.62352269107926,-6.17512209959101e-10,4.94848150838309e-10,-4.48959080422763e-12,0,0,0,0,0,0,0,0,0,0,0,0,0,0,0,0,0,0,0
catalytic rate constant geometric mean,-5.14622597648245e-05,-0.00368947888024622,0.007121646420008,0.00363801662012034,-0.00363801662028577,-0.00318673452532835,0.00318673452209701,-0.00807964764920733,-0.00562526884007646,5.14622595133245e-05,-5.14622595960404e-05,0.00534024711656107,-0.00170618158001631,0.0106804988878325,0.00534024591284671,0.000748181741258843,0.000748193695594018,-0.0080796556238454,0.00074818810712432,-1.2428001343527e-10,-9.86164657664325e-10,1.66024780047494,0,0,0,0,0,-1.27305499768419e-09,-8.70055012205834e-10,0,-5.16328836546597e-14,-1.51508122995603e-10,7.78211064860031e-11,3.39447886637461e-12,5.16328835776216e-14,1.515081229993e-10,-8.28697633682091e-12,-1.515081229993e-10,5.16328835776234e-14,-0.0100914179018535,4.37043744510749e-10,3.39447886612851e-12,0.0100914179018535,-4.37043744514575e-10,-3.39447886558147e-12,7.78211064662821e-11,-6.17512209795948e-10,1.5150812298451e-10,-4.37043744498432e-10,5.16328834235516e-14,-8.28697630723932e-12,1.63356366867833e-12,-1.21078782199174e-10,-7.7821106387398e-11,1.61965274145309,-2.6218375850978e-10,1.63356366818693e-12,1.21078782235809e-10,-1.51508122986975e-10,-7.7821106387398e-11,4.96676442822959e-12,-3.39447886672282e-12,4.37043744471284e-10,-5.62262747000598e-10,6.17512209804923e-10,-1.61965274145309,5.62262746998827e-10,-4.9667644282449e-12,0,0,0,0,0,0,0,0,0,0,0,0,0,0,0,0,0,0,0
catalytic rate constant geometric mean,0,0,0,0,0,0,0,0,0,0,0,0,0,0,0,0,0,0,0,0,0,0,7.06919748063787,0,0,0,0,0,0,0,0,0,0,0,0,0,0,0,0,0,0,0,0,0,0,0,0,0,0,0,0,0,0,0,0,0,0,0,0,0,0,0,0,0,0,0,0,0,0,0,0,0,0,0,0,0,0,0,0,0,0,0,0,0,0,0,0
catalytic rate constant geometric mean,0,0,0,0,0,0,0,0,0,0,0,0,0,0,0,0,0,0,0,0,0,0,0,0.0110630429508914,0,0,0,0,0,0,0,0,0,0,0,0,0,0,0,0,0,0,0,0,0,0,0,0,0,0,0,0,0,0,0,0,0,0,0,0,0,0,0,0,0,0,0,0,0,0,0,0,0,0,0,0,0,0,0,0,0,0,0,0,0,0,0
catalytic rate constant geometric mean,0,0,0,0,0,0,0,0,0,0,0,0,0,0,0,0,0,0,0,0,0,0,0,0,0.0110630429508914,0,0,0,0,0,0,0,0,0,0,0,0,0,0,0,0,0,0,0,0,0,0,0,0,0,0,0,0,0,0,0,0,0,0,0,0,0,0,0,0,0,0,0,0,0,0,0,0,0,0,0,0,0,0,0,0,0,0,0,0,0,0
catalytic rate constant geometric mean,0,0,0,0,0,0,0,0,0,0,0,0,0,0,0,0,0,0,0,0,0,0,0,0,0,0.0110630429508914,0,0,0,0,0,0,0,0,0,0,0,0,0,0,0,0,0,0,0,0,0,0,0,0,0,0,0,0,0,0,0,0,0,0,0,0,0,0,0,0,0,0,0,0,0,0,0,0,0,0,0,0,0,0,0,0,0,0,0,0,0
catalytic rate constant geometric mean,0,0,0,0,0,0,0,0,0,0,0,0,0,0,0,0,0,0,0,0,0,0,0,0,0,0,0.0110630429508914,0,0,0,0,0,0,0,0,0,0,0,0,0,0,0,0,0,0,0,0,0,0,0,0,0,0,0,0,0,0,0,0,0,0,0,0,0,0,0,0,0,0,0,0,0,0,0,0,0,0,0,0,0,0,0,0,0,0,0,0
catalytic rate constant geometric mean,0.00219596838281921,-0.00226328199787544,0.0155064076920166,0.00445925037982516,-0.00445925038007331,0.00446566934708877,-0.00446566934972238,-0.00124383816660616,-0.00733804631596179,-0.00219596838201443,0.00219596838201443,0.0038437387947654,-0.0101751746990536,0.00768748090783813,0.00384373805663599,0.0244377525185452,-0.0162693917239827,-0.00124384747150688,-0.0162694086013766,-7.41170145067447e-10,-1.15074835796314e-09,-1.27305499768419e-09,0,0,0,0,0,0.0575255564500717,-1.22093141901272e-09,0,2.20324914706718e-12,-9.29414745098023e-11,4.64102627163252e-10,4.76340673124886e-12,-2.20324914706717e-12,9.29414744900812e-11,3.53617158232319e-10,-9.29414744900812e-11,-2.20324914706716e-12,-4.96676442849768e-12,4.50489976028804e-10,4.76340673197018e-12,4.96676442828288e-12,-4.50489976237059e-10,-4.76340673204658e-12,4.64102627153392e-10,-7.20570501082787e-10,9.29414745098023e-11,-4.50489976220384e-10,-2.20324914737529e-12,3.53617158271759e-10,1.13119206002066e-12,-7.42748331468512e-11,-4.64102627152159e-10,7.97155929924373e-10,-1.81554102618984e-10,1.13119206002102e-12,7.42748331382783e-11,-9.29414745098023e-11,-4.64102627152159e-10,0.0163443636462679,-4.76340673242727e-12,4.5048997620972e-10,-1.69801556968565e-09,7.20570501006458e-10,-7.97155929916989e-10,1.69801556956353e-09,-0.0163443636462679,0,0,0,0,0,0,0,0,0,0,0,0,0,0,0,0,0,0,0
catalytic rate constant geometric mean,0.00432394942984668,0.00430478729013382,0.0130101760836652,1.91621394634652e-05,-1.91621390498862e-05,0.00885228504210161,-0.0088522850453656,-0.0105001094490652,0.00786869374010938,-0.00432394942956502,0.00432394942956502,0.0036022262526434,0.0123459289910716,0.0072044550920116,0.00360222765679313,-0.00983587242006883,-0.0098358678396222,-0.0105001079449879,-0.00983586631351759,8.99290110557264e-10,1.86012033241707e-10,-8.70055012205834e-10,0,0,0,0,0,-1.22093141901272e-09,0.0736368712749488,0,4.33828554569534e-12,1.76775708273589e-10,-5.6311348435843e-10,0.016281506106325,-4.33828554538713e-12,-1.76775708253867e-10,6.96286304504734e-10,1.76775708273589e-10,-4.33828554600342e-12,-3.3944788663733e-12,-5.71174216824033e-10,0.016281506106325,3.39447886797521e-12,5.7117421685094e-10,-0.016281506106325,-5.63113484397872e-10,1.16476189710588e-10,-1.76775708273589e-10,5.71174216857391e-10,-4.33828554538711e-12,6.96286304425846e-10,3.29631128118845e-13,1.41271550141575e-10,5.63113484397872e-10,5.44807187402914e-10,-5.29051482904117e-11,3.29631128232195e-13,-1.41271550137745e-10,1.7677570829331e-10,5.63113484397872e-10,4.76340673186525e-12,-0.016281506106325,-5.71174216986467e-10,1.5342841645533e-10,-1.16476189801385e-10,-5.44807187360087e-10,-1.53428416543811e-10,-4.76340673135498e-12,0,0,0,0,0,0,0,0,0,0,0,0,0,0,0,0,0,0,0
catalytic rate constant geometric mean,0,0,0,0,0,0,0,0,0,0,0,0,0,0,0,0,0,0,0,0,0,0,0,0,0,0,0,0,0,0.0110630429508914,0,0,0,0,0,0,0,0,0,0,0,0,0,0,0,0,0,0,0,0,0,0,0,0,0,0,0,0,0,0,0,0,0,0,0,0,0,0,0,0,0,0,0,0,0,0,0,0,0,0,0,0,0,0,0,0,0
Michaelis constant,-5.833181797867e-05,-3.36202891352735e-05,2.64103195329231e-05,-2.47115288367681e-05,2.47115288367686e-05,-4.0099393036431e-06,4.00993930335351e-06,-2.84449384080277e-06,1.03705489442613e-05,5.83318179676611e-05,-5.83318179676619e-05,-5.4321846383962e-06,5.1754023254827e-06,-1.08643709669719e-05,-5.43219560448378e-06,1.83904191481089e-05,1.83904113005886e-05,-2.84449194148594e-06,1.83904081306071e-05,3.76981605296069e-13,2.34896758376237e-13,-5.16328836546597e-14,0,0,0,0,0,2.20324914706718e-12,4.33828554569534e-12,0,0.0329333271551011,-1.380614191408e-12,-2.36056666041114e-13,-1.69256177972209e-14,0.000100710411423068,1.38061419140799e-12,-0.0161638231159053,-1.38061419140798e-12,0.000100710411423069,-2.01443276562097e-16,1.0908672802905e-12,-1.69256177982671e-14,2.01443276339891e-16,-1.09086728025543e-12,1.69256177990737e-14,-2.3605666604111e-13,1.47086609901735e-13,1.38061419140799e-12,-1.09086728013179e-12,0.000100710411423069,-0.0161638231159054,2.58686837951964e-15,-1.1033275397884e-12,2.3605666604111e-13,3.23312499519094e-14,-4.15187291145914e-13,2.58686837970555e-15,1.10332753981974e-12,-1.380614191408e-12,2.3605666604111e-13,-8.59587332159434e-15,1.69256177972297e-14,1.09086728026823e-12,-3.1894033543857e-13,-1.47086609935858e-13,-3.23312499928724e-14,3.18940335455875e-13,8.59587332174757e-15,0,0,0,0,0,0,0,0,0,0,0,0,0,0,0,0,0,0,0
Michaelis constant,-0.00137605187182171,-0.00388722540684005,0.000894190334826303,0.00251117353455177,-0.00251117353455177,7.92323769170882e-05,-7.92323769340642e-05,-0.00044952038506725,0.00121112234943807,0.00137605187164244,-0.00137605187164244,-0.000145528959438842,-0.000607983755945341,-0.000291057720900154,-0.000145530227353407,0.00105265420127874,0.00105265572509433,-0.000449521246763635,0.0010526546660391,-4.42861593931882e-11,-1.06569733129669e-10,-1.51508122995603e-10,0,0,0,0,0,-9.29414745098023e-11,1.76775708273589e-10,0,-1.380614191408e-12,0.0289120398383287,2.77309104509519e-11,-6.89682143636218e-13,1.38061419140798e-12,0.00412199772819548,-2.21585864518827e-10,-0.00412199772819547,1.38061419140799e-12,-5.911018433969e-13,1.25561543461451e-10,-6.89682143587543e-13,5.91101843420943e-13,-1.25561543465659e-10,6.8968214352705e-13,2.77309104509519e-11,-6.67313626499438e-11,0.00412199772819548,-1.25561543458347e-10,1.38061419140799e-12,-2.2158586451883e-10,4.08808487062364e-13,-1.27568291524075e-10,-2.77309104509519e-11,9.48706842269078e-11,-6.56129587774473e-11,4.08808487060301e-13,1.27568291524928e-10,-0.00412199772819548,-2.77309104509519e-11,3.62606808353474e-13,6.89682143519848e-13,1.25561543467637e-10,-1.06554392140998e-10,6.67313626516929e-11,-9.48706842246118e-11,1.06554392139045e-10,-3.62606808330913e-13,0,0,0,0,0,0,0,0,0,0,0,0,0,0,0,0,0,0,0
Michaelis constant,-0.000235276603111395,0.000675294541478369,-0.00252697228957034,-0.000910571144471135,0.000910571144471136,0.00121948451186109,-0.00121948451179188,-0.00272992328479984,0.00235096223173458,0.000235276603080744,-0.000235276603080743,-0.000145475300801655,0.00623391701561069,-0.000290950775206206,-0.000145475080537663,-8.80004391365329e-05,-8.80046766818837e-05,-0.0027299204296066,-8.80027599142906e-05,1.17349866826119,3.53114144384803e-10,7.78211064860031e-11,0,0,0,0,0,4.64102627163252e-10,-5.6311348435843e-10,0,-2.36056666041114e-13,2.77309104509519e-11,4.56708192111388,2.19696087618547e-12,2.36056666041097e-13,-2.77309104509519e-11,-3.78866309977635e-11,2.77309104509519e-11,2.36056666041106e-13,3.03615400791164e-13,-1.41990597256817e-10,2.19696087605155e-12,-3.03615400754199e-13,1.41990597232821e-10,-2.19696087634311e-12,-0.734816189364529,2.21111448238429e-10,-2.77309104509519e-11,1.41990597248407e-10,2.36056666041106e-13,-3.78866309977627e-11,-1.09841731691692e-13,2.2161352092666e-11,0.734816189364529,-4.87296751606263e-11,1.76293820730969e-11,-1.09841731689045e-13,-2.21613520936053e-11,2.77309104509519e-11,0.734816189364529,-1.81067465585494e-12,-2.19696087628672e-12,-1.41990597252633e-10,1.92851138340159e-10,-2.21111448226821e-10,4.8729675166369e-11,-1.92851138339865e-10,1.81067465585768e-12,0,0,0,0,0,0,0,0,0,0,0,0,0,0,0,0,0,0,0
