,Value
standard chemical potential,-14.6334893415201
standard chemical potential,-6.59790877281676
standard chemical potential,-24.621010385362
standard chemical potential,-8.03558056108466
standard chemical potential,8.0355805610907
standard chemical potential,-5.27677909425636
standard chemical potential,5.27677909452346
standard chemical potential,4.19414381218433
standard chemical potential,17.7634038416458
standard chemical potential,14.6334893381459
standard chemical potential,-14.6334893381459
standard chemical potential,-10.5635216677015
standard chemical potential,17.1105638485302
standard chemical potential,-22.2763301199302
standard chemical potential,-7.54703054147472
standard chemical potential,6.59677878801183
standard chemical potential,10.8457202346689
standard chemical potential,6.72794420425587
standard chemical potential,10.6465056868172
catalytic rate constant geometric mean,-1.38297394037414
catalytic rate constant geometric mean,4.54288087435103
catalytic rate constant geometric mean,1.69470106114043
catalytic rate constant geometric mean,2.30258509299405
catalytic rate constant geometric mean,6.94275315034541
catalytic rate constant geometric mean,5.12695371649987
catalytic rate constant geometric mean,5.44450246409492
catalytic rate constant geometric mean,4.74742919841218
catalytic rate constant geometric mean,4.4402276752665
catalytic rate constant geometric mean,-4.15054307350489
catalytic rate constant geometric mean,2.82065312598391
Michaelis constant,-3.46715510719483
Michaelis constant,1.52974347814553
Michaelis constant,0.10243304323412
Michaelis constant,-1.16663581221626
Michaelis constant,-4.63668864247156
Michaelis constant,2.46066139894087
Michaelis constant,2.40770126985036
Michaelis constant,-0.863199170427357
Michaelis constant,-3.23390214623953
Michaelis constant,-2.14248833283721
Michaelis constant,-0.297650659092459
Michaelis constant,-1.38040691760552
Michaelis constant,-0.213556452057254
Michaelis constant,-2.09288262045921
Michaelis constant,-1.43663393505276
Michaelis constant,0.102433043234123
Michaelis constant,-1.5282839958989
Michaelis constant,-4.5685375625941
Michaelis constant,-6.77406386179602
Michaelis constant,-5.69021515168153
Michaelis constant,2.40770126985037
Michaelis constant,-1.8443827142457
Michaelis constant,0.992406238833094
Michaelis constant,-4.70760322922221
Michaelis constant,-1.56881952124796
Michaelis constant,-2.29302153507116
Michaelis constant,-2.05258633978402
Michaelis constant,-1.05413327685987
Michaelis constant,-0.0211804890750645
Michaelis constant,-4.70760322922221
Michaelis constant,-1.2310512854826
Michaelis constant,-1.22286282966349
Michaelis constant,0.0629937134923856
Michaelis constant,1.29777642017618
Michaelis constant,-3.07688619008919
Michaelis constant,-3.03635066474013
Michaelis constant,1.9028319270093
Michaelis constant,-1.22361840111706
