prey	kind	bait	time	replicate	k1
BRL1	BRL1	MLP1	30	1	0.086965875510015
BRL1	BRL1	MLP1	30	2	0.066212769875766
BRL1	BRL1	MLP1	30	3	0.064004449281011
BRL1	BRL1	NSP1	30	1	0.089365738475854
BRL1	BRL1	NSP1	30	2	0.104047331688232
BRL1	BRL1	NSP1	30	3	0.102583813348404
BRL1	BRL1	NUP1	30	1	0.087776126060721
BRL1	BRL1	NUP1	30	2	0.069161343650424
BRL1	BRL1	NUP1	30	3	0.056909042267059
BRL1	BRL1	NUP133	30	1	0.11775419216433
BRL1	BRL1	NUP133	30	2	0.10588190464317
BRL1	BRL1	NUP133	30	3	0.100571038814817
BRL1	BRL1	NUP188	30	1	0.054146625676424
BRL1	BRL1	NUP188	30	2	0.038871235366038
BRL1	BRL1	NUP188	30	3	0.058874888681713
BRL1	BRL1	NUP57	30	1	0.078429190513793
BRL1	BRL1	NUP57	30	2	0.064182774212961
BRL1	BRL1	NUP57	30	3	0.068168592084021
BRL1	BRL1	NUP82	30	1	0.075790193605989
BRL1	BRL1	NUP82	30	2	0.083124666733833
BRL1	BRL1	NUP82	30	3	0.077353656051031
BRL1	BRL1	NUP84	30	1	0.095841870401297
BRL1	BRL1	NUP84	30	2	0.090160823572322
BRL1	BRL1	NUP84	30	3	0.089752639114312
BRL1	BRL1	NUP85	30	1	0.081473021400874
BRL1	BRL1	NUP85	30	2	0.086321673359228
BRL1	BRL1	NUP85	30	3	0.080574690241962
BRL1	BRL1	MLP1	60	1	0.200883495109125
BRL1	BRL1	MLP1	60	2	0.226735048134949
BRL1	BRL1	MLP1	60	3	0.238798860444326
BRL1	BRL1	NSP1	60	1	0.214587371139743
BRL1	BRL1	NSP1	60	2	0.209476344555649
BRL1	BRL1	NSP1	60	3	0.207119961348799
BRL1	BRL1	NUP1	60	1	0.231946497634506
BRL1	BRL1	NUP1	60	2	0.212663131611246
BRL1	BRL1	NUP1	60	3	0.189039128737067
BRL1	BRL1	NUP133	60	1	0.214977393588969
BRL1	BRL1	NUP133	60	2	0.244547726990463
BRL1	BRL1	NUP133	60	3	0.220850318873163
BRL1	BRL1	NUP188	60	1	0.186716564321785
BRL1	BRL1	NUP188	60	2	0.206769156521194
BRL1	BRL1	NUP188	60	3	0.180345704914995
BRL1	BRL1	NUP57	60	1	0.206055781734335
BRL1	BRL1	NUP57	60	2	0.224555031741889
BRL1	BRL1	NUP57	60	3	0.218479885299602
BRL1	BRL1	NUP82	60	1	0.204986553230573
BRL1	BRL1	NUP82	60	2	0.224072556533648
BRL1	BRL1	NUP82	60	3	0.224811660693851
BRL1	BRL1	NUP84	60	1	0.216422283313406
BRL1	BRL1	NUP84	60	2	0.218114162989587
BRL1	BRL1	NUP84	60	3	0.222989575837642
BRL1	BRL1	NUP85	60	1	0.195080388178565
BRL1	BRL1	NUP85	60	2	0.201701531711075
BRL1	BRL1	NUP85	60	3	0.201442201789853
BRL1	BRL1	MLP1	90	1	0.348192612334431
BRL1	BRL1	MLP1	90	2	0.342022761224397
BRL1	BRL1	MLP1	90	3	0.328290445849204
BRL1	BRL1	NSP1	90	1	0.330565790982087
BRL1	BRL1	NSP1	90	2	0.339186660126612
BRL1	BRL1	NSP1	90	3	0.349371572002698
BRL1	BRL1	NUP1	90	1	0.339611667732653
BRL1	BRL1	NUP1	90	2	0.358777807638213
BRL1	BRL1	NUP1	90	3	0.334051357837818
BRL1	BRL1	NUP133	90	1	0.347058063364957
BRL1	BRL1	NUP133	90	2	0.342200769308787
BRL1	BRL1	NUP133	90	3	0.344055581072184
BRL1	BRL1	NUP188	90	1	0.322297837382125
BRL1	BRL1	NUP188	90	2	0.355504660734972
BRL1	BRL1	NUP188	90	3	0.326657381631775
BRL1	BRL1	NUP57	90	1	0.352131075916956
BRL1	BRL1	NUP57	90	2	0.352003036595126
BRL1	BRL1	NUP57	90	3	0.335258417294246
BRL1	BRL1	NUP82	90	1	0.340996877261684
BRL1	BRL1	NUP82	90	2	0.347973516915553
BRL1	BRL1	NUP82	90	3	0.347809957099474
BRL1	BRL1	NUP84	90	1	0.355121486161924
BRL1	BRL1	NUP84	90	2	0.348786507981217
BRL1	BRL1	NUP84	90	3	0.343010631603233
BRL1	BRL1	NUP85	90	1	0.327739457768252
BRL1	BRL1	NUP85	90	2	0.337652457565233
BRL1	BRL1	NUP85	90	3	0.340648706831584
