,bait,prey,Time,labeling_mean,labeling_std,timer_mean,timer_std
0,MLP1,GLE1,30.0,0.0547883151393151,0.0038366571976179245,0.08920304003615746,0.0018059682591856506
1,MLP1,GLE1,60.0,0.15341858671901298,0.0063225709440279864,0.20594226625900067,0.0028535371051309024
2,MLP1,GLE1,90.0,0.278551433487998,0.010839492411179206,0.32672849733247933,0.004708707546318348
3,MLP1,GLE2,30.0,0.0373634736539675,0.00044281465392338233,0.08920304003615746,0.0018059682591856506
4,MLP1,GLE2,60.0,0.11110540525566033,0.008109988383892562,0.20594226625900067,0.0028535371051309024
5,MLP1,GLE2,90.0,0.2092778284060053,0.004476797365469399,0.32672849733247933,0.004708707546318348
6,MLP1,MLP1,30.0,0.09271986349072957,0.0027105518720793417,0.08920304003615746,0.0018059682591856506
7,MLP1,MLP1,60.0,0.224121523063434,0.0075076971188032865,0.20594226625900067,0.0028535371051309024
8,MLP1,MLP1,90.0,0.35456529473226134,0.0010485426014351538,0.32672849733247933,0.004708707546318348
9,MLP1,MLP2,30.0,0.046857384829904036,0.00046003312784350514,0.08920304003615746,0.0018059682591856506
10,MLP1,MLP2,60.0,0.14452093509626765,0.006608889090272251,0.20594226625900067,0.0028535371051309024
11,MLP1,MLP2,90.0,0.2654884746843063,0.0054784342526229025,0.32672849733247933,0.004708707546318348
12,MLP1,NDC1,30.0,0.06839454486119717,0.0020743584572814,0.08920304003615746,0.0018059682591856506
13,MLP1,NDC1,60.0,0.16794475980508464,0.0034413443248564398,0.20594226625900067,0.0028535371051309024
14,MLP1,NDC1,90.0,0.281512814985771,0.003970693458883366,0.32672849733247933,0.004708707546318348
15,MLP1,NIC96,30.0,0.028011775458171465,0.0018390342099344245,0.08920304003615746,0.0018059682591856506
16,MLP1,NIC96,60.0,0.08527467038997694,0.010075955269852253,0.20594226625900067,0.0028535371051309024
17,MLP1,NIC96,90.0,0.16156087445550768,0.011611870821520329,0.32672849733247933,0.004708707546318348
18,MLP1,NSP1,30.0,0.012130657350265766,0.0010796486492805444,0.08920304003615746,0.0018059682591856506
19,MLP1,NSP1,60.0,0.037973127065786504,0.0050674198143388725,0.20594226625900067,0.0028535371051309024
20,MLP1,NSP1,90.0,0.0908226759682042,0.007394395113222805,0.32672849733247933,0.004708707546318348
21,MLP1,NUP1,30.0,0.0515624924279486,0.001770036291723516,0.08920304003615746,0.0018059682591856506
22,MLP1,NUP1,60.0,0.147226378654066,0.008326322068503395,0.20594226625900067,0.0028535371051309024
23,MLP1,NUP1,90.0,0.263219123747006,0.006589782729023313,0.32672849733247933,0.004708707546318348
24,MLP1,NUP100,30.0,0.04410612423605683,0.0019442153676919507,0.08920304003615746,0.0018059682591856506
25,MLP1,NUP100,60.0,0.11395414634061933,0.007225292425550319,0.20594226625900067,0.0028535371051309024
26,MLP1,NUP100,90.0,0.20469396552958166,0.007587905791363154,0.32672849733247933,0.004708707546318348
27,MLP1,NUP116,30.0,0.057494987832283,0.0007457579313109117,0.08920304003615746,0.0018059682591856506
28,MLP1,NUP116,60.0,0.14739444127666199,0.006938834622786417,0.20594226625900067,0.0028535371051309024
29,MLP1,NUP116,90.0,0.2527303026188513,0.005288469844553909,0.32672849733247933,0.004708707546318348
30,MLP1,NUP120,30.0,0.032034025603874965,0.00032050653249758706,0.08920304003615746,0.0018059682591856506
31,MLP1,NUP120,60.0,0.09954157155850045,0.0052172395952752495,0.20594226625900067,0.0028535371051309024
32,MLP1,NUP120,90.0,0.18903524367850033,0.006448092542287038,0.32672849733247933,0.004708707546318348
33,MLP1,NUP133,30.0,0.016977460168278266,0.0012946305613180833,0.08920304003615746,0.0018059682591856506
34,MLP1,NUP133,60.0,0.05716398327676486,0.004508007378345414,0.20594226625900067,0.0028535371051309024
35,MLP1,NUP133,90.0,0.12588530478819868,0.006017127701357137,0.32672849733247933,0.004708707546318348
36,MLP1,NUP145C,30.0,0.03807356641379,0.0006255606219535769,0.08920304003615746,0.0018059682591856506
37,MLP1,NUP145C,60.0,0.1053826421587416,0.00651727985499686,0.20594226625900067,0.0028535371051309024
38,MLP1,NUP145C,90.0,0.19537058292824502,0.006644675678353411,0.32672849733247933,0.004708707546318348
39,MLP1,NUP145N,30.0,0.06066629400124233,0.0008370962595928913,0.08920304003615746,0.0018059682591856506
40,MLP1,NUP145N,60.0,0.150058828362645,0.005758815111527021,0.20594226625900067,0.0028535371051309024
41,MLP1,NUP145N,90.0,0.25583081929503065,0.004792632692907791,0.32672849733247933,0.004708707546318348
42,MLP1,NUP157,30.0,0.024640666569228236,0.0016020081302199746,0.08920304003615746,0.0018059682591856506
43,MLP1,NUP157,60.0,0.07339746264062826,0.008444650544698557,0.20594226625900067,0.0028535371051309024
44,MLP1,NUP157,90.0,0.14146051125091766,0.011205049822762327,0.32672849733247933,0.004708707546318348
45,MLP1,NUP159,30.0,0.026373463354414733,0.0013628415120618123,0.08920304003615746,0.0018059682591856506
46,MLP1,NUP159,60.0,0.07812100743938984,0.0025946350876554962,0.20594226625900067,0.0028535371051309024
47,MLP1,NUP159,90.0,0.15842695331442533,0.011074675497275591,0.32672849733247933,0.004708707546318348
48,MLP1,NUP170,30.0,0.03333295603260807,0.0013845587014429726,0.08920304003615746,0.0018059682591856506
49,MLP1,NUP170,60.0,0.08962361386264794,0.00882360702300583,0.20594226625900067,0.0028535371051309024
50,MLP1,NUP170,90.0,0.16366276085526632,0.01136147712602564,0.32672849733247933,0.004708707546318348
51,MLP1,NUP188,30.0,0.013607103669043502,0.0017042712310109793,0.08920304003615746,0.0018059682591856506
52,MLP1,NUP188,60.0,0.04435844380356204,0.006059876808273217,0.20594226625900067,0.0028535371051309024
53,MLP1,NUP188,90.0,0.0965787414399349,0.007571335371027099,0.32672849733247933,0.004708707546318348
54,MLP1,NUP192,30.0,0.018025239174556035,0.0010211973693815231,0.08920304003615746,0.0018059682591856506
55,MLP1,NUP192,60.0,0.062381830000001436,0.007088338271629971,0.20594226625900067,0.0028535371051309024
56,MLP1,NUP192,90.0,0.127395841996994,0.01004924002452697,0.32672849733247933,0.004708707546318348
57,MLP1,NUP2,30.0,0.07593111187426631,0.0022773881540756632,0.08920304003615746,0.0018059682591856506
58,MLP1,NUP2,60.0,0.1864208978027647,0.006955515197821007,0.20594226625900067,0.0028535371051309024
59,MLP1,NUP2,90.0,0.3059773568261577,0.006079382916706373,0.32672849733247933,0.004708707546318348
60,MLP1,NUP49,30.0,0.0201188958599149,0.0007959108257533326,0.08920304003615746,0.0018059682591856506
61,MLP1,NUP49,60.0,0.0720177602907346,0.010093334058103106,0.20594226625900067,0.0028535371051309024
62,MLP1,NUP49,90.0,0.14491167078864634,0.009549887842816141,0.32672849733247933,0.004708707546318348
63,MLP1,NUP53,30.0,0.04193915588746963,0.0010727365838274893,0.08920304003615746,0.0018059682591856506
64,MLP1,NUP53,60.0,0.10649232498151033,0.010695991935815257,0.20594226625900067,0.0028535371051309024
65,MLP1,NUP53,90.0,0.187458678847496,0.01048955733960554,0.32672849733247933,0.004708707546318348
66,MLP1,NUP57,30.0,0.018929165281485933,0.0010001977750852629,0.08920304003615746,0.0018059682591856506
67,MLP1,NUP57,60.0,0.06780430518821452,0.007371017033592694,0.20594226625900067,0.0028535371051309024
68,MLP1,NUP57,90.0,0.142590900286923,0.0126993226035115,0.32672849733247933,0.004708707546318348
69,MLP1,NUP59,30.0,0.0385868043809266,0.0024804044736946324,0.08920304003615746,0.0018059682591856506
70,MLP1,NUP59,60.0,0.10490335627424317,0.009499483501384211,0.20594226625900067,0.0028535371051309024
71,MLP1,NUP59,90.0,0.19077514204542734,0.010710642987842927,0.32672849733247933,0.004708707546318348
72,MLP1,NUP60,30.0,0.06267053917168923,0.001788350755394995,0.08920304003615746,0.0018059682591856506
73,MLP1,NUP60,60.0,0.17403305251681633,0.006934816073133877,0.20594226625900067,0.0028535371051309024
74,MLP1,NUP60,90.0,0.29747407640740936,0.0018342585246521788,0.32672849733247933,0.004708707546318348
75,MLP1,NUP82,30.0,0.031074956950697664,0.0014261127453787284,0.08920304003615746,0.0018059682591856506
76,MLP1,NUP82,60.0,0.08846417131588118,0.0020005673090296083,0.20594226625900067,0.0028535371051309024
77,MLP1,NUP82,90.0,0.17048722966056098,0.009544264143373928,0.32672849733247933,0.004708707546318348
78,MLP1,NUP84,30.0,0.029102649143038065,0.0007423969022530127,0.08920304003615746,0.0018059682591856506
79,MLP1,NUP84,60.0,0.08490011577630113,0.004585783699903605,0.20594226625900067,0.0028535371051309024
80,MLP1,NUP84,90.0,0.16831771684127136,0.0073680960169145,0.32672849733247933,0.004708707546318348
81,MLP1,NUP85,30.0,0.02925747632269447,0.001033798016048246,0.08920304003615746,0.0018059682591856506
82,MLP1,NUP85,60.0,0.0899498170341365,0.005610221600120541,0.20594226625900067,0.0028535371051309024
83,MLP1,NUP85,90.0,0.17892792734586002,0.00825064387673127,0.32672849733247933,0.004708707546318348
84,MLP1,POM152,30.0,0.021073933440429637,0.001392376386181673,0.08920304003615746,0.0018059682591856506
85,MLP1,POM152,60.0,0.06938163217017114,0.007573061503039047,0.20594226625900067,0.0028535371051309024
86,MLP1,POM152,90.0,0.139309268354228,0.010901713574535338,0.32672849733247933,0.004708707546318348
87,MLP1,POM34,30.0,0.028903451112414533,0.001402597576109026,0.08920304003615746,0.0018059682591856506
88,MLP1,POM34,60.0,0.08230609933819931,0.00905121149426138,0.20594226625900067,0.0028535371051309024
89,MLP1,POM34,90.0,0.15425670748996934,0.012034916417987894,0.32672849733247933,0.004708707546318348
90,MLP1,SEC13,30.0,0.05325081251359196,0.0014004174588248272,0.08920304003615746,0.0018059682591856506
91,MLP1,SEC13,60.0,0.130109977919918,0.008062837913498634,0.20594226625900067,0.0028535371051309024
92,MLP1,SEC13,90.0,0.22495810055751567,0.006042646379376776,0.32672849733247933,0.004708707546318348
93,MLP1,SEH1,30.0,0.014487837587152835,0.000872477667290639,0.08920304003615746,0.0018059682591856506
94,MLP1,SEH1,60.0,0.04327156343891974,0.0035543546481483397,0.20594226625900067,0.0028535371051309024
95,MLP1,SEH1,90.0,0.10736120048744068,0.0018657128731178548,0.32672849733247933,0.004708707546318348
96,NSP1,GLE1,30.0,0.05479894811192463,0.011868635826085154,0.08839275210304624,0.003903929673820686
97,NSP1,GLE1,60.0,0.18787036115856368,0.008671939735103691,0.19834604275586698,0.005510002183097519
98,NSP1,GLE1,90.0,0.3225646594601093,0.015720203932355712,0.318903385822299,0.006186584606626162
99,NSP1,GLE2,30.0,0.04434484124721177,0.0009838512565707985,0.08839275210304624,0.003903929673820686
100,NSP1,GLE2,60.0,0.13073806323297366,0.0008585083146970589,0.19834604275586698,0.005510002183097519
101,NSP1,GLE2,90.0,0.24347124434969067,0.006204364675733024,0.318903385822299,0.006186584606626162
102,NSP1,MLP1,30.0,0.0317858644923167,0.0017023009912544693,0.08839275210304624,0.003903929673820686
103,NSP1,MLP1,60.0,0.10100762262469724,0.0027504804294338006,0.19834604275586698,0.005510002183097519
104,NSP1,MLP1,90.0,0.19977583308385602,0.002353045271858549,0.318903385822299,0.006186584606626162
105,NSP1,MLP2,30.0,0.05708729915270686,0.0025577710262100982,0.08839275210304624,0.003903929673820686
106,NSP1,MLP2,60.0,0.150454320051497,0.0033973055653436987,0.19834604275586698,0.005510002183097519
107,NSP1,MLP2,90.0,0.266077169402904,0.0040937163790163026,0.318903385822299,0.006186584606626162
108,NSP1,NDC1,30.0,0.0720801705267683,0.0016332544873505512,0.08839275210304624,0.003903929673820686
109,NSP1,NDC1,60.0,0.1750892346655357,0.008956761287483277,0.19834604275586698,0.005510002183097519
110,NSP1,NDC1,90.0,0.29019064675014866,0.012352759815823547,0.318903385822299,0.006186584606626162
111,NSP1,NIC96,30.0,0.07040293484493043,0.0016707861352852885,0.08839275210304624,0.003903929673820686
112,NSP1,NIC96,60.0,0.17501289091295666,0.0019141684440906342,0.19834604275586698,0.005510002183097519
113,NSP1,NIC96,90.0,0.296660801977365,0.006340949392081992,0.318903385822299,0.006186584606626162
114,NSP1,NSP1,30.0,0.09544396545633203,0.0023324230505750066,0.08839275210304624,0.003903929673820686
115,NSP1,NSP1,60.0,0.21217528753670867,0.002525899073849553,0.19834604275586698,0.005510002183097519
116,NSP1,NSP1,90.0,0.33381593580256164,0.005022145037626699,0.318903385822299,0.006186584606626162
117,NSP1,NUP1,30.0,0.08376268385491177,0.003130072483357821,0.08839275210304624,0.003903929673820686
118,NSP1,NUP1,60.0,0.196582033507135,0.005132808385926551,0.19834604275586698,0.005510002183097519
119,NSP1,NUP1,90.0,0.323974066430921,0.008335016185804074,0.318903385822299,0.006186584606626162
120,NSP1,NUP100,30.0,0.06330713964641631,0.0009960769095119888,0.08839275210304624,0.003903929673820686
121,NSP1,NUP100,60.0,0.15515469744163765,0.0020662915300183908,0.19834604275586698,0.005510002183097519
122,NSP1,NUP100,90.0,0.27115610473564933,0.0056639463532636505,0.318903385822299,0.006186584606626162
123,NSP1,NUP116,30.0,0.07619148507243052,0.0014388684760126354,0.08839275210304624,0.003903929673820686
124,NSP1,NUP116,60.0,0.17932009113696434,0.0016141303200885514,0.19834604275586698,0.005510002183097519
125,NSP1,NUP116,90.0,0.2977207848823177,0.006926771715328268,0.318903385822299,0.006186584606626162
126,NSP1,NUP120,30.0,0.05129464781115453,0.0011895300317578696,0.08839275210304624,0.003903929673820686
127,NSP1,NUP120,60.0,0.13943612528716667,0.002850819650969094,0.19834604275586698,0.005510002183097519
128,NSP1,NUP120,90.0,0.258810863182603,0.005205471570248364,0.318903385822299,0.006186584606626162
129,NSP1,NUP133,30.0,0.025848453130438598,0.0003523299297582492,0.08839275210304624,0.003903929673820686
130,NSP1,NUP133,60.0,0.0860580083005953,0.004388944450625446,0.19834604275586698,0.005510002183097519
131,NSP1,NUP133,90.0,0.17933595165570834,0.005207673790171697,0.318903385822299,0.006186584606626162
132,NSP1,NUP145C,30.0,0.05884955733735266,0.0012433888227128625,0.08839275210304624,0.003903929673820686
133,NSP1,NUP145C,60.0,0.15294362119737334,0.003727144511939001,0.19834604275586698,0.005510002183097519
134,NSP1,NUP145C,90.0,0.27185146939643534,0.007137012863329332,0.318903385822299,0.006186584606626162
135,NSP1,NUP145N,30.0,0.0687532097167573,0.002131770853827188,0.08839275210304624,0.003903929673820686
136,NSP1,NUP145N,60.0,0.16948183314586532,0.002958047757831177,0.19834604275586698,0.005510002183097519
137,NSP1,NUP145N,90.0,0.284670747332386,0.007092374252453884,0.318903385822299,0.006186584606626162
138,NSP1,NUP157,30.0,0.04126076383166977,0.0033379009804207116,0.08839275210304624,0.003903929673820686
139,NSP1,NUP157,60.0,0.11855295672141568,0.0031643531575650556,0.19834604275586698,0.005510002183097519
140,NSP1,NUP157,90.0,0.22442041317462835,0.005578237671509675,0.318903385822299,0.006186584606626162
141,NSP1,NUP159,30.0,0.06069654620068177,0.0036791458912487363,0.08839275210304624,0.003903929673820686
142,NSP1,NUP159,60.0,0.16795337509432398,0.0011410666465457354,0.19834604275586698,0.005510002183097519
143,NSP1,NUP159,90.0,0.2916370156632437,0.00676395560952889,0.318903385822299,0.006186584606626162
144,NSP1,NUP170,30.0,0.0485114228546136,0.0011966365641981529,0.08839275210304624,0.003903929673820686
145,NSP1,NUP170,60.0,0.13325008996058,0.0027040445163434954,0.19834604275586698,0.005510002183097519
146,NSP1,NUP170,90.0,0.2462467967117993,0.006830802115408666,0.318903385822299,0.006186584606626162
147,NSP1,NUP188,30.0,0.026532178702964367,0.000554395557445294,0.08839275210304624,0.003903929673820686
148,NSP1,NUP188,60.0,0.08725501871901593,0.002815427391069572,0.19834604275586698,0.005510002183097519
149,NSP1,NUP188,90.0,0.1832467393773143,0.0056527096432435,0.318903385822299,0.006186584606626162
150,NSP1,NUP192,30.0,0.04544842158764306,0.0014640670513711039,0.08839275210304624,0.003903929673820686
151,NSP1,NUP192,60.0,0.12719487874776234,0.0022719129705109625,0.19834604275586698,0.005510002183097519
152,NSP1,NUP192,90.0,0.24496431549268297,0.005666093968286785,0.318903385822299,0.006186584606626162
153,NSP1,NUP2,30.0,0.0863616365168018,0.0052396177750993,0.08839275210304624,0.003903929673820686
154,NSP1,NUP2,60.0,0.19571945306887537,0.0010212130409457361,0.19834604275586698,0.005510002183097519
155,NSP1,NUP2,90.0,0.31317803116068466,0.008511769506389438,0.318903385822299,0.006186584606626162
156,NSP1,NUP49,30.0,0.061367524772996,0.0017975931148149244,0.08839275210304624,0.003903929673820686
157,NSP1,NUP49,60.0,0.16041309767702833,0.0016588993651228256,0.19834604275586698,0.005510002183097519
158,NSP1,NUP49,90.0,0.27319583017540566,0.00628097681088782,0.318903385822299,0.006186584606626162
159,NSP1,NUP53,30.0,0.06183925321248266,0.0019031626695564306,0.08839275210304624,0.003903929673820686
160,NSP1,NUP53,60.0,0.15221556789744164,0.003392649771310738,0.19834604275586698,0.005510002183097519
161,NSP1,NUP53,90.0,0.26239635465769967,0.005960499161529686,0.318903385822299,0.006186584606626162
162,NSP1,NUP57,30.0,0.07352080691129637,0.0014534841887799271,0.08839275210304624,0.003903929673820686
163,NSP1,NUP57,60.0,0.183152958576559,0.0014412177393982603,0.19834604275586698,0.005510002183097519
164,NSP1,NUP57,90.0,0.30925823812324466,0.0061759088686691955,0.318903385822299,0.006186584606626162
165,NSP1,NUP59,30.0,0.07466367667879487,0.0027048908678390837,0.08839275210304624,0.003903929673820686
166,NSP1,NUP59,60.0,0.17913571260755268,0.004280516426214514,0.19834604275586698,0.005510002183097519
167,NSP1,NUP59,90.0,0.3019965819505453,0.008971112633569547,0.318903385822299,0.006186584606626162
168,NSP1,NUP60,30.0,0.08409866784988602,0.002588870902097963,0.08839275210304624,0.003903929673820686
169,NSP1,NUP60,60.0,0.19466265540233432,0.0016004536341471354,0.19834604275586698,0.005510002183097519
170,NSP1,NUP60,90.0,0.318331684430425,0.0073653503906882375,0.318903385822299,0.006186584606626162
171,NSP1,NUP82,30.0,0.06151044845658497,0.0021257725707993164,0.08839275210304624,0.003903929673820686
172,NSP1,NUP82,60.0,0.16708550103501899,0.0028108406972303856,0.19834604275586698,0.005510002183097519
173,NSP1,NUP82,90.0,0.28932799527099035,0.006018294270990315,0.318903385822299,0.006186584606626162
174,NSP1,NUP84,30.0,0.040699233578449366,0.0025002792891398716,0.08839275210304624,0.003903929673820686
175,NSP1,NUP84,60.0,0.12065390354142401,0.002532218893196446,0.19834604275586698,0.005510002183097519
176,NSP1,NUP84,90.0,0.23767653018648935,0.004562462756409913,0.318903385822299,0.006186584606626162
177,NSP1,NUP85,30.0,0.046990748747121565,0.0012311763880321917,0.08839275210304624,0.003903929673820686
178,NSP1,NUP85,60.0,0.13644407095363567,0.0048553046732413676,0.19834604275586698,0.005510002183097519
179,NSP1,NUP85,90.0,0.25570801382478364,0.00540234807217879,0.318903385822299,0.006186584606626162
180,NSP1,POM152,30.0,0.04012146015292347,0.0024651319823163543,0.08839275210304624,0.003903929673820686
181,NSP1,POM152,60.0,0.11972029882028266,0.000778095090982092,0.19834604275586698,0.005510002183097519
182,NSP1,POM152,90.0,0.22976954355662801,0.005280911244652789,0.318903385822299,0.006186584606626162
183,NSP1,POM34,30.0,0.048312106592127535,0.0009972587300383041,0.08839275210304624,0.003903929673820686
184,NSP1,POM34,60.0,0.138806227490375,0.004118304752273634,0.19834604275586698,0.005510002183097519
185,NSP1,POM34,90.0,0.24866390835734764,0.007116242601745415,0.318903385822299,0.006186584606626162
186,NSP1,SEC13,30.0,0.0754765996328876,0.0011784078218680665,0.08839275210304624,0.003903929673820686
187,NSP1,SEC13,60.0,0.17590942247753402,0.003077865499616564,0.19834604275586698,0.005510002183097519
188,NSP1,SEC13,90.0,0.300813454822002,0.0026634521148627736,0.318903385822299,0.006186584606626162
189,NSP1,SEH1,30.0,0.017419659469649535,0.0011890886833174914,0.08839275210304624,0.003903929673820686
190,NSP1,SEH1,60.0,0.0635820281834584,0.003870392264426456,0.19834604275586698,0.005510002183097519
191,NSP1,SEH1,90.0,0.14832844827377933,0.003590955073838277,0.318903385822299,0.006186584606626162
192,NUP1,GLE1,30.0,0.03871482562090387,0.0033738551677155327,0.09487438053080387,0.006453523659649291
193,NUP1,GLE1,60.0,0.135829109841297,0.00949922741099544,0.2054829861731763,0.008883010057219283
194,NUP1,GLE1,90.0,0.22480626973534934,0.011654352736732855,0.3214457129909977,0.004605427473397203
195,NUP1,GLE2,30.0,0.044479207852432534,0.005076172692109103,0.09487438053080387,0.006453523659649291
196,NUP1,GLE2,60.0,0.14077906755073533,0.00429796667255346,0.2054829861731763,0.008883010057219283
197,NUP1,GLE2,90.0,0.25095578437518934,0.004263274592007795,0.3214457129909977,0.004605427473397203
198,NUP1,MLP1,30.0,0.0357848457182807,0.00421801820905965,0.09487438053080387,0.006453523659649291
199,NUP1,MLP1,60.0,0.108580668829181,0.002613853700997718,0.2054829861731763,0.008883010057219283
200,NUP1,MLP1,90.0,0.2058789196609,0.005233948607941273,0.3214457129909977,0.004605427473397203
201,NUP1,MLP2,30.0,0.0653001780532686,0.0073216061457218136,0.09487438053080387,0.006453523659649291
202,NUP1,MLP2,60.0,0.171070967888022,0.007016740229515753,0.2054829861731763,0.008883010057219283
203,NUP1,MLP2,90.0,0.2875999299885043,0.004695954668485189,0.3214457129909977,0.004605427473397203
204,NUP1,NDC1,30.0,0.07400170375283197,0.004999587254790681,0.09487438053080387,0.006453523659649291
205,NUP1,NDC1,60.0,0.178261534982042,0.007177159062875258,0.2054829861731763,0.008883010057219283
206,NUP1,NDC1,90.0,0.286061497496153,0.005544916956361809,0.3214457129909977,0.004605427473397203
207,NUP1,NIC96,30.0,0.07264742621237741,0.005731098694752361,0.09487438053080387,0.006453523659649291
208,NUP1,NIC96,60.0,0.186762875175976,0.007460007657391995,0.2054829861731763,0.008883010057219283
209,NUP1,NIC96,90.0,0.307355860324979,0.0032085158323641103,0.3214457129909977,0.004605427473397203
210,NUP1,NSP1,30.0,0.018129908941921968,0.0036558059305471053,0.09487438053080387,0.006453523659649291
211,NUP1,NSP1,60.0,0.07886902351579417,0.0046368986782768865,0.2054829861731763,0.008883010057219283
212,NUP1,NSP1,90.0,0.17391428886175866,0.0029230358274397643,0.3214457129909977,0.004605427473397203
213,NUP1,NUP1,30.0,0.12762294718902667,0.006511178746708314,0.09487438053080387,0.006453523659649291
214,NUP1,NUP1,60.0,0.266093655520845,0.010456261038534686,0.2054829861731763,0.008883010057219283
215,NUP1,NUP1,90.0,0.3928792993462847,0.004874306457044785,0.3214457129909977,0.004605427473397203
216,NUP1,NUP100,30.0,0.072037281015383,0.00520832865902821,0.09487438053080387,0.006453523659649291
217,NUP1,NUP100,60.0,0.178072953080975,0.00945877904033204,0.2054829861731763,0.008883010057219283
218,NUP1,NUP100,90.0,0.29651501719999634,0.0019105871606144818,0.3214457129909977,0.004605427473397203
219,NUP1,NUP116,30.0,0.07940441961544915,0.0033853723163974215,0.09487438053080387,0.006453523659649291
220,NUP1,NUP116,60.0,0.188977839010821,0.006650157488682978,0.2054829861731763,0.008883010057219283
221,NUP1,NUP116,90.0,0.30262512392836666,0.003039191952092447,0.3214457129909977,0.004605427473397203
222,NUP1,NUP120,30.0,0.05566675242657243,0.0051017772666735045,0.09487438053080387,0.006453523659649291
223,NUP1,NUP120,60.0,0.16104769866047633,0.007746888830822748,0.2054829861731763,0.008883010057219283
224,NUP1,NUP120,90.0,0.2820582437807703,0.003034849561851951,0.3214457129909977,0.004605427473397203
225,NUP1,NUP133,30.0,0.026869562583863433,0.003633774214977602,0.09487438053080387,0.006453523659649291
226,NUP1,NUP133,60.0,0.0942023236238226,0.004205696051716628,0.2054829861731763,0.008883010057219283
227,NUP1,NUP133,90.0,0.19026079297373633,0.0025274878472125698,0.3214457129909977,0.004605427473397203
228,NUP1,NUP145C,30.0,0.06850523106901374,0.004156484910588757,0.09487438053080387,0.006453523659649291
229,NUP1,NUP145C,60.0,0.17590276157951734,0.007512226008508911,0.2054829861731763,0.008883010057219283
230,NUP1,NUP145C,90.0,0.29396307696086166,0.0025203212574858793,0.3214457129909977,0.004605427473397203
231,NUP1,NUP145N,30.0,0.07111247872263589,0.004879824830093925,0.09487438053080387,0.006453523659649291
232,NUP1,NUP145N,60.0,0.17345084852457235,0.008249540595670199,0.2054829861731763,0.008883010057219283
233,NUP1,NUP145N,90.0,0.288780326243105,0.0020272772668149335,0.3214457129909977,0.004605427473397203
234,NUP1,NUP157,30.0,0.045422820633154504,0.00619419211421254,0.09487438053080387,0.006453523659649291
235,NUP1,NUP157,60.0,0.135027341140522,0.006198878120477992,0.2054829861731763,0.008883010057219283
236,NUP1,NUP157,90.0,0.2480607781027607,0.003751523748292792,0.3214457129909977,0.004605427473397203
237,NUP1,NUP159,30.0,0.037882440616218836,0.0046834247984661554,0.09487438053080387,0.006453523659649291
238,NUP1,NUP159,60.0,0.12361790006076033,0.007296943544805572,0.2054829861731763,0.008883010057219283
239,NUP1,NUP159,90.0,0.2342943651931557,0.0007954188814409618,0.3214457129909977,0.004605427473397203
240,NUP1,NUP170,30.0,0.0536923213657938,0.004648837588021326,0.09487438053080387,0.006453523659649291
241,NUP1,NUP170,60.0,0.15186708398789198,0.008446078279703948,0.2054829861731763,0.008883010057219283
242,NUP1,NUP170,90.0,0.2699054580324607,0.004170300524063309,0.3214457129909977,0.004605427473397203
243,NUP1,NUP188,30.0,0.026156381313643968,0.002812767836183428,0.09487438053080387,0.006453523659649291
244,NUP1,NUP188,60.0,0.0924859086757905,0.004539576442712127,0.2054829861731763,0.008883010057219283
245,NUP1,NUP188,90.0,0.18496200552249634,0.003742504982383446,0.3214457129909977,0.004605427473397203
246,NUP1,NUP192,30.0,0.04065488949683633,0.004471553580032896,0.09487438053080387,0.006453523659649291
247,NUP1,NUP192,60.0,0.128809798043055,0.00699543986022817,0.2054829861731763,0.008883010057219283
248,NUP1,NUP192,90.0,0.239646473353189,0.0030237430645401625,0.3214457129909977,0.004605427473397203
249,NUP1,NUP2,30.0,0.08625773820211637,0.00338136378430119,0.09487438053080387,0.006453523659649291
250,NUP1,NUP2,60.0,0.19612024628425564,0.0057029249618194945,0.2054829861731763,0.008883010057219283
251,NUP1,NUP2,90.0,0.3111959039413957,0.002357912788865055,0.3214457129909977,0.004605427473397203
252,NUP1,NUP49,30.0,0.0625257909360847,0.004207381178356872,0.09487438053080387,0.006453523659649291
253,NUP1,NUP49,60.0,0.1717843500081677,0.008833505155565127,0.2054829861731763,0.008883010057219283
254,NUP1,NUP49,90.0,0.29147056832843266,0.002518157774661781,0.3214457129909977,0.004605427473397203
255,NUP1,NUP53,30.0,0.06880100271336934,0.005509604318871506,0.09487438053080387,0.006453523659649291
256,NUP1,NUP53,60.0,0.17024254764464733,0.008822316787489516,0.2054829861731763,0.008883010057219283
257,NUP1,NUP53,90.0,0.2862950047430686,0.004906532989704751,0.3214457129909977,0.004605427473397203
258,NUP1,NUP57,30.0,0.05360172588174153,0.004239343091380125,0.09487438053080387,0.006453523659649291
259,NUP1,NUP57,60.0,0.16198745898835265,0.009622832875024799,0.2054829861731763,0.008883010057219283
260,NUP1,NUP57,90.0,0.2825083109448833,0.0034536639124543487,0.3214457129909977,0.004605427473397203
261,NUP1,NUP59,30.0,0.0924327307446619,0.004855984723177959,0.09487438053080387,0.006453523659649291
262,NUP1,NUP59,60.0,0.21086379344023867,0.00783621342112272,0.2054829861731763,0.008883010057219283
263,NUP1,NUP59,90.0,0.333322816086412,0.0042420158240550915,0.3214457129909977,0.004605427473397203
264,NUP1,NUP60,30.0,0.09401730597623387,0.007171099705775275,0.09487438053080387,0.006453523659649291
265,NUP1,NUP60,60.0,0.21320829446048065,0.008263828673141635,0.2054829861731763,0.008883010057219283
266,NUP1,NUP60,90.0,0.3343924406737189,0.0044945054653262794,0.3214457129909977,0.004605427473397203
267,NUP1,NUP82,30.0,0.05108158938743846,0.0032648632847394423,0.09487438053080387,0.006453523659649291
268,NUP1,NUP82,60.0,0.145800562140385,0.009562046450619404,0.2054829861731763,0.008883010057219283
269,NUP1,NUP82,90.0,0.258080050271383,0.002358800260438644,0.3214457129909977,0.004605427473397203
270,NUP1,NUP84,30.0,0.042163594588654964,0.004992727817471552,0.09487438053080387,0.006453523659649291
271,NUP1,NUP84,60.0,0.13736335681412534,0.008353261182158407,0.2054829861731763,0.008883010057219283
272,NUP1,NUP84,90.0,0.2510176705656033,0.0015878992740832557,0.3214457129909977,0.004605427473397203
273,NUP1,NUP85,30.0,0.05105957197598306,0.004547874470079303,0.09487438053080387,0.006453523659649291
274,NUP1,NUP85,60.0,0.14960897164371334,0.007563624365355689,0.2054829861731763,0.008883010057219283
275,NUP1,NUP85,90.0,0.26864420649254167,0.0023556449188186722,0.3214457129909977,0.004605427473397203
276,NUP1,POM152,30.0,0.04373242410179537,0.0045908387246543295,0.09487438053080387,0.006453523659649291
277,NUP1,POM152,60.0,0.13736555181187302,0.008010347995504964,0.2054829861731763,0.008883010057219283
278,NUP1,POM152,90.0,0.25478178047845,0.0037024268138990835,0.3214457129909977,0.004605427473397203
279,NUP1,POM34,30.0,0.055329944991909664,0.0050374321419143575,0.09487438053080387,0.006453523659649291
280,NUP1,POM34,60.0,0.155435291207078,0.008659957644309633,0.2054829861731763,0.008883010057219283
281,NUP1,POM34,90.0,0.27105459769800666,0.0032352470927428495,0.3214457129909977,0.004605427473397203
282,NUP1,SEC13,30.0,0.08647480692822528,0.005159247349391532,0.09487438053080387,0.006453523659649291
283,NUP1,SEC13,60.0,0.19906433875524834,0.008048529318275408,0.2054829861731763,0.008883010057219283
284,NUP1,SEC13,90.0,0.31954385758818366,0.0035446644562971232,0.3214457129909977,0.004605427473397203
285,NUP1,SEH1,30.0,0.016109682222553132,0.0039429423798810394,0.09487438053080387,0.006453523659649291
286,NUP1,SEH1,60.0,0.0716052082042357,0.0028426593790670477,0.2054829861731763,0.008883010057219283
287,NUP1,SEH1,90.0,0.16811642627830833,0.0019038792956446772,0.3214457129909977,0.004605427473397203
288,NUP133,GLE1,30.0,0.08561715411480807,0.0030409636056722114,0.08783008986044354,0.002505446950289776
289,NUP133,GLE1,60.0,0.201439693976477,0.004709535532480369,0.199048795377654,0.0021675960584722886
290,NUP133,GLE1,90.0,0.3346952922760667,0.008033649801358568,0.303143203944327,0.002175760426871561
291,NUP133,GLE2,30.0,0.04638841219023467,0.0011983590146926796,0.08783008986044354,0.002505446950289776
292,NUP133,GLE2,60.0,0.143370204461114,0.0021036072269557476,0.199048795377654,0.0021675960584722886
293,NUP133,GLE2,90.0,0.2555405352388527,0.0029377492654242793,0.303143203944327,0.002175760426871561
294,NUP133,MLP1,30.0,0.035523941312194364,0.0015036988574782615,0.08783008986044354,0.002505446950289776
295,NUP133,MLP1,60.0,0.10234918776498365,0.0029995702978516145,0.199048795377654,0.0021675960584722886
296,NUP133,MLP1,90.0,0.195026527497418,0.0019257328146489337,0.303143203944327,0.002175760426871561
297,NUP133,MLP2,30.0,0.05727553734034516,0.0016788121813220561,0.08783008986044354,0.002505446950289776
298,NUP133,MLP2,60.0,0.15150904720494998,0.000991195366281052,0.199048795377654,0.0021675960584722886
299,NUP133,MLP2,90.0,0.26229589398577163,0.0030545339258472044,0.303143203944327,0.002175760426871561
300,NUP133,NDC1,30.0,0.07598363851751354,0.0022333277650068103,0.08783008986044354,0.002505446950289776
301,NUP133,NDC1,60.0,0.18001487899344001,0.0027580337011159787,0.199048795377654,0.0021675960584722886
302,NUP133,NDC1,90.0,0.2834416157221557,0.0057323588902022425,0.303143203944327,0.002175760426871561
303,NUP133,NIC96,30.0,0.07587720658822227,0.0016767481156668518,0.08783008986044354,0.002505446950289776
304,NUP133,NIC96,60.0,0.18931652769170168,0.0022608670735495984,0.199048795377654,0.0021675960584722886
305,NUP133,NIC96,90.0,0.30624815944253064,0.004821910552834222,0.303143203944327,0.002175760426871561
306,NUP133,NSP1,30.0,0.019221348748209934,0.000857682539597866,0.08783008986044354,0.002505446950289776
307,NUP133,NSP1,60.0,0.08219155224677484,0.0015724730390805066,0.199048795377654,0.0021675960584722886
308,NUP133,NSP1,90.0,0.17551690030206166,0.004407918410790775,0.303143203944327,0.002175760426871561
309,NUP133,NUP1,30.0,0.0976338813992632,0.0021117362656535247,0.08783008986044354,0.002505446950289776
310,NUP133,NUP1,60.0,0.21468444168972534,0.0017478772614129444,0.199048795377654,0.0021675960584722886
311,NUP133,NUP1,90.0,0.332785410955078,0.0022947913845036685,0.303143203944327,0.002175760426871561
312,NUP133,NUP100,30.0,0.07737472374971056,0.0019174506844705432,0.08783008986044354,0.002505446950289776
313,NUP133,NUP100,60.0,0.18400577116514835,0.004999582567257074,0.199048795377654,0.0021675960584722886
314,NUP133,NUP100,90.0,0.3016990290903223,0.007476922527139154,0.303143203944327,0.002175760426871561
315,NUP133,NUP116,30.0,0.07869473936263997,0.0011754531224895568,0.08783008986044354,0.002505446950289776
316,NUP133,NUP116,60.0,0.186551963705387,0.0027349877404988865,0.199048795377654,0.0021675960584722886
317,NUP133,NUP116,90.0,0.297275091052957,0.0029820881885840784,0.303143203944327,0.002175760426871561
318,NUP133,NUP120,30.0,0.08659030456968826,0.0022402169113998186,0.08783008986044354,0.002505446950289776
319,NUP133,NUP120,60.0,0.20503896906370034,0.001608479710547374,0.199048795377654,0.0021675960584722886
320,NUP133,NUP120,90.0,0.32389176233329436,0.0017832693198592243,0.303143203944327,0.002175760426871561
321,NUP133,NUP133,30.0,0.11321957637446667,0.002550093384703919,0.08783008986044354,0.002505446950289776
322,NUP133,NUP133,60.0,0.24571704997280633,0.0023495814591726785,0.199048795377654,0.0021675960584722886
323,NUP133,NUP133,90.0,0.36095029528853234,0.0015743036643364003,0.303143203944327,0.002175760426871561
324,NUP133,NUP145C,30.0,0.126153862701302,0.0020562085496071423,0.08783008986044354,0.002505446950289776
325,NUP133,NUP145C,60.0,0.24475643555933935,0.0029298154631644097,0.199048795377654,0.0021675960584722886
326,NUP133,NUP145C,90.0,0.35754529725299133,0.001957551012822574,0.303143203944327,0.002175760426871561
327,NUP133,NUP145N,30.0,0.0941241479804217,0.00226884665776007,0.08783008986044354,0.002505446950289776
328,NUP133,NUP145N,60.0,0.20760516246582164,0.002304622680279335,0.199048795377654,0.0021675960584722886
329,NUP133,NUP145N,90.0,0.3256841255667737,0.004299051335475789,0.303143203944327,0.002175760426871561
330,NUP133,NUP157,30.0,0.05001741497133416,0.0010880137619768328,0.08783008986044354,0.002505446950289776
331,NUP133,NUP157,60.0,0.14551938067010464,0.0017124664832046498,0.199048795377654,0.0021675960584722886
332,NUP133,NUP157,90.0,0.25520692648217264,0.0037188985951143155,0.303143203944327,0.002175760426871561
333,NUP133,NUP159,30.0,0.050102457830614934,0.002814354002142314,0.08783008986044354,0.002505446950289776
334,NUP133,NUP159,60.0,0.14724785745497768,0.0014192996073743806,0.199048795377654,0.0021675960584722886
335,NUP133,NUP159,90.0,0.264824919373081,0.007769230773020124,0.303143203944327,0.002175760426871561
336,NUP133,NUP170,30.0,0.05972938811873749,0.0018219375283014402,0.08783008986044354,0.002505446950289776
337,NUP133,NUP170,60.0,0.16133039074222733,0.0005587148273479852,0.199048795377654,0.0021675960584722886
338,NUP133,NUP170,90.0,0.2764514805688987,0.005110193395928384,0.303143203944327,0.002175760426871561
339,NUP133,NUP188,30.0,0.02581471897380233,0.0009157745863450399,0.08783008986044354,0.002505446950289776
340,NUP133,NUP188,60.0,0.0931854423955928,0.002660237350724911,0.199048795377654,0.0021675960584722886
341,NUP133,NUP188,90.0,0.18416000432441168,0.003335445002390139,0.303143203944327,0.002175760426871561
342,NUP133,NUP192,30.0,0.040809878623643665,0.0014136078120466457,0.08783008986044354,0.002505446950289776
343,NUP133,NUP192,60.0,0.13011094407197732,0.0006972280265954489,0.199048795377654,0.0021675960584722886
344,NUP133,NUP192,90.0,0.24035395734258733,0.0039057738372310284,0.303143203944327,0.002175760426871561
345,NUP133,NUP2,30.0,0.0881766203265203,0.003060249809707811,0.08783008986044354,0.002505446950289776
346,NUP133,NUP2,60.0,0.19334120915117034,0.0010083341546522837,0.199048795377654,0.0021675960584722886
347,NUP133,NUP2,90.0,0.3030609638039157,0.0019329054484452635,0.303143203944327,0.002175760426871561
348,NUP133,NUP49,30.0,0.056412169591517035,0.0015321305235431084,0.08783008986044354,0.002505446950289776
349,NUP133,NUP49,60.0,0.16098756491560764,0.001995808690778813,0.199048795377654,0.0021675960584722886
350,NUP133,NUP49,90.0,0.272311243008027,0.000971941241002187,0.303143203944327,0.002175760426871561
351,NUP133,NUP53,30.0,0.0743847008478478,0.0010936166544890215,0.08783008986044354,0.002505446950289776
352,NUP133,NUP53,60.0,0.17415763089411332,0.0019968395680765826,0.199048795377654,0.0021675960584722886
353,NUP133,NUP53,90.0,0.28368726226560664,0.0034137215641701197,0.303143203944327,0.002175760426871561
354,NUP133,NUP57,30.0,0.053770653774228704,0.0006553442909597159,0.08783008986044354,0.002505446950289776
355,NUP133,NUP57,60.0,0.16197601660220265,0.0021368762155159382,0.199048795377654,0.0021675960584722886
356,NUP133,NUP57,90.0,0.27986038490669635,0.0022580998007806605,0.303143203944327,0.002175760426871561
357,NUP133,NUP59,30.0,0.0867109548843397,0.0008243245674157263,0.08783008986044354,0.002505446950289776
358,NUP133,NUP59,60.0,0.205197684798097,0.0024809721212774726,0.199048795377654,0.0021675960584722886
359,NUP133,NUP59,90.0,0.3253355688125777,0.0015856151021155192,0.303143203944327,0.002175760426871561
360,NUP133,NUP60,30.0,0.09075449125393827,0.0019095535309851855,0.08783008986044354,0.002505446950289776
361,NUP133,NUP60,60.0,0.20360781889122367,0.0016359310687788374,0.199048795377654,0.0021675960584722886
362,NUP133,NUP60,90.0,0.320527666655754,0.004088143961603101,0.303143203944327,0.002175760426871561
363,NUP133,NUP82,30.0,0.06629650607045853,0.0014721263583979095,0.08783008986044354,0.002505446950289776
364,NUP133,NUP82,60.0,0.16890780279709802,0.0013725931604300703,0.199048795377654,0.0021675960584722886
365,NUP133,NUP82,90.0,0.287662423981681,0.006641451161660658,0.303143203944327,0.002175760426871561
366,NUP133,NUP84,30.0,0.13069960698332464,0.001945151300058471,0.08783008986044354,0.002505446950289776
367,NUP133,NUP84,60.0,0.26100233519780597,0.00383796728316573,0.199048795377654,0.0021675960584722886
368,NUP133,NUP84,90.0,0.37656881316131097,0.0014575749596466392,0.303143203944327,0.002175760426871561
369,NUP133,NUP85,30.0,0.09701609496349833,0.0024932396094822016,0.08783008986044354,0.002505446950289776
370,NUP133,NUP85,60.0,0.21995137208154802,0.0008317989741421708,0.199048795377654,0.0021675960584722886
371,NUP133,NUP85,90.0,0.3400483512850094,0.0025789118861819188,0.303143203944327,0.002175760426871561
372,NUP133,POM152,30.0,0.044388958786692335,0.0015166451846805836,0.08783008986044354,0.002505446950289776
373,NUP133,POM152,60.0,0.13608515396960066,0.0006146720912015938,0.199048795377654,0.0021675960584722886
374,NUP133,POM152,90.0,0.2486803664462077,0.0035613029546113476,0.303143203944327,0.002175760426871561
375,NUP133,POM34,30.0,0.059318845984766104,0.0017370693495192293,0.08783008986044354,0.002505446950289776
376,NUP133,POM34,60.0,0.162487449546908,0.0018033416046897054,0.199048795377654,0.0021675960584722886
377,NUP133,POM34,90.0,0.27450888108845767,0.0029274388441173603,0.303143203944327,0.002175760426871561
378,NUP133,SEC13,30.0,0.11000460549515667,0.0015365888551438435,0.08783008986044354,0.002505446950289776
379,NUP133,SEC13,60.0,0.22226685906061464,0.0014746368075510064,0.199048795377654,0.0021675960584722886
380,NUP133,SEC13,90.0,0.34153252363326797,0.0015653092393876702,0.303143203944327,0.002175760426871561
381,NUP133,SEH1,30.0,0.026970605302690336,0.0007012044492773253,0.08783008986044354,0.002505446950289776
382,NUP133,SEH1,60.0,0.10270852304994227,0.003062883096675606,0.199048795377654,0.0021675960584722886
383,NUP133,SEH1,90.0,0.20879452365415932,0.0007259746599080415,0.303143203944327,0.002175760426871561
384,NUP159,GLE1,30.0,0.08645637185653421,0.020280578339077055,0.08639659476968393,0.005792306877083647
385,NUP159,GLE1,60.0,0.143006946999996,0.015060212656802806,0.20418147813384802,0.0032765904481327763
386,NUP159,GLE1,90.0,0.24789389066787568,0.014973782875545613,0.31666311326964697,0.008784933990076287
387,NUP159,GLE2,30.0,0.047232693959832095,0.0038637454280822624,0.08639659476968393,0.005792306877083647
388,NUP159,GLE2,60.0,0.14730788467281167,0.00495162387947096,0.20418147813384802,0.0032765904481327763
389,NUP159,GLE2,90.0,0.256620795454994,0.007130524035503742,0.31666311326964697,0.008784933990076287
390,NUP159,MLP1,30.0,0.0323943042216741,0.003196377419962888,0.08639659476968393,0.005792306877083647
391,NUP159,MLP1,60.0,0.108655205915339,0.009405510609494273,0.20418147813384802,0.0032765904481327763
392,NUP159,MLP1,90.0,0.2026838579985363,0.0015907533653956155,0.31666311326964697,0.008784933990076287
393,NUP159,MLP2,30.0,0.05577674851876504,0.004838815973441151,0.08639659476968393,0.005792306877083647
394,NUP159,MLP2,60.0,0.167456217366698,0.005345330660171974,0.20418147813384802,0.0032765904481327763
395,NUP159,MLP2,90.0,0.285185098186771,0.0063556669046004825,0.31666311326964697,0.008784933990076287
396,NUP159,NDC1,30.0,0.06691573571502911,0.0007998430368447699,0.08639659476968393,0.005792306877083647
397,NUP159,NDC1,60.0,0.16727203428035967,0.004644531064921237,0.20418147813384802,0.0032765904481327763
398,NUP159,NDC1,90.0,0.28319714850246164,0.007484300819621293,0.31666311326964697,0.008784933990076287
399,NUP159,NIC96,30.0,0.07345823671450423,0.0031456044611509405,0.08639659476968393,0.005792306877083647
400,NUP159,NIC96,60.0,0.186309810816538,0.0034701570751315314,0.20418147813384802,0.0032765904481327763
401,NUP159,NIC96,90.0,0.306343176732021,0.008920523832191603,0.31666311326964697,0.008784933990076287
402,NUP159,NSP1,30.0,0.03935353207568577,0.0016669985808690406,0.08639659476968393,0.005792306877083647
403,NUP159,NSP1,60.0,0.1362885068237387,0.009730686701134895,0.20418147813384802,0.0032765904481327763
404,NUP159,NSP1,90.0,0.256124262701648,0.008814223519408448,0.31666311326964697,0.008784933990076287
405,NUP159,NUP1,30.0,0.0815796677968969,0.0024336164564453065,0.08639659476968393,0.005792306877083647
406,NUP159,NUP1,60.0,0.19825230075364833,0.0019394805919986813,0.20418147813384802,0.0032765904481327763
407,NUP159,NUP1,90.0,0.3147620781418527,0.007246077890536814,0.31666311326964697,0.008784933990076287
408,NUP159,NUP100,30.0,0.06425708543389863,0.004065102218796424,0.08639659476968393,0.005792306877083647
409,NUP159,NUP100,60.0,0.162579551324314,0.005879597712187082,0.20418147813384802,0.0032765904481327763
410,NUP159,NUP100,90.0,0.282048737304675,0.007715802501658877,0.31666311326964697,0.008784933990076287
411,NUP159,NUP116,30.0,0.07749445984418286,0.0026855582754539012,0.08639659476968393,0.005792306877083647
412,NUP159,NUP116,60.0,0.189348096790403,0.003979004734174744,0.20418147813384802,0.0032765904481327763
413,NUP159,NUP116,90.0,0.30433526890417234,0.009634813324273427,0.31666311326964697,0.008784933990076287
414,NUP159,NUP120,30.0,0.0542010355313249,0.0015073889823937199,0.08639659476968393,0.005792306877083647
415,NUP159,NUP120,60.0,0.14861683865796835,0.004738029964207776,0.20418147813384802,0.0032765904481327763
416,NUP159,NUP120,90.0,0.2664758289866203,0.009238682302394415,0.31666311326964697,0.008784933990076287
417,NUP159,NUP133,30.0,0.027037230210115767,0.0030487112695661662,0.08639659476968393,0.005792306877083647
418,NUP159,NUP133,60.0,0.09653264635920478,0.0012004588500677431,0.20418147813384802,0.0032765904481327763
419,NUP159,NUP133,90.0,0.19750964091623535,0.006792886020265759,0.31666311326964697,0.008784933990076287
420,NUP159,NUP145C,30.0,0.0648666831328048,0.003027535843790319,0.08639659476968393,0.005792306877083647
421,NUP159,NUP145C,60.0,0.16848477379062468,0.0035255713198843403,0.20418147813384802,0.0032765904481327763
422,NUP159,NUP145C,90.0,0.28631875708318266,0.01128215978208012,0.31666311326964697,0.008784933990076287
423,NUP159,NUP145N,30.0,0.07278573572787327,0.0035958646363301425,0.08639659476968393,0.005792306877083647
424,NUP159,NUP145N,60.0,0.17491893816918833,0.0027785731168705596,0.20418147813384802,0.0032765904481327763
425,NUP159,NUP145N,90.0,0.29362542731711433,0.00617971812102041,0.31666311326964697,0.008784933990076287
426,NUP159,NUP157,30.0,0.03903866205950367,0.0020887636078454654,0.08639659476968393,0.005792306877083647
427,NUP159,NUP157,60.0,0.12560106731923867,0.0038217303806456922,0.20418147813384802,0.0032765904481327763
428,NUP159,NUP157,90.0,0.23000211738461898,0.00678615408727053,0.31666311326964697,0.008784933990076287
429,NUP159,NUP159,30.0,0.10934221830464434,0.0025324779684229646,0.08639659476968393,0.005792306877083647
430,NUP159,NUP159,60.0,0.25632708352568934,0.0075958963381877334,0.20418147813384802,0.0032765904481327763
431,NUP159,NUP159,90.0,0.3876454009376496,0.009981835155295318,0.31666311326964697,0.008784933990076287
432,NUP159,NUP170,30.0,0.04624015436667303,0.0031739371654357137,0.08639659476968393,0.005792306877083647
433,NUP159,NUP170,60.0,0.14218158531869698,0.0006770430480367484,0.20418147813384802,0.0032765904481327763
434,NUP159,NUP170,90.0,0.25624735780100566,0.006794682173046978,0.31666311326964697,0.008784933990076287
435,NUP159,NUP188,30.0,0.0244308031849234,0.0016977945442270264,0.08639659476968393,0.005792306877083647
436,NUP159,NUP188,60.0,0.09133129549194746,0.0032181142571844077,0.20418147813384802,0.0032765904481327763
437,NUP159,NUP188,90.0,0.182044395871954,0.005436329278906237,0.31666311326964697,0.008784933990076287
438,NUP159,NUP192,30.0,0.0396036584222845,0.0029640840886119135,0.08639659476968393,0.005792306877083647
439,NUP159,NUP192,60.0,0.12755599523521433,0.002448746805957957,0.20418147813384802,0.0032765904481327763
440,NUP159,NUP192,90.0,0.23820899019555433,0.007740895342331876,0.31666311326964697,0.008784933990076287
441,NUP159,NUP2,30.0,0.08339882099780936,0.0025464480408276253,0.08639659476968393,0.005792306877083647
442,NUP159,NUP2,60.0,0.195277460396346,0.002181629336069415,0.20418147813384802,0.0032765904481327763
443,NUP159,NUP2,90.0,0.306793492200515,0.007151771964241982,0.31666311326964697,0.008784933990076287
444,NUP159,NUP49,30.0,0.04356134942686383,0.0018696304856933052,0.08639659476968393,0.005792306877083647
445,NUP159,NUP49,60.0,0.14718416033090634,0.0009859124212207029,0.20418147813384802,0.0032765904481327763
446,NUP159,NUP49,90.0,0.26101595033023833,0.007211088604806573,0.31666311326964697,0.008784933990076287
447,NUP159,NUP53,30.0,0.07113330824208224,0.002963094217772645,0.08639659476968393,0.005792306877083647
448,NUP159,NUP53,60.0,0.1672710050262607,0.003906259787691545,0.20418147813384802,0.0032765904481327763
449,NUP159,NUP53,90.0,0.27754843797974565,0.004626069176922961,0.31666311326964697,0.008784933990076287
450,NUP159,NUP57,30.0,0.03925958450987027,0.002380621952801091,0.08639659476968393,0.005792306877083647
451,NUP159,NUP57,60.0,0.138679236986598,0.0031449045757369386,0.20418147813384802,0.0032765904481327763
452,NUP159,NUP57,90.0,0.25762976898754936,0.007915074165200143,0.31666311326964697,0.008784933990076287
453,NUP159,NUP59,30.0,0.08010987869330623,0.00045059590548351383,0.08639659476968393,0.005792306877083647
454,NUP159,NUP59,60.0,0.19618315490247565,0.00497474816779734,0.20418147813384802,0.0032765904481327763
455,NUP159,NUP59,90.0,0.31930091864733634,0.008765757720328452,0.31666311326964697,0.008784933990076287
456,NUP159,NUP60,30.0,0.08124962707256284,0.002294646650288874,0.08639659476968393,0.005792306877083647
457,NUP159,NUP60,60.0,0.199710975029605,0.002883188471119205,0.20418147813384802,0.0032765904481327763
458,NUP159,NUP60,90.0,0.322070666385105,0.008600389386699745,0.31666311326964697,0.008784933990076287
459,NUP159,NUP82,30.0,0.126669811224815,0.0014164211841101117,0.08639659476968393,0.005792306877083647
460,NUP159,NUP82,60.0,0.27001821740492,0.011551082669662158,0.20418147813384802,0.0032765904481327763
461,NUP159,NUP82,90.0,0.3992049799796857,0.010072134072125642,0.31666311326964697,0.008784933990076287
462,NUP159,NUP84,30.0,0.030247011946128197,0.0071455738860059705,0.08639659476968393,0.005792306877083647
463,NUP159,NUP84,60.0,0.11540032188620335,0.008548500591398382,0.20418147813384802,0.0032765904481327763
464,NUP159,NUP84,90.0,0.23419946509017,0.011966068292743898,0.31666311326964697,0.008784933990076287
465,NUP159,NUP85,30.0,0.0535297528895984,0.0037195766605124113,0.08639659476968393,0.005792306877083647
466,NUP159,NUP85,60.0,0.149578177719601,0.007344545683988178,0.20418147813384802,0.0032765904481327763
467,NUP159,NUP85,90.0,0.26516858915854397,0.009548062910433386,0.31666311326964697,0.008784933990076287
468,NUP159,POM152,30.0,0.0391544865151433,0.003747301904223236,0.08639659476968393,0.005792306877083647
469,NUP159,POM152,60.0,0.13041296583705334,0.0006501411112165128,0.20418147813384802,0.0032765904481327763
470,NUP159,POM152,90.0,0.24555609649466467,0.008395660675069543,0.31666311326964697,0.008784933990076287
471,NUP159,POM34,30.0,0.04646510221402777,0.003774691210801437,0.08639659476968393,0.005792306877083647
472,NUP159,POM34,60.0,0.145067985362652,0.003541263774406415,0.20418147813384802,0.0032765904481327763
473,NUP159,POM34,90.0,0.25511407888184795,0.007723489851657439,0.31666311326964697,0.008784933990076287
474,NUP159,SEC13,30.0,0.07696622611928626,0.0025045525071739896,0.08639659476968393,0.005792306877083647
475,NUP159,SEC13,60.0,0.18845629235635533,0.0021875612363394807,0.20418147813384802,0.0032765904481327763
476,NUP159,SEC13,90.0,0.30917139627519,0.00881046689385458,0.31666311326964697,0.008784933990076287
477,NUP159,SEH1,30.0,0.0145575629733728,0.0016541876457719957,0.08639659476968393,0.005792306877083647
478,NUP159,SEH1,60.0,0.06813504172205646,0.0023894793929632304,0.20418147813384802,0.0032765904481327763
479,NUP159,SEH1,90.0,0.15864468243266835,0.007843186381458514,0.31666311326964697,0.008784933990076287
480,NUP188,GLE1,30.0,0.06397741642591433,0.007971424176845735,0.08752924869539602,0.0058402113730390975
481,NUP188,GLE1,60.0,0.19062196127213668,0.020083067033058195,0.202599561490218,0.005580229430679999
482,NUP188,GLE1,90.0,0.2658669630407313,0.012988319235541002,0.3151787502019283,0.010738614879207305
483,NUP188,GLE2,30.0,0.05098672266473083,0.00441708855791805,0.08752924869539602,0.0058402113730390975
484,NUP188,GLE2,60.0,0.161562853944194,0.005807838240007957,0.202599561490218,0.005580229430679999
485,NUP188,GLE2,90.0,0.27171968385205236,0.0071468110236255905,0.3151787502019283,0.010738614879207305
486,NUP188,MLP1,30.0,0.042032604108824805,0.003259470464895143,0.08752924869539602,0.0058402113730390975
487,NUP188,MLP1,60.0,0.12944775597289268,0.0032120186850978583,0.202599561490218,0.005580229430679999
488,NUP188,MLP1,90.0,0.238306842162293,0.007537210880882174,0.3151787502019283,0.010738614879207305
489,NUP188,MLP2,30.0,0.06557619836941883,0.0014577556022858109,0.08752924869539602,0.0058402113730390975
490,NUP188,MLP2,60.0,0.18655258359860835,0.006132404634942857,0.202599561490218,0.005580229430679999
491,NUP188,MLP2,90.0,0.30343880842335164,0.010092693196425095,0.3151787502019283,0.010738614879207305
492,NUP188,NDC1,30.0,0.06092027347985937,0.003912889697269812,0.08752924869539602,0.0058402113730390975
493,NUP188,NDC1,60.0,0.17816784667313934,0.0013253332122730352,0.202599561490218,0.005580229430679999
494,NUP188,NDC1,90.0,0.28582565702357304,0.0067377192100247585,0.3151787502019283,0.010738614879207305
495,NUP188,NIC96,30.0,0.06828412867578916,0.002739484878368651,0.08752924869539602,0.0058402113730390975
496,NUP188,NIC96,60.0,0.18669438367621802,0.0014729846927999148,0.202599561490218,0.005580229430679999
497,NUP188,NIC96,90.0,0.30942917134824904,0.008290316769462736,0.3151787502019283,0.010738614879207305
498,NUP188,NSP1,30.0,0.0204006787062409,0.0003543263235727721,0.08752924869539602,0.0058402113730390975
499,NUP188,NSP1,60.0,0.08508307447049744,0.0027014150561036777,0.202599561490218,0.005580229430679999
500,NUP188,NSP1,90.0,0.18475045900711864,0.006293363919815357,0.3151787502019283,0.010738614879207305
501,NUP188,NUP1,30.0,0.09301039357024028,0.00256387069680649,0.08752924869539602,0.0058402113730390975
502,NUP188,NUP1,60.0,0.21947522254302,0.006765447664885662,0.202599561490218,0.005580229430679999
503,NUP188,NUP1,90.0,0.3493057078518073,0.011945606704997728,0.3151787502019283,0.010738614879207305
504,NUP188,NUP100,30.0,0.06685693530991181,0.00036903223354039686,0.08752924869539602,0.0058402113730390975
505,NUP188,NUP100,60.0,0.181157001258372,0.002460765468433114,0.202599561490218,0.005580229430679999
506,NUP188,NUP100,90.0,0.3043526879269767,0.007628159806671549,0.3151787502019283,0.010738614879207305
507,NUP188,NUP116,30.0,0.08333635267864714,0.004828454490143774,0.08752924869539602,0.0058402113730390975
508,NUP188,NUP116,60.0,0.19783500891945502,0.003661779135574145,0.202599561490218,0.005580229430679999
509,NUP188,NUP116,90.0,0.3113308821407867,0.00781847476848378,0.3151787502019283,0.010738614879207305
510,NUP188,NUP120,30.0,0.05575210671045657,0.0027073507432023884,0.08752924869539602,0.0058402113730390975
511,NUP188,NUP120,60.0,0.16989866712795032,0.0008685135189738816,0.202599561490218,0.005580229430679999
512,NUP188,NUP120,90.0,0.28961422744129367,0.006666010763298447,0.3151787502019283,0.010738614879207305
513,NUP188,NUP133,30.0,0.030697787842841332,0.0012786705381514845,0.08752924869539602,0.0058402113730390975
514,NUP188,NUP133,60.0,0.11444612591647767,0.0037601985532342962,0.202599561490218,0.005580229430679999
515,NUP188,NUP133,90.0,0.22360430084331298,0.008069867747910379,0.3151787502019283,0.010738614879207305
516,NUP188,NUP145C,30.0,0.06965949155259833,0.0022328537803073686,0.08752924869539602,0.0058402113730390975
517,NUP188,NUP145C,60.0,0.18386351627261965,0.002703738715554473,0.202599561490218,0.005580229430679999
518,NUP188,NUP145C,90.0,0.30750002456082,0.010885209265882453,0.3151787502019283,0.010738614879207305
519,NUP188,NUP145N,30.0,0.08034321324107734,0.0016982989891407931,0.08752924869539602,0.0058402113730390975
520,NUP188,NUP145N,60.0,0.19543426997219634,0.004338652907286463,0.202599561490218,0.005580229430679999
521,NUP188,NUP145N,90.0,0.3233503430505877,0.006578719568477184,0.3151787502019283,0.010738614879207305
522,NUP188,NUP157,30.0,0.050170129108403495,0.002485760804948643,0.08752924869539602,0.0058402113730390975
523,NUP188,NUP157,60.0,0.151645237710918,0.003928303950854698,0.202599561490218,0.005580229430679999
524,NUP188,NUP157,90.0,0.2690047436796547,0.007062151760791755,0.3151787502019283,0.010738614879207305
525,NUP188,NUP159,30.0,0.04368928024052443,0.0009908794731282376,0.08752924869539602,0.0058402113730390975
526,NUP188,NUP159,60.0,0.146848273523469,0.0024014986808091176,0.202599561490218,0.005580229430679999
527,NUP188,NUP159,90.0,0.26492370294524004,0.009176807242321065,0.3151787502019283,0.010738614879207305
528,NUP188,NUP170,30.0,0.058187913513109805,0.0006771207100759265,0.08752924869539602,0.0058402113730390975
529,NUP188,NUP170,60.0,0.16919469897428832,0.005323721713804354,0.202599561490218,0.005580229430679999
530,NUP188,NUP170,90.0,0.2915795153554803,0.007468445639215115,0.3151787502019283,0.010738614879207305
531,NUP188,NUP188,30.0,0.14602017949549168,0.004951936851057782,0.08752924869539602,0.0058402113730390975
532,NUP188,NUP188,60.0,0.31631894168907565,0.005642756093242318,0.202599561490218,0.005580229430679999
533,NUP188,NUP188,90.0,0.45483793757715335,0.008112565919514732,0.3151787502019283,0.010738614879207305
534,NUP188,NUP192,30.0,0.04637166211269523,0.0014929864880414696,0.08752924869539602,0.0058402113730390975
535,NUP188,NUP192,60.0,0.14634960779907832,0.003810717849486803,0.202599561490218,0.005580229430679999
536,NUP188,NUP192,90.0,0.26518708092668436,0.007245279617916665,0.3151787502019283,0.010738614879207305
537,NUP188,NUP2,30.0,0.08186532677710656,0.0016854154071220004,0.08752924869539602,0.0058402113730390975
538,NUP188,NUP2,60.0,0.195324757376783,0.005547042461451789,0.202599561490218,0.005580229430679999
539,NUP188,NUP2,90.0,0.3101138644453147,0.012165663518708984,0.3151787502019283,0.010738614879207305
540,NUP188,NUP49,30.0,0.052373256965273396,0.0013010274100164524,0.08752924869539602,0.0058402113730390975
541,NUP188,NUP49,60.0,0.166627299637985,0.0022140278747460056,0.202599561490218,0.005580229430679999
542,NUP188,NUP49,90.0,0.2868027249055343,0.0061796597159883265,0.3151787502019283,0.010738614879207305
543,NUP188,NUP53,30.0,0.07551517310310624,0.0030059149902477472,0.08752924869539602,0.0058402113730390975
544,NUP188,NUP53,60.0,0.19149830674063031,0.0011479762389672154,0.202599561490218,0.005580229430679999
545,NUP188,NUP53,90.0,0.3081201539322033,0.006379094431373741,0.3151787502019283,0.010738614879207305
546,NUP188,NUP57,30.0,0.06025239556520137,0.0020978834711367134,0.08752924869539602,0.0058402113730390975
547,NUP188,NUP57,60.0,0.17048951019406,0.002060862779476415,0.202599561490218,0.005580229430679999
548,NUP188,NUP57,90.0,0.296610771779577,0.006572532054319237,0.3151787502019283,0.010738614879207305
549,NUP188,NUP59,30.0,0.0811946717149651,0.005969858563632898,0.08752924869539602,0.0058402113730390975
550,NUP188,NUP59,60.0,0.20724384648967265,0.001309854565597662,0.202599561490218,0.005580229430679999
551,NUP188,NUP59,90.0,0.331708296348183,0.005960007599367484,0.3151787502019283,0.010738614879207305
552,NUP188,NUP60,30.0,0.07910040381316197,0.0011817831645948593,0.08752924869539602,0.0058402113730390975
553,NUP188,NUP60,60.0,0.20231099816139766,0.005936867732962092,0.202599561490218,0.005580229430679999
554,NUP188,NUP60,90.0,0.325804691873251,0.01019744584027981,0.3151787502019283,0.010738614879207305
555,NUP188,NUP82,30.0,0.0540490364310823,0.0020611363046128257,0.08752924869539602,0.0058402113730390975
556,NUP188,NUP82,60.0,0.165252356903264,0.0003856755492190514,0.202599561490218,0.005580229430679999
557,NUP188,NUP82,90.0,0.2857464705846973,0.007477505678493143,0.3151787502019283,0.010738614879207305
558,NUP188,NUP84,30.0,0.04105784444096697,0.007493405161829332,0.08752924869539602,0.0058402113730390975
559,NUP188,NUP84,60.0,0.150978393526354,0.002433165668354803,0.202599561490218,0.005580229430679999
560,NUP188,NUP84,90.0,0.27379841347648837,0.009911536206653387,0.3151787502019283,0.010738614879207305
561,NUP188,NUP85,30.0,0.05665605512055207,0.0034898112032626274,0.08752924869539602,0.0058402113730390975
562,NUP188,NUP85,60.0,0.168678382644921,0.0030635334923197256,0.202599561490218,0.005580229430679999
563,NUP188,NUP85,90.0,0.291824284922796,0.006658128203617756,0.3151787502019283,0.010738614879207305
564,NUP188,POM152,30.0,0.05081830191966286,0.0037110905069309722,0.08752924869539602,0.0058402113730390975
565,NUP188,POM152,60.0,0.157327719211904,0.002618952220230847,0.202599561490218,0.005580229430679999
566,NUP188,POM152,90.0,0.28003857969699636,0.006879814417189271,0.3151787502019283,0.010738614879207305
567,NUP188,POM34,30.0,0.06757199009783431,0.002601585017255423,0.08752924869539602,0.0058402113730390975
568,NUP188,POM34,60.0,0.17673466649246236,0.006875655111190581,0.202599561490218,0.005580229430679999
569,NUP188,POM34,90.0,0.291227410613645,0.00549119879928284,0.3151787502019283,0.010738614879207305
570,NUP188,SEC13,30.0,0.08367226793098786,0.0028713158685680995,0.08752924869539602,0.0058402113730390975
571,NUP188,SEC13,60.0,0.2043130249938653,0.0003037675844665613,0.202599561490218,0.005580229430679999
572,NUP188,SEC13,90.0,0.3277409726837213,0.008325384053934378,0.3151787502019283,0.010738614879207305
573,NUP188,SEH1,30.0,0.0136005807948921,0.0026748858515322138,0.08752924869539602,0.0058402113730390975
574,NUP188,SEH1,60.0,0.08534713507025943,0.0035958392659050493,0.202599561490218,0.005580229430679999
575,NUP188,SEH1,90.0,0.19318907070598534,0.0041932363871261605,0.3151787502019283,0.010738614879207305
576,NUP57,GLE1,30.0,0.07981543001193721,0.015156382400601024,0.08522892447011467,0.0005374638476481595
577,NUP57,GLE1,60.0,0.17354881947305867,0.004133906768513754,0.20340004890043736,0.0077307506572601185
578,NUP57,GLE1,90.0,0.32034472687800936,0.0039407413441201605,0.319278928831386,0.0010675857595445683
579,NUP57,GLE2,30.0,0.044844678020449426,0.0008289750377287093,0.08522892447011467,0.0005374638476481595
580,NUP57,GLE2,60.0,0.14393114338161334,0.005897382217229361,0.20340004890043736,0.0077307506572601185
581,NUP57,GLE2,90.0,0.25043893808442136,0.0032763790710994946,0.319278928831386,0.0010675857595445683
582,NUP57,MLP1,30.0,0.0323998898639569,0.0015666847350153535,0.08522892447011467,0.0005374638476481595
583,NUP57,MLP1,60.0,0.11505929774000867,0.006388692209735223,0.20340004890043736,0.0077307506572601185
584,NUP57,MLP1,90.0,0.210900621959061,0.0016364621267116073,0.319278928831386,0.0010675857595445683
585,NUP57,MLP2,30.0,0.059275415977528605,0.0016652605474368,0.08522892447011467,0.0005374638476481595
586,NUP57,MLP2,60.0,0.17067422255014,0.00841237526824828,0.20340004890043736,0.0077307506572601185
587,NUP57,MLP2,90.0,0.2867642971850473,0.0023626052392003907,0.319278928831386,0.0010675857595445683
588,NUP57,NDC1,30.0,0.0667641869627094,0.0025777040936459275,0.08522892447011467,0.0005374638476481595
589,NUP57,NDC1,60.0,0.17281369385262435,0.008793132159458055,0.20340004890043736,0.0077307506572601185
590,NUP57,NDC1,90.0,0.280493643748421,0.005260376788886814,0.319278928831386,0.0010675857595445683
591,NUP57,NIC96,30.0,0.0829366989655526,0.00200190187636507,0.08522892447011467,0.0005374638476481595
592,NUP57,NIC96,60.0,0.20426531304196002,0.00633930230831664,0.20340004890043736,0.0077307506572601185
593,NUP57,NIC96,90.0,0.3206218871159873,0.0012767628396693925,0.319278928831386,0.0010675857595445683
594,NUP57,NSP1,30.0,0.03510530063877513,0.0007150432674761501,0.08522892447011467,0.0005374638476481595
595,NUP57,NSP1,60.0,0.118616147686303,0.005972985253509808,0.20340004890043736,0.0077307506572601185
596,NUP57,NSP1,90.0,0.22135719762533368,0.002286011715867483,0.319278928831386,0.0010675857595445683
597,NUP57,NUP1,30.0,0.08376136496208735,0.0030329839544857564,0.08522892447011467,0.0005374638476481595
598,NUP57,NUP1,60.0,0.21126526734684867,0.007386945603669358,0.20340004890043736,0.0077307506572601185
599,NUP57,NUP1,90.0,0.3365450919123317,0.002516822036496808,0.319278928831386,0.0010675857595445683
600,NUP57,NUP100,30.0,0.0606549813853293,0.0012914400881490437,0.08522892447011467,0.0005374638476481595
601,NUP57,NUP100,60.0,0.17085831961785167,0.005753284625102432,0.20340004890043736,0.0077307506572601185
602,NUP57,NUP100,90.0,0.287377413616357,0.001966779827341968,0.319278928831386,0.0010675857595445683
603,NUP57,NUP116,30.0,0.06988280566138047,0.0004102207407612088,0.08522892447011467,0.0005374638476481595
604,NUP57,NUP116,60.0,0.184265316160791,0.005835720870184009,0.20340004890043736,0.0077307506572601185
605,NUP57,NUP116,90.0,0.296209507641271,0.0018876422280624686,0.319278928831386,0.0010675857595445683
606,NUP57,NUP120,30.0,0.048497105577046305,0.0010033073263888968,0.08522892447011467,0.0005374638476481595
607,NUP57,NUP120,60.0,0.155679117196512,0.005585070774320839,0.20340004890043736,0.0077307506572601185
608,NUP57,NUP120,90.0,0.273982666193481,0.0005639850606085165,0.319278928831386,0.0010675857595445683
609,NUP57,NUP133,30.0,0.024993463048283066,0.00014893568244868954,0.08522892447011467,0.0005374638476481595
610,NUP57,NUP133,60.0,0.09591875293209423,0.00501396612537185,0.20340004890043736,0.0077307506572601185
611,NUP57,NUP133,90.0,0.19327424165070797,0.002481992919170542,0.319278928831386,0.0010675857595445683
612,NUP57,NUP145C,30.0,0.057352818460193966,0.0008590512477290969,0.08522892447011467,0.0005374638476481595
613,NUP57,NUP145C,60.0,0.17007669374004267,0.003994966306592881,0.20340004890043736,0.0077307506572601185
614,NUP57,NUP145C,90.0,0.2851090875047307,0.0015148150923677687,0.319278928831386,0.0010675857595445683
615,NUP57,NUP145N,30.0,0.07060469660632769,0.0010254711701179371,0.08522892447011467,0.0005374638476481595
616,NUP57,NUP145N,60.0,0.18165086906611702,0.006609638669305439,0.20340004890043736,0.0077307506572601185
617,NUP57,NUP145N,90.0,0.29631486047903466,0.0018785314731962605,0.319278928831386,0.0010675857595445683
618,NUP57,NUP157,30.0,0.041063457353690096,0.0015604303806246239,0.08522892447011467,0.0005374638476481595
619,NUP57,NUP157,60.0,0.13604746896222333,0.00785348738323016,0.20340004890043736,0.0077307506572601185
620,NUP57,NUP157,90.0,0.24452439115775834,0.0031935837022547707,0.319278928831386,0.0010675857595445683
621,NUP57,NUP159,30.0,0.03901185014220797,0.0005175002877048857,0.08522892447011467,0.0005374638476481595
622,NUP57,NUP159,60.0,0.13007579617075968,0.0035753348068980036,0.20340004890043736,0.0077307506572601185
623,NUP57,NUP159,90.0,0.239579981800362,0.00409600503639112,0.319278928831386,0.0010675857595445683
624,NUP57,NUP170,30.0,0.048807047909345834,0.0014867494086636221,0.08522892447011467,0.0005374638476481595
625,NUP57,NUP170,60.0,0.15404086488104565,0.007435829089531553,0.20340004890043736,0.0077307506572601185
626,NUP57,NUP170,90.0,0.27104662802313334,0.0031599082509536826,0.319278928831386,0.0010675857595445683
627,NUP57,NUP188,30.0,0.03322811203152217,0.0009066265302578342,0.08522892447011467,0.0005374638476481595
628,NUP57,NUP188,60.0,0.10869846519765065,0.003646370746006488,0.20340004890043736,0.0077307506572601185
629,NUP57,NUP188,90.0,0.2084100370035987,0.0021071034156110078,0.319278928831386,0.0010675857595445683
630,NUP57,NUP192,30.0,0.049340836923931264,0.0007421022585665592,0.08522892447011467,0.0005374638476481595
631,NUP57,NUP192,60.0,0.15160378697900234,0.0036512688616024197,0.20340004890043736,0.0077307506572601185
632,NUP57,NUP192,90.0,0.26786575651116434,0.0016018825042393998,0.319278928831386,0.0010675857595445683
633,NUP57,NUP2,30.0,0.07887940330372203,0.0024413864138455683,0.08522892447011467,0.0005374638476481595
634,NUP57,NUP2,60.0,0.195377880403838,0.004665788950015453,0.20340004890043736,0.0077307506572601185
635,NUP57,NUP2,90.0,0.30743685223695033,0.005430519641336013,0.319278928831386,0.0010675857595445683
636,NUP57,NUP49,30.0,0.08012103005630707,0.0011835855713035308,0.08522892447011467,0.0005374638476481595
637,NUP57,NUP49,60.0,0.193454383479129,0.004665490762484264,0.20340004890043736,0.0077307506572601185
638,NUP57,NUP49,90.0,0.3071943112159097,0.008845553755920648,0.319278928831386,0.0010675857595445683
639,NUP57,NUP53,30.0,0.06745036457766636,0.0008034037211584975,0.08522892447011467,0.0005374638476481595
640,NUP57,NUP53,60.0,0.1751686759779,0.007500627616690261,0.20340004890043736,0.0077307506572601185
641,NUP57,NUP53,90.0,0.290440647250976,0.0032394552624627356,0.319278928831386,0.0010675857595445683
642,NUP57,NUP57,30.0,0.12099398584206433,0.0005358303157311456,0.08522892447011467,0.0005374638476481595
643,NUP57,NUP57,60.0,0.25217254079819434,0.0061191810020733185,0.20340004890043736,0.0077307506572601185
644,NUP57,NUP57,90.0,0.37132182737475405,0.000276071363955884,0.319278928831386,0.0010675857595445683
645,NUP57,NUP59,30.0,0.07360423855771707,0.0022111788147902377,0.08522892447011467,0.0005374638476481595
646,NUP57,NUP59,60.0,0.1971263335460053,0.002816670732316533,0.20340004890043736,0.0077307506572601185
647,NUP57,NUP59,90.0,0.31930358196619496,0.0036756551535492735,0.319278928831386,0.0010675857595445683
648,NUP57,NUP60,30.0,0.07964796322254407,0.0026866643594304863,0.08522892447011467,0.0005374638476481595
649,NUP57,NUP60,60.0,0.20326794841797166,0.0035659420100600287,0.20340004890043736,0.0077307506572601185
650,NUP57,NUP60,90.0,0.32785741791753437,0.0037857163040897865,0.319278928831386,0.0010675857595445683
651,NUP57,NUP82,30.0,0.04911034862686453,0.000694210637529761,0.08522892447011467,0.0005374638476481595
652,NUP57,NUP82,60.0,0.15031146536199466,0.004764064364982626,0.20340004890043736,0.0077307506572601185
653,NUP57,NUP82,90.0,0.2641736936692543,0.0009454313709126196,0.319278928831386,0.0010675857595445683
654,NUP57,NUP84,30.0,0.03528932095639787,0.0013333308810217716,0.08522892447011467,0.0005374638476481595
655,NUP57,NUP84,60.0,0.13745237546668035,0.005324000823409625,0.20340004890043736,0.0077307506572601185
656,NUP57,NUP84,90.0,0.25635200088067067,0.001263064696682207,0.319278928831386,0.0010675857595445683
657,NUP57,NUP85,30.0,0.04461086212368903,0.00195838886035453,0.08522892447011467,0.0005374638476481595
658,NUP57,NUP85,60.0,0.153466866710419,0.005702919408631633,0.20340004890043736,0.0077307506572601185
659,NUP57,NUP85,90.0,0.269438261130456,0.0020627859845758103,0.319278928831386,0.0010675857595445683
660,NUP57,POM152,30.0,0.04210216811181087,0.002302723462532846,0.08522892447011467,0.0005374638476481595
661,NUP57,POM152,60.0,0.14181273417357934,0.006623815913888902,0.20340004890043736,0.0077307506572601185
662,NUP57,POM152,90.0,0.25609092834732233,0.0036736070861222614,0.319278928831386,0.0010675857595445683
663,NUP57,POM34,30.0,0.04937630157960374,0.002096753129784076,0.08522892447011467,0.0005374638476481595
664,NUP57,POM34,60.0,0.152407578915632,0.005797103713859089,0.20340004890043736,0.0077307506572601185
665,NUP57,POM34,90.0,0.266938837901961,0.0022019488729547745,0.319278928831386,0.0010675857595445683
666,NUP57,SEC13,30.0,0.07746831005135453,0.0018969101092127707,0.08522892447011467,0.0005374638476481595
667,NUP57,SEC13,60.0,0.19885343735859698,0.0055887774337266645,0.20340004890043736,0.0077307506572601185
668,NUP57,SEC13,90.0,0.31701143887964,0.0032573230669916122,0.319278928831386,0.0010675857595445683
669,NUP57,SEH1,30.0,0.015046354053847466,0.0007552269324077556,0.08522892447011467,0.0005374638476481595
670,NUP57,SEH1,60.0,0.07784908760519793,0.00522904375393536,0.20340004890043736,0.0077307506572601185
671,NUP57,SEH1,90.0,0.17258632779603866,0.0026792750630021257,0.319278928831386,0.0010675857595445683
672,NUP82,GLE1,30.0,0.03222794989779133,0.003522643261062443,0.08793131860650283,0.0018528926384458746
673,NUP82,GLE1,60.0,0.12571136414398235,0.0046995801368989185,0.20400595476546834,0.010506353214113844
674,NUP82,GLE1,90.0,0.19596676585971332,0.00808173459273187,0.31513605419999796,0.004414810822191721
675,NUP82,GLE2,30.0,0.05046373586845667,0.0012196232262508616,0.08793131860650283,0.0018528926384458746
676,NUP82,GLE2,60.0,0.15148789777273733,0.008263043030670077,0.20400595476546834,0.010506353214113844
677,NUP82,GLE2,90.0,0.2567429462053037,0.004359633906084758,0.31513605419999796,0.004414810822191721
678,NUP82,MLP1,30.0,0.03270437923174017,0.0008451717389321718,0.08793131860650283,0.0018528926384458746
679,NUP82,MLP1,60.0,0.10872468410794334,0.0071248932531661445,0.20400595476546834,0.010506353214113844
680,NUP82,MLP1,90.0,0.20205724497333866,0.0028557703742438565,0.31513605419999796,0.004414810822191721
681,NUP82,MLP2,30.0,0.06043532904546576,0.0012957152531292342,0.08793131860650283,0.0018528926384458746
682,NUP82,MLP2,60.0,0.16866551492662865,0.005110248365966505,0.20400595476546834,0.010506353214113844
683,NUP82,MLP2,90.0,0.2824731271196633,0.002728106473596814,0.31513605419999796,0.004414810822191721
684,NUP82,NDC1,30.0,0.07424369470260483,0.0032819241639755066,0.08793131860650283,0.0018528926384458746
685,NUP82,NDC1,60.0,0.18389126111441767,0.009976948598169843,0.20400595476546834,0.010506353214113844
686,NUP82,NDC1,90.0,0.2981967576597193,0.007867079258707528,0.31513605419999796,0.004414810822191721
687,NUP82,NIC96,30.0,0.06641512172616863,0.001567671035054525,0.08793131860650283,0.0018528926384458746
688,NUP82,NIC96,60.0,0.18435790719674397,0.0070598667897048585,0.20400595476546834,0.010506353214113844
689,NUP82,NIC96,90.0,0.294937345715818,0.004495932164900222,0.31513605419999796,0.004414810822191721
690,NUP82,NSP1,30.0,0.03372974691502676,0.0008512611629391695,0.08793131860650283,0.0018528926384458746
691,NUP82,NSP1,60.0,0.12275753591716565,0.007471940528529989,0.20400595476546834,0.010506353214113844
692,NUP82,NSP1,90.0,0.21888246405973866,0.003405930109081199,0.31513605419999796,0.004414810822191721
693,NUP82,NUP1,30.0,0.09000109147001294,0.002724636289146253,0.08793131860650283,0.0018528926384458746
694,NUP82,NUP1,60.0,0.214698556954197,0.011597709183780303,0.20400595476546834,0.010506353214113844
695,NUP82,NUP1,90.0,0.3287542061502637,0.003885973890561076,0.31513605419999796,0.004414810822191721
696,NUP82,NUP100,30.0,0.06471192769171843,0.0010113385705796563,0.08793131860650283,0.0018528926384458746
697,NUP82,NUP100,60.0,0.172757289924797,0.007800512230030585,0.20400595476546834,0.010506353214113844
698,NUP82,NUP100,90.0,0.277753293441174,0.007196154406510422,0.31513605419999796,0.004414810822191721
699,NUP82,NUP116,30.0,0.07908570208672977,0.0008357297408134687,0.08793131860650283,0.0018528926384458746
700,NUP82,NUP116,60.0,0.19542930409204431,0.008044103822893113,0.20400595476546834,0.010506353214113844
701,NUP82,NUP116,90.0,0.30359243744073966,0.004837975646815824,0.31513605419999796,0.004414810822191721
702,NUP82,NUP120,30.0,0.045989576174278936,0.00033441908998724245,0.08793131860650283,0.0018528926384458746
703,NUP82,NUP120,60.0,0.15142600359668568,0.005689332539883404,0.20400595476546834,0.010506353214113844
704,NUP82,NUP120,90.0,0.2560794232984917,0.007748484240681524,0.31513605419999796,0.004414810822191721
705,NUP82,NUP133,30.0,0.026727876673188867,0.0013600540898989649,0.08793131860650283,0.0018528926384458746
706,NUP82,NUP133,60.0,0.0987928267428994,0.0059103358490335,0.20400595476546834,0.010506353214113844
707,NUP82,NUP133,90.0,0.18740520118784132,0.0051773552604361655,0.31513605419999796,0.004414810822191721
708,NUP82,NUP145C,30.0,0.0602843108452639,0.0007816521933941726,0.08793131860650283,0.0018528926384458746
709,NUP82,NUP145C,60.0,0.17248539460360235,0.005877230297567242,0.20400595476546834,0.010506353214113844
710,NUP82,NUP145C,90.0,0.27738829137098503,0.005370827685263797,0.31513605419999796,0.004414810822191721
711,NUP82,NUP145N,30.0,0.07204958097520801,0.0012453877664835775,0.08793131860650283,0.0018528926384458746
712,NUP82,NUP145N,60.0,0.184332167754246,0.00965493607380123,0.20400595476546834,0.010506353214113844
713,NUP82,NUP145N,90.0,0.29283810407554267,0.0058566632385253885,0.31513605419999796,0.004414810822191721
714,NUP82,NUP157,30.0,0.03906903858993226,0.0018683984495636225,0.08793131860650283,0.0018528926384458746
715,NUP82,NUP157,60.0,0.128639078003012,0.009494504616624266,0.20400595476546834,0.010506353214113844
716,NUP82,NUP157,90.0,0.229611948845479,0.004248102787694943,0.31513605419999796,0.004414810822191721
717,NUP82,NUP159,30.0,0.08694107524770907,0.002699143632836504,0.08793131860650283,0.0018528926384458746
718,NUP82,NUP159,60.0,0.229342817495501,0.012084506118257222,0.20400595476546834,0.010506353214113844
719,NUP82,NUP159,90.0,0.34578283585563,0.004488044117358982,0.31513605419999796,0.004414810822191721
720,NUP82,NUP170,30.0,0.048658083631171335,0.0011292796603455538,0.08793131860650283,0.0018528926384458746
721,NUP82,NUP170,60.0,0.149940203830626,0.009116473566465616,0.20400595476546834,0.010506353214113844
722,NUP82,NUP170,90.0,0.258268586471129,0.0036592822526277644,0.31513605419999796,0.004414810822191721
723,NUP82,NUP188,30.0,0.02258625578357683,0.0006051339237985922,0.08793131860650283,0.0018528926384458746
724,NUP82,NUP188,60.0,0.09163532175182713,0.006058991284531603,0.20400595476546834,0.010506353214113844
725,NUP82,NUP188,90.0,0.17929393582606268,0.0031596947842235886,0.31513605419999796,0.004414810822191721
726,NUP82,NUP192,30.0,0.038796500733890564,0.0007845362858873518,0.08793131860650283,0.0018528926384458746
727,NUP82,NUP192,60.0,0.13076466877265566,0.0068310156298855024,0.20400595476546834,0.010506353214113844
728,NUP82,NUP192,90.0,0.23345913940945065,0.004729776580825049,0.31513605419999796,0.004414810822191721
729,NUP82,NUP2,30.0,0.08300727958627444,0.002245377985488414,0.08793131860650283,0.0018528926384458746
730,NUP82,NUP2,60.0,0.19452664797459232,0.011845878116554782,0.20400595476546834,0.010506353214113844
731,NUP82,NUP2,90.0,0.3004238610361817,0.0043849972573315,0.31513605419999796,0.004414810822191721
732,NUP82,NUP49,30.0,0.04692682681257234,0.0013104367281932166,0.08793131860650283,0.0018528926384458746
733,NUP82,NUP49,60.0,0.155060988198499,0.005897744861303866,0.20400595476546834,0.010506353214113844
734,NUP82,NUP49,90.0,0.2610880453369353,0.006692216579381976,0.31513605419999796,0.004414810822191721
735,NUP82,NUP53,30.0,0.06472414104187037,0.0007353523195712608,0.08793131860650283,0.0018528926384458746
736,NUP82,NUP53,60.0,0.165910237385418,0.009981838164231992,0.20400595476546834,0.010506353214113844
737,NUP82,NUP53,90.0,0.2703410274713363,0.006028011040527187,0.31513605419999796,0.004414810822191721
738,NUP82,NUP57,30.0,0.040155140376859196,0.0004197018023980801,0.08793131860650283,0.0018528926384458746
739,NUP82,NUP57,60.0,0.14775690294746466,0.008460686715927418,0.20400595476546834,0.010506353214113844
740,NUP82,NUP57,90.0,0.258475385481995,0.006095467990626412,0.31513605419999796,0.004414810822191721
741,NUP82,NUP59,30.0,0.07625761396355761,0.0008481444713805931,0.08793131860650283,0.0018528926384458746
742,NUP82,NUP59,60.0,0.19944668970458532,0.008003827679845938,0.20400595476546834,0.010506353214113844
743,NUP82,NUP59,90.0,0.313309548632057,0.005709397886891586,0.31513605419999796,0.004414810822191721
744,NUP82,NUP60,30.0,0.08196606666257583,0.0018341718156770631,0.08793131860650283,0.0018528926384458746
745,NUP82,NUP60,60.0,0.20840706241469098,0.009931652538140918,0.20400595476546834,0.010506353214113844
746,NUP82,NUP60,90.0,0.31996694527125036,0.004495540988430559,0.31513605419999796,0.004414810822191721
747,NUP82,NUP82,30.0,0.12008181234017434,0.002609674921693598,0.08793131860650283,0.0018528926384458746
748,NUP82,NUP82,60.0,0.262730316720816,0.012296526230930924,0.20400595476546834,0.010506353214113844
749,NUP82,NUP82,90.0,0.37605225009606463,0.0037674832049975357,0.31513605419999796,0.004414810822191721
750,NUP82,NUP84,30.0,0.0279133198948092,0.002519035646917987,0.08793131860650283,0.0018528926384458746
751,NUP82,NUP84,60.0,0.13097989794875534,0.005679847260975191,0.20400595476546834,0.010506353214113844
752,NUP82,NUP84,90.0,0.2351998239944877,0.00752885907708437,0.31513605419999796,0.004414810822191721
753,NUP82,NUP85,30.0,0.05117938225330276,0.0010973184029759858,0.08793131860650283,0.0018528926384458746
754,NUP82,NUP85,60.0,0.16252562660541967,0.002938327589325516,0.20400595476546834,0.010506353214113844
755,NUP82,NUP85,90.0,0.26659313378846367,0.006150573505768482,0.31513605419999796,0.004414810822191721
756,NUP82,POM152,30.0,0.03749556709726127,5.1885073223213065e-05,0.08793131860650283,0.0018528926384458746
757,NUP82,POM152,60.0,0.13157011042950734,0.007408729855495563,0.20400595476546834,0.010506353214113844
758,NUP82,POM152,90.0,0.23483041861526732,0.005021608143281313,0.31513605419999796,0.004414810822191721
759,NUP82,POM34,30.0,0.04874308251778933,0.00021572825595844134,0.08793131860650283,0.0018528926384458746
760,NUP82,POM34,60.0,0.15372727683840967,0.008171126665481731,0.20400595476546834,0.010506353214113844
761,NUP82,POM34,90.0,0.26133749243740434,0.004038881983017735,0.31513605419999796,0.004414810822191721
762,NUP82,SEC13,30.0,0.07353023053906536,0.0017923017931078232,0.08793131860650283,0.0018528926384458746
763,NUP82,SEC13,60.0,0.189770647898552,0.0070677475575834856,0.20400595476546834,0.010506353214113844
764,NUP82,SEC13,90.0,0.298899635214955,0.006766168449535205,0.31513605419999796,0.004414810822191721
765,NUP82,SEH1,30.0,0.015767312698668035,0.0020701192480142424,0.08793131860650283,0.0018528926384458746
766,NUP82,SEH1,60.0,0.0776186877962523,0.006141613934348246,0.20400595476546834,0.010506353214113844
767,NUP82,SEH1,90.0,0.16394390472352102,0.0015910268106853873,0.31513605419999796,0.004414810822191721
768,NUP84,GLE1,30.0,0.07724906489997797,0.003060289643247514,0.08779720063480152,0.0015766757732326715
769,NUP84,GLE1,60.0,0.19733089390076666,0.005435006084824292,0.19700328163063033,0.004563235535582656
770,NUP84,GLE1,90.0,0.32155417577717865,0.008801253595298689,0.3027133430439817,0.003641166443550219
771,NUP84,GLE2,30.0,0.0411074593297147,0.000951235627894689,0.08779720063480152,0.0015766757732326715
772,NUP84,GLE2,60.0,0.13759144760140066,0.003449774999283664,0.19700328163063033,0.004563235535582656
773,NUP84,GLE2,90.0,0.251731560460748,0.007758998312364673,0.3027133430439817,0.003641166443550219
774,NUP84,MLP1,30.0,0.03259964977442106,0.004292713020456362,0.08779720063480152,0.0015766757732326715
775,NUP84,MLP1,60.0,0.10337089940961901,0.0025291608544626507,0.19700328163063033,0.004563235535582656
776,NUP84,MLP1,90.0,0.20160595808326898,0.006754073551909051,0.3027133430439817,0.003641166443550219
777,NUP84,MLP2,30.0,0.05398350332730503,0.0015696759621270184,0.08779720063480152,0.0015766757732326715
778,NUP84,MLP2,60.0,0.14718966502528766,0.001878204359784388,0.19700328163063033,0.004563235535582656
779,NUP84,MLP2,90.0,0.25559435811115266,0.0021294844764199812,0.3027133430439817,0.003641166443550219
780,NUP84,NDC1,30.0,0.07682891530082613,0.0006944128504414316,0.08779720063480152,0.0015766757732326715
781,NUP84,NDC1,60.0,0.17596183189909667,0.007576408783010564,0.19700328163063033,0.004563235535582656
782,NUP84,NDC1,90.0,0.28305924875779903,0.0033136900682339617,0.3027133430439817,0.003641166443550219
783,NUP84,NIC96,30.0,0.0743233363160796,0.0004875986007603803,0.08779720063480152,0.0015766757732326715
784,NUP84,NIC96,60.0,0.18689598130825166,0.005995508109133172,0.19700328163063033,0.004563235535582656
785,NUP84,NIC96,90.0,0.30591032559783,0.008799075706740407,0.3027133430439817,0.003641166443550219
786,NUP84,NSP1,30.0,0.018705409710733967,0.0008105718787054488,0.08779720063480152,0.0015766757732326715
787,NUP84,NSP1,60.0,0.08117039761230113,0.004220228707610962,0.19700328163063033,0.004563235535582656
788,NUP84,NSP1,90.0,0.17881646311440266,0.006913392925297467,0.3027133430439817,0.003641166443550219
789,NUP84,NUP1,30.0,0.09677723519111807,0.0012707768176636772,0.08779720063480152,0.0015766757732326715
790,NUP84,NUP1,60.0,0.21649640304291132,0.0061882756418989064,0.19700328163063033,0.004563235535582656
791,NUP84,NUP1,90.0,0.33119420275450234,0.004457010471899118,0.3027133430439817,0.003641166443550219
792,NUP84,NUP100,30.0,0.07589141051035557,0.0003875890248481832,0.08779720063480152,0.0015766757732326715
793,NUP84,NUP100,60.0,0.17786655505582535,0.004880331082052618,0.19700328163063033,0.004563235535582656
794,NUP84,NUP100,90.0,0.293706029365794,0.00565382632018327,0.3027133430439817,0.003641166443550219
795,NUP84,NUP116,30.0,0.0780545198872744,0.0008285659680083626,0.08779720063480152,0.0015766757732326715
796,NUP84,NUP116,60.0,0.18237303005935432,0.0052667205004751924,0.19700328163063033,0.004563235535582656
797,NUP84,NUP116,90.0,0.296456510053362,0.0074874364315398335,0.3027133430439817,0.003641166443550219
798,NUP84,NUP120,30.0,0.08592265234335071,0.00229232904541487,0.08779720063480152,0.0015766757732326715
799,NUP84,NUP120,60.0,0.20058661547131165,0.0036427769356088898,0.19700328163063033,0.004563235535582656
800,NUP84,NUP120,90.0,0.3225037601262853,0.004677884407188451,0.3027133430439817,0.003641166443550219
801,NUP84,NUP133,30.0,0.0784084319988105,0.0022525513999750494,0.08779720063480152,0.0015766757732326715
802,NUP84,NUP133,60.0,0.18581941392764467,0.003212280879775838,0.19700328163063033,0.004563235535582656
803,NUP84,NUP133,90.0,0.30247147155034965,0.005865918921251755,0.3027133430439817,0.003641166443550219
804,NUP84,NUP145C,30.0,0.123898395411919,0.0005641928585067985,0.08779720063480152,0.0015766757732326715
805,NUP84,NUP145C,60.0,0.23904069525776803,0.005071065397537813,0.19700328163063033,0.004563235535582656
806,NUP84,NUP145C,90.0,0.35341467147326266,0.0041188624840593656,0.3027133430439817,0.003641166443550219
807,NUP84,NUP145N,30.0,0.09616581069829067,0.0005513609905915497,0.08779720063480152,0.0015766757732326715
808,NUP84,NUP145N,60.0,0.20867044645020463,0.006061309587787502,0.19700328163063033,0.004563235535582656
809,NUP84,NUP145N,90.0,0.327949757176905,0.008953830818041153,0.3027133430439817,0.003641166443550219
810,NUP84,NUP157,30.0,0.053090921482492136,0.0010020585522017545,0.08779720063480152,0.0015766757732326715
811,NUP84,NUP157,60.0,0.14888731317769566,0.005200072398242841,0.19700328163063033,0.004563235535582656
812,NUP84,NUP157,90.0,0.26186618247215,0.007104990778323427,0.3027133430439817,0.003641166443550219
813,NUP84,NUP159,30.0,0.050465103854825166,0.0027309696741044404,0.08779720063480152,0.0015766757732326715
814,NUP84,NUP159,60.0,0.14533555328360534,0.008495685329140436,0.19700328163063033,0.004563235535582656
815,NUP84,NUP159,90.0,0.2742311137145747,0.010845986197849987,0.3027133430439817,0.003641166443550219
816,NUP84,NUP170,30.0,0.05975586612004833,0.0010821928023540546,0.08779720063480152,0.0015766757732326715
817,NUP84,NUP170,60.0,0.16019259557707433,0.006773918400860987,0.19700328163063033,0.004563235535582656
818,NUP84,NUP170,90.0,0.273980309632878,0.008857745689759314,0.3027133430439817,0.003641166443550219
819,NUP84,NUP188,30.0,0.025288929700828865,0.0003162656774356013,0.08779720063480152,0.0015766757732326715
820,NUP84,NUP188,60.0,0.09311471355881086,0.0033849204398444764,0.19700328163063033,0.004563235535582656
821,NUP84,NUP188,90.0,0.18642823788827534,0.00654014478485369,0.3027133430439817,0.003641166443550219
822,NUP84,NUP192,30.0,0.041020724286967666,0.0007894010630245459,0.08779720063480152,0.0015766757732326715
823,NUP84,NUP192,60.0,0.129773690180366,0.004484896141982885,0.19700328163063033,0.004563235535582656
824,NUP84,NUP192,90.0,0.23939764411401035,0.00589337175539363,0.3027133430439817,0.003641166443550219
825,NUP84,NUP2,30.0,0.08425721262974974,0.0021919414846811643,0.08779720063480152,0.0015766757732326715
826,NUP84,NUP2,60.0,0.18613395612667602,0.006282884065761275,0.19700328163063033,0.004563235535582656
827,NUP84,NUP2,90.0,0.2961887299995647,0.0025706853805565226,0.3027133430439817,0.003641166443550219
828,NUP84,NUP49,30.0,0.05325137482455373,0.0009902112613879924,0.08779720063480152,0.0015766757732326715
829,NUP84,NUP49,60.0,0.15866730020300301,0.0076073529252875536,0.19700328163063033,0.004563235535582656
830,NUP84,NUP49,90.0,0.27427517210779867,0.009944169577973068,0.3027133430439817,0.003641166443550219
831,NUP84,NUP53,30.0,0.07382198897043463,0.0015953837513714973,0.08779720063480152,0.0015766757732326715
832,NUP84,NUP53,60.0,0.17371300414052634,0.005286782390896215,0.19700328163063033,0.004563235535582656
833,NUP84,NUP53,90.0,0.283193302319358,0.007189800521941808,0.3027133430439817,0.003641166443550219
834,NUP84,NUP57,30.0,0.05098402184733283,0.0004049415668742938,0.08779720063480152,0.0015766757732326715
835,NUP84,NUP57,60.0,0.15576773842464234,0.005439356205182197,0.19700328163063033,0.004563235535582656
836,NUP84,NUP57,90.0,0.2746922776705257,0.007893832959133736,0.3027133430439817,0.003641166443550219
837,NUP84,NUP59,30.0,0.08192996167091134,0.001174763338828486,0.08779720063480152,0.0015766757732326715
838,NUP84,NUP59,60.0,0.19613775383105803,0.004774878043994939,0.19700328163063033,0.004563235535582656
839,NUP84,NUP59,90.0,0.31634075230622,0.008061279070433199,0.3027133430439817,0.003641166443550219
840,NUP84,NUP60,30.0,0.08867509950970658,0.0022653609152362628,0.08779720063480152,0.0015766757732326715
841,NUP84,NUP60,60.0,0.204539559068495,0.004357048051697344,0.19700328163063033,0.004563235535582656
842,NUP84,NUP60,90.0,0.315562390207827,0.008764473670296527,0.3027133430439817,0.003641166443550219
843,NUP84,NUP82,30.0,0.06310690259236977,0.0018811085489776945,0.08779720063480152,0.0015766757732326715
844,NUP84,NUP82,60.0,0.16453457252525766,0.007924318881000045,0.19700328163063033,0.004563235535582656
845,NUP84,NUP82,90.0,0.28991444313454734,0.011660335850585285,0.3027133430439817,0.003641166443550219
846,NUP84,NUP84,30.0,0.122130683158782,0.0019621086100006313,0.08779720063480152,0.0015766757732326715
847,NUP84,NUP84,60.0,0.245542291657232,0.0037263481910237203,0.19700328163063033,0.004563235535582656
848,NUP84,NUP84,90.0,0.3625718472875146,0.004999883679859888,0.3027133430439817,0.003641166443550219
849,NUP84,NUP85,30.0,0.09723068822221237,0.0019551462942826573,0.08779720063480152,0.0015766757732326715
850,NUP84,NUP85,60.0,0.21559333992826635,0.004758310454776699,0.19700328163063033,0.004563235535582656
851,NUP84,NUP85,90.0,0.33598587621589765,0.00564092706448184,0.3027133430439817,0.003641166443550219
852,NUP84,POM152,30.0,0.04375515196625753,0.0011061651738779096,0.08779720063480152,0.0015766757732326715
853,NUP84,POM152,60.0,0.134568217199194,0.005880910846355457,0.19700328163063033,0.004563235535582656
854,NUP84,POM152,90.0,0.24655174786810033,0.008918077879920721,0.3027133430439817,0.003641166443550219
855,NUP84,POM34,30.0,0.0586458469197599,7.359059751484896e-05,0.08779720063480152,0.0015766757732326715
856,NUP84,POM34,60.0,0.15795246293815,0.004002754811334437,0.19700328163063033,0.004563235535582656
857,NUP84,POM34,90.0,0.27048223486594564,0.006361897113549239,0.3027133430439817,0.003641166443550219
858,NUP84,SEC13,30.0,0.10699650388661434,0.00020637035952528136,0.08779720063480152,0.0015766757732326715
859,NUP84,SEC13,60.0,0.21505535998320235,0.0047149693707414135,0.19700328163063033,0.004563235535582656
860,NUP84,SEC13,90.0,0.333940235874238,0.0037603859016181527,0.3027133430439817,0.003641166443550219
861,NUP84,SEH1,30.0,0.027116834730071104,0.0004011306410208792,0.08779720063480152,0.0015766757732326715
862,NUP84,SEH1,60.0,0.10247732497829987,0.005370520476811679,0.19700328163063033,0.004563235535582656
863,NUP84,SEH1,90.0,0.21097700016097898,0.00463638071824147,0.3027133430439817,0.003641166443550219
864,NUP85,GLE1,30.0,0.03771113707685133,0.0017034815864239267,0.0868101490049583,0.0018822134234398444
865,NUP85,GLE1,60.0,0.138418943973463,0.014786133921002805,0.19765239550519934,0.007167806974902632
866,NUP85,GLE1,90.0,0.24934388433058433,0.004671127524939624,0.31678411031407633,0.003419092977347266
867,NUP85,GLE2,30.0,0.0386073799937017,0.0005636312336448523,0.0868101490049583,0.0018822134234398444
868,NUP85,GLE2,60.0,0.12858535781381067,0.003978533759768604,0.19765239550519934,0.007167806974902632
869,NUP85,GLE2,90.0,0.24713377197679268,0.0011491623690666223,0.31678411031407633,0.003419092977347266
870,NUP85,MLP1,30.0,0.04038756351197017,0.0011042956106604338,0.0868101490049583,0.0018822134234398444
871,NUP85,MLP1,60.0,0.0840811779474235,0.002958628558865848,0.19765239550519934,0.007167806974902632
872,NUP85,MLP1,90.0,0.163444787136563,0.002756793853012581,0.31678411031407633,0.003419092977347266
873,NUP85,MLP2,30.0,0.06189373375953,0.004258429203740816,0.0868101490049583,0.0018822134234398444
874,NUP85,MLP2,60.0,0.150490385874709,0.0061481788232470354,0.19765239550519934,0.007167806974902632
875,NUP85,MLP2,90.0,0.25374646369150267,0.00179038621532953,0.31678411031407633,0.003419092977347266
876,NUP85,NDC1,30.0,0.07429670939864623,0.002336378457728619,0.0868101490049583,0.0018822134234398444
877,NUP85,NDC1,60.0,0.17695253911660233,0.0061293794663428,0.19765239550519934,0.007167806974902632
878,NUP85,NDC1,90.0,0.296727275898393,0.001511246106281122,0.31678411031407633,0.003419092977347266
879,NUP85,NIC96,30.0,0.046983081611790795,0.0009090250438068433,0.0868101490049583,0.0018822134234398444
880,NUP85,NIC96,60.0,0.14386661320522834,0.004870292775410395,0.19765239550519934,0.007167806974902632
881,NUP85,NIC96,90.0,0.26511407911319235,7.680726137726991e-05,0.31678411031407633,0.003419092977347266
882,NUP85,NSP1,30.0,0.013799695775939034,0.0011562937428127942,0.0868101490049583,0.0018822134234398444
883,NUP85,NSP1,60.0,0.057725104261102334,0.0015286087748139685,0.19765239550519934,0.007167806974902632
884,NUP85,NSP1,90.0,0.14201398336371499,0.00021563083320307874,0.31678411031407633,0.003419092977347266
885,NUP85,NUP1,30.0,0.09462294265815711,0.0041440581232386345,0.0868101490049583,0.0018822134234398444
886,NUP85,NUP1,60.0,0.20775402079601066,0.0026277329088507393,0.19765239550519934,0.007167806974902632
887,NUP85,NUP1,90.0,0.34100470167348634,0.0004881977377989894,0.31678411031407633,0.003419092977347266
888,NUP85,NUP100,30.0,0.05980177997835693,0.0021148007434019377,0.0868101490049583,0.0018822134234398444
889,NUP85,NUP100,60.0,0.153686100023216,0.004841615472730822,0.19765239550519934,0.007167806974902632
890,NUP85,NUP100,90.0,0.2736894805815297,0.0006828212292542224,0.31678411031407633,0.003419092977347266
891,NUP85,NUP116,30.0,0.06836977936169183,0.0019733318555624677,0.0868101490049583,0.0018822134234398444
892,NUP85,NUP116,60.0,0.17150765046575667,0.003081547177072675,0.19765239550519934,0.007167806974902632
893,NUP85,NUP116,90.0,0.29065589655446067,0.0008847444833178814,0.31678411031407633,0.003419092977347266
894,NUP85,NUP120,30.0,0.08151126586379447,0.002391040670608921,0.0868101490049583,0.0018822134234398444
895,NUP85,NUP120,60.0,0.19294995570436402,0.004766980394059492,0.19765239550519934,0.007167806974902632
896,NUP85,NUP120,90.0,0.3163461532019533,0.002272687392247578,0.31678411031407633,0.003419092977347266
897,NUP85,NUP133,30.0,0.030335588096477767,0.0016091827135214403,0.0868101490049583,0.0018822134234398444
898,NUP85,NUP133,60.0,0.09119994581658199,0.004368209780452173,0.19765239550519934,0.007167806974902632
899,NUP85,NUP133,90.0,0.18328858999107167,0.0017810604946278488,0.31678411031407633,0.003419092977347266
900,NUP85,NUP145C,30.0,0.08197496831823846,0.0016076775848210148,0.0868101490049583,0.0018822134234398444
901,NUP85,NUP145C,60.0,0.187752134208801,0.0037729047992026135,0.19765239550519934,0.007167806974902632
902,NUP85,NUP145C,90.0,0.305713282981043,0.0019575570826493366,0.31678411031407633,0.003419092977347266
903,NUP85,NUP145N,30.0,0.0750550983692308,0.0024823604494629355,0.0868101490049583,0.0018822134234398444
904,NUP85,NUP145N,60.0,0.17853499925859398,0.006403914862669726,0.19765239550519934,0.007167806974902632
905,NUP85,NUP145N,90.0,0.30424500444016633,0.0008724642260708785,0.31678411031407633,0.003419092977347266
906,NUP85,NUP157,30.0,0.042594634646757334,0.0016793045267869307,0.0868101490049583,0.0018822134234398444
907,NUP85,NUP157,60.0,0.12452714825997968,0.005078436428762403,0.19765239550519934,0.007167806974902632
908,NUP85,NUP157,90.0,0.23452971954920568,0.001201692127364303,0.31678411031407633,0.003419092977347266
909,NUP85,NUP159,30.0,0.038516223319989336,0.0014843771214749465,0.0868101490049583,0.0018822134234398444
910,NUP85,NUP159,60.0,0.11431339798045966,0.0033674236399791535,0.19765239550519934,0.007167806974902632
911,NUP85,NUP159,90.0,0.234379187876085,0.0006426144039496708,0.31678411031407633,0.003419092977347266
912,NUP85,NUP170,30.0,0.040267748432014,0.001318140392338366,0.0868101490049583,0.0018822134234398444
913,NUP85,NUP170,60.0,0.12322893160912367,0.005611634016343952,0.19765239550519934,0.007167806974902632
914,NUP85,NUP170,90.0,0.23948531384710034,0.0012852087870909525,0.31678411031407633,0.003419092977347266
915,NUP85,NUP188,30.0,0.020080334383508133,0.001406078126224035,0.0868101490049583,0.0018822134234398444
916,NUP85,NUP188,60.0,0.07047594577019804,0.012548084585620059,0.19765239550519934,0.007167806974902632
917,NUP85,NUP188,90.0,0.16455347581398602,0.0008088451137855691,0.31678411031407633,0.003419092977347266
918,NUP85,NUP192,30.0,0.028053811892668933,0.0011697937934541547,0.0868101490049583,0.0018822134234398444
919,NUP85,NUP192,60.0,0.10134931349969374,0.004115110186622141,0.19765239550519934,0.007167806974902632
920,NUP85,NUP192,90.0,0.20760501742498635,0.0014136730511518118,0.31678411031407633,0.003419092977347266
921,NUP85,NUP2,30.0,0.0863542253243817,0.001685075437364202,0.0868101490049583,0.0018822134234398444
922,NUP85,NUP2,60.0,0.19357837960535398,0.004682231919849517,0.19765239550519934,0.007167806974902632
923,NUP85,NUP2,90.0,0.3195423166661497,0.0029115631670728016,0.31678411031407633,0.003419092977347266
924,NUP85,NUP49,30.0,0.035090457303943605,0.0015409518925790242,0.0868101490049583,0.0018822134234398444
925,NUP85,NUP49,60.0,0.122889413091962,0.0035796680346240816,0.19765239550519934,0.007167806974902632
926,NUP85,NUP49,90.0,0.24209200659335103,0.0005142835944983912,0.31678411031407633,0.003419092977347266
927,NUP85,NUP53,30.0,0.05645017814753623,0.0021078664117754435,0.0868101490049583,0.0018822134234398444
928,NUP85,NUP53,60.0,0.14427002703653233,0.005672888428806718,0.19765239550519934,0.007167806974902632
929,NUP85,NUP53,90.0,0.25970597254493866,0.001132883670084136,0.31678411031407633,0.003419092977347266
930,NUP85,NUP57,30.0,0.0321676859313362,0.0012695175775116947,0.0868101490049583,0.0018822134234398444
931,NUP85,NUP57,60.0,0.12076048896981367,0.00347173985801051,0.19765239550519934,0.007167806974902632
932,NUP85,NUP57,90.0,0.24437940570006533,0.0016103669049865527,0.31678411031407633,0.003419092977347266
933,NUP85,NUP59,30.0,0.06562763758510307,0.0036511623673580254,0.0868101490049583,0.0018822134234398444
934,NUP85,NUP59,60.0,0.17759932977756765,0.006419159580178815,0.19765239550519934,0.007167806974902632
935,NUP85,NUP59,90.0,0.302933001010455,0.001265578185167615,0.31678411031407633,0.003419092977347266
936,NUP85,NUP60,30.0,0.08658897289408025,0.0008841066518972507,0.0868101490049583,0.0018822134234398444
937,NUP85,NUP60,60.0,0.20383285741269666,0.003486055800073531,0.19765239550519934,0.007167806974902632
938,NUP85,NUP60,90.0,0.3309877913637697,0.0006133955253116483,0.31678411031407633,0.003419092977347266
939,NUP85,NUP82,30.0,0.047143411658818433,0.002140081507420433,0.0868101490049583,0.0018822134234398444
940,NUP85,NUP82,60.0,0.13184003367742966,0.004399165686376875,0.19765239550519934,0.007167806974902632
941,NUP85,NUP82,90.0,0.25503566211972367,0.0014512288477349423,0.31678411031407633,0.003419092977347266
942,NUP85,NUP84,30.0,0.0398122515570353,0.001925400429332208,0.0868101490049583,0.0018822134234398444
943,NUP85,NUP84,60.0,0.13136762872361465,0.004906607695013886,0.19765239550519934,0.007167806974902632
944,NUP85,NUP84,90.0,0.2463976539202233,0.0026393911986125743,0.31678411031407633,0.003419092977347266
945,NUP85,NUP85,30.0,0.11171217361141034,0.0018371151809313823,0.0868101490049583,0.0018822134234398444
946,NUP85,NUP85,60.0,0.23438931233781934,0.005123389582689569,0.19765239550519934,0.007167806974902632
947,NUP85,NUP85,90.0,0.3512381129814606,0.0014648613363725815,0.31678411031407633,0.003419092977347266
948,NUP85,POM152,30.0,0.03157941219862537,0.0019232566396041775,0.0868101490049583,0.0018822134234398444
949,NUP85,POM152,60.0,0.10878725162245366,0.004141132475228292,0.19765239550519934,0.007167806974902632
950,NUP85,POM152,90.0,0.21812554048127933,0.0018809494834292565,0.31678411031407633,0.003419092977347266
951,NUP85,POM34,30.0,0.041870411794356695,0.0015418092429585679,0.0868101490049583,0.0018822134234398444
952,NUP85,POM34,60.0,0.132675142159433,0.005085742651061571,0.19765239550519934,0.007167806974902632
953,NUP85,POM34,90.0,0.2477540198511933,0.0005336197241667126,0.31678411031407633,0.003419092977347266
954,NUP85,SEC13,30.0,0.09141323602281566,0.0029077582037754816,0.0868101490049583,0.0018822134234398444
955,NUP85,SEC13,60.0,0.19823283249326398,0.0038337832320268265,0.19765239550519934,0.007167806974902632
956,NUP85,SEC13,90.0,0.32119410311004803,0.00170667626286011,0.31678411031407633,0.003419092977347266
957,NUP85,SEH1,30.0,0.025628613201617103,0.0013512602898884255,0.0868101490049583,0.0018822134234398444
958,NUP85,SEH1,60.0,0.09360032030223374,0.0010525020752699197,0.19765239550519934,0.007167806974902632
959,NUP85,SEH1,90.0,0.1838832519372917,0.0011178965170632353,0.31678411031407633,0.003419092977347266
