FileName	bait	prey	kind	time	replicate	k1	prec.no.K1
180912_LG_Evgeny81_10b	MLP1	CRM1	NTR	90	2	0.30755211466668	3
180912_LG_Evgeny81_10b	MLP1	DBP9	NTR-like	90	2	0.320856142949944	6
180912_LG_Evgeny81_10b	MLP1	ENP1	NTR-like	90	2	0.34487092256363	5
180912_LG_Evgeny81_10b	MLP1	FBA1	NTR-like	90	2	0.319067684685468	3
180912_LG_Evgeny81_10b	MLP1	GLE1	NUP	90	2	0.276868243939111	4
180912_LG_Evgeny81_10b	MLP1	GLE2	NUP	90	2	0.197697843567947	6
180912_LG_Evgeny81_10b	MLP1	KAP123	NTR	90	2	0.333711603069307	13
180912_LG_Evgeny81_10b	MLP1	KAP95	NTR	90	2	0.330859069915518	13
180912_LG_Evgeny81_10b	MLP1	KRE33	NTR-like	90	2	0.345246164783513	23
180912_LG_Evgeny81_10b	MLP1	MAK21	NTR-like	90	2	0.331754861136237	15
180912_LG_Evgeny81_10b	MLP1	MEX67	NTR	90	2	0.322655830755586	10
180912_LG_Evgeny81_10b	MLP1	MLP1	NUP	90	2	0.339696610427903	95
180912_LG_Evgeny81_10b	MLP1	MLP2	NUP	90	2	0.259645257432372	52
180912_LG_Evgeny81_10b	MLP1	NDC1	NUP	90	2	0.321295875195532	5
180912_LG_Evgeny81_10b	MLP1	NIC96	NUP	90	2	0.16353304295103	14
180912_LG_Evgeny81_10b	MLP1	NSP1	NUP	90	2	0.087333224192351	38
180912_LG_Evgeny81_10b	MLP1	NUP1	NUP	90	2	0.267575610276306	19
180912_LG_Evgeny81_10b	MLP1	NUP100	NUP	90	2	0.199025272936427	12
180912_LG_Evgeny81_10b	MLP1	NUP116	NUP	90	2	0.246825614873987	16
180912_LG_Evgeny81_10b	MLP1	NUP120	NUP	90	2	0.178079497082759	15
180912_LG_Evgeny81_10b	MLP1	NUP133	NUP	90	2	0.119805334413944	30
180912_LG_Evgeny81_10b	MLP1	NUP145C	NUP	90	2	0.189598872740682	20
180912_LG_Evgeny81_10b	MLP1	NUP145N	NUP	90	2	0.228119541633371	14
180912_LG_Evgeny81_10b	MLP1	NUP157	NUP	90	2	0.151057875099496	22
180912_LG_Evgeny81_10b	MLP1	NUP159	NUP	90	2	0.138165925849392	33
180912_LG_Evgeny81_10b	MLP1	NUP170	NUP	90	2	0.162360335852564	32
180912_LG_Evgeny81_10b	MLP1	NUP188	NUP	90	2	0.102199935421998	29
180912_LG_Evgeny81_10b	MLP1	NUP192	NUP	90	2	0.116833572464217	23
180912_LG_Evgeny81_10b	MLP1	NUP2	NUP	90	2	0.326097035827616	29
180912_LG_Evgeny81_10b	MLP1	NUP49	NUP	90	2	0.158948131380911	6
180912_LG_Evgeny81_10b	MLP1	NUP53	NUP	90	2	0.190374706095945	10
180912_LG_Evgeny81_10b	MLP1	NUP57	NUP	90	2	0.136966132442274	12
180912_LG_Evgeny81_10b	MLP1	NUP59	NUP	90	2	0.189913891767984	8
180912_LG_Evgeny81_10b	MLP1	NUP60	NUP	90	2	0.305522765210524	15
180912_LG_Evgeny81_10b	MLP1	NUP82	NUP	90	2	0.148535328407126	13
180912_LG_Evgeny81_10b	MLP1	NUP84	NUP	90	2	0.167346719999506	13
180912_LG_Evgeny81_10b	MLP1	NUP85	NUP	90	2	0.175981960722998	14
180912_LG_Evgeny81_10b	MLP1	PAB1	NTR-like	90	2	0.325586225304397	11
180912_LG_Evgeny81_10b	MLP1	POM152	NUP	90	2	0.141105469493787	25
180912_LG_Evgeny81_10b	MLP1	POM34	NUP	90	2	0.16365879791294	8
180912_LG_Evgeny81_10b	MLP1	PSE1	NTR	90	2	0.316258802161815	4
180912_LG_Evgeny81_10b	MLP1	PUF6	NTR-like	90	2	0.343680662144709	6
180912_LG_Evgeny81_10b	MLP1	RPP0	NTR-like	90	2	0.341638791694109	5
180912_LG_Evgeny81_10b	MLP1	RPS2	NTR-like	90	2	0.34120207123098	5
180912_LG_Evgeny81_10b	MLP1	RPS3	NTR-like	90	2	0.354103183955824	5
180912_LG_Evgeny81_10b	MLP1	SAC3	NTR-like	90	2	0.314973217608764	25
180912_LG_Evgeny81_10b	MLP1	SEC13	NUP	90	2	0.218587708522476	7
180912_LG_Evgeny81_10b	MLP1	SEH1	NUP	90	2	0.117617495799438	5
180912_LG_Evgeny81_10b	MLP1	SPT5	NTR-like	90	2	0.32340191011057	10
180912_LG_Evgeny81_10b	MLP1	SRM1	NTR-like	90	2	0.328621858050956	6
180912_LG_Evgeny81_10b	MLP1	SRP1	NTR	90	2	0.325745034875991	7
180912_LG_Evgeny81_10b	MLP1	SSE1	NTR-like	90	2	0.358201489365669	12
180912_LG_Evgeny81_10b	MLP1	SUP35	NTR-like	90	2	0.326578220431839	7
180912_LG_Evgeny81_10b	MLP1	TCB3	NTR-like	90	2	0.311686536400512	9
180912_LG_Evgeny81_10b	MLP1	UTP22	NTR-like	90	2	0.328653784210344	23
180912_LG_Evgeny81_10b	MLP1	UTP25	NTR-like	90	2	0.33940760818397	5
180912_LG_Evgeny81_10b	MLP1	YEF3	NTR-like	90	2	0.342764914140277	15
180912_LG_Evgeny81_11	MLP1	CRM1	NTR	120	2	0.374117900050426	3
180912_LG_Evgeny81_11	MLP1	DBP9	NTR-like	120	2	0.435497140337293	6
180912_LG_Evgeny81_11	MLP1	ENP1	NTR-like	120	2	0.451013157114876	5
180912_LG_Evgeny81_11	MLP1	FBA1	NTR-like	120	2	0.431766483129582	3
180912_LG_Evgeny81_11	MLP1	GLE1	NUP	120	2	0.392172691511301	4
180912_LG_Evgeny81_11	MLP1	GLE2	NUP	120	2	0.2953453385052	6
180912_LG_Evgeny81_11	MLP1	KAP123	NTR	120	2	0.443617972937443	13
180912_LG_Evgeny81_11	MLP1	KAP95	NTR	120	2	0.430737873869497	13
180912_LG_Evgeny81_11	MLP1	KRE33	NTR-like	120	2	0.445281429095995	23
180912_LG_Evgeny81_11	MLP1	MAK21	NTR-like	120	2	0.436772767701427	16
180912_LG_Evgeny81_11	MLP1	MEX67	NTR	120	2	0.434378685532074	10
180912_LG_Evgeny81_11	MLP1	MLP1	NUP	120	2	0.4555757074386	95
180912_LG_Evgeny81_11	MLP1	MLP2	NUP	120	2	0.372153900051433	56
180912_LG_Evgeny81_11	MLP1	NDC1	NUP	120	2	0.42113122412823	5
180912_LG_Evgeny81_11	MLP1	NIC96	NUP	120	2	0.246011158913131	14
180912_LG_Evgeny81_11	MLP1	NSP1	NUP	120	2	0.154042095788583	39
180912_LG_Evgeny81_11	MLP1	NUP1	NUP	120	2	0.387089344559984	20
180912_LG_Evgeny81_11	MLP1	NUP100	NUP	120	2	0.290714552153841	13
180912_LG_Evgeny81_11	MLP1	NUP116	NUP	120	2	0.351401878725198	17
180912_LG_Evgeny81_11	MLP1	NUP120	NUP	120	2	0.268357890238709	15
180912_LG_Evgeny81_11	MLP1	NUP133	NUP	120	2	0.203070750032293	31
180912_LG_Evgeny81_11	MLP1	NUP145C	NUP	120	2	0.282473995800518	19
180912_LG_Evgeny81_11	MLP1	NUP145N	NUP	120	2	0.322846079679768	15
180912_LG_Evgeny81_11	MLP1	NUP157	NUP	120	2	0.229160396831275	22
180912_LG_Evgeny81_11	MLP1	NUP159	NUP	120	2	0.218538005385757	35
180912_LG_Evgeny81_11	MLP1	NUP170	NUP	120	2	0.242284421055177	33
180912_LG_Evgeny81_11	MLP1	NUP188	NUP	120	2	0.171677515449689	29
180912_LG_Evgeny81_11	MLP1	NUP192	NUP	120	2	0.192508531002545	24
180912_LG_Evgeny81_11	MLP1	NUP2	NUP	120	2	0.431900671775139	29
180912_LG_Evgeny81_11	MLP1	NUP49	NUP	120	2	0.239139227435598	6
180912_LG_Evgeny81_11	MLP1	NUP53	NUP	120	2	0.277652246077876	10
180912_LG_Evgeny81_11	MLP1	NUP57	NUP	120	2	0.220661246260826	13
180912_LG_Evgeny81_11	MLP1	NUP59	NUP	120	2	0.279946229165629	8
180912_LG_Evgeny81_11	MLP1	NUP60	NUP	120	2	0.424996393180874	17
180912_LG_Evgeny81_11	MLP1	NUP82	NUP	120	2	0.234418796865583	13
180912_LG_Evgeny81_11	MLP1	NUP84	NUP	120	2	0.258998251461201	13
180912_LG_Evgeny81_11	MLP1	NUP85	NUP	120	2	0.270562625580418	14
180912_LG_Evgeny81_11	MLP1	PAB1	NTR-like	120	2	0.429280562839875	11
180912_LG_Evgeny81_11	MLP1	POM152	NUP	120	2	0.220560628677885	25
180912_LG_Evgeny81_11	MLP1	POM34	NUP	120	2	0.245504803360317	8
180912_LG_Evgeny81_11	MLP1	PSE1	NTR	120	2	0.413188642136507	4
180912_LG_Evgeny81_11	MLP1	PUF6	NTR-like	120	2	0.44384981768874	6
180912_LG_Evgeny81_11	MLP1	RPP0	NTR-like	120	2	0.452764985094589	5
180912_LG_Evgeny81_11	MLP1	RPS2	NTR-like	120	2	0.452070410817318	5
180912_LG_Evgeny81_11	MLP1	RPS3	NTR-like	120	2	0.459511704712799	5
180912_LG_Evgeny81_11	MLP1	SAC3	NTR-like	120	2	0.427117389592554	26
180912_LG_Evgeny81_11	MLP1	SEC13	NUP	120	2	0.310401256897002	7
180912_LG_Evgeny81_11	MLP1	SEH1	NUP	120	2	0.202802814263791	5
180912_LG_Evgeny81_11	MLP1	SPT5	NTR-like	120	2	0.439228201262219	10
180912_LG_Evgeny81_11	MLP1	SRM1	NTR-like	120	2	0.436023309727947	6
180912_LG_Evgeny81_11	MLP1	SRP1	NTR	120	2	0.43550258426422	7
180912_LG_Evgeny81_11	MLP1	SSE1	NTR-like	120	2	0.464284384463597	13
180912_LG_Evgeny81_11	MLP1	SUP35	NTR-like	120	2	0.436218188811266	7
180912_LG_Evgeny81_11	MLP1	TCB3	NTR-like	120	2	0.415489025567781	9
180912_LG_Evgeny81_11	MLP1	UTP22	NTR-like	120	2	0.437482965053083	23
180912_LG_Evgeny81_11	MLP1	UTP25	NTR-like	120	2	0.443201572841581	5
180912_LG_Evgeny81_11	MLP1	YEF3	NTR-like	120	2	0.449210959959631	15
180912_LG_Evgeny81_12	MLP1	CRM1	NTR	150	2	0.494310532483254	3
180912_LG_Evgeny81_12	MLP1	DBP9	NTR-like	150	2	0.509316389858118	6
180912_LG_Evgeny81_12	MLP1	ENP1	NTR-like	150	2	0.530195284106222	5
180912_LG_Evgeny81_12	MLP1	FBA1	NTR-like	150	2	0.535715570684941	3
180912_LG_Evgeny81_12	MLP1	GLE1	NUP	150	2	0.495754690505087	4
180912_LG_Evgeny81_12	MLP1	GLE2	NUP	150	2	0.401777524985532	6
180912_LG_Evgeny81_12	MLP1	KAP123	NTR	150	2	0.525070970671036	13
180912_LG_Evgeny81_12	MLP1	KAP95	NTR	150	2	0.534561730059539	13
180912_LG_Evgeny81_12	MLP1	KRE33	NTR-like	150	2	0.527888623387635	23
180912_LG_Evgeny81_12	MLP1	MAK21	NTR-like	150	2	0.522151242854623	15
180912_LG_Evgeny81_12	MLP1	MEX67	NTR	150	2	0.534755969181363	10
180912_LG_Evgeny81_12	MLP1	MLP1	NUP	150	2	0.561855043587061	95
180912_LG_Evgeny81_12	MLP1	MLP2	NUP	150	2	0.485515979169699	56
180912_LG_Evgeny81_12	MLP1	NDC1	NUP	150	2	0.527628193346591	5
180912_LG_Evgeny81_12	MLP1	NIC96	NUP	150	2	0.340300971415572	14
180912_LG_Evgeny81_12	MLP1	NSP1	NUP	150	2	0.241347042555508	39
180912_LG_Evgeny81_12	MLP1	NUP1	NUP	150	2	0.497445937660835	20
180912_LG_Evgeny81_12	MLP1	NUP100	NUP	150	2	0.379169774476418	13
180912_LG_Evgeny81_12	MLP1	NUP116	NUP	150	2	0.447775534815315	17
180912_LG_Evgeny81_12	MLP1	NUP120	NUP	150	2	0.370106479298229	15
180912_LG_Evgeny81_12	MLP1	NUP133	NUP	150	2	0.302864184238803	31
180912_LG_Evgeny81_12	MLP1	NUP145C	NUP	150	2	0.382974366531672	20
180912_LG_Evgeny81_12	MLP1	NUP145N	NUP	150	2	0.411897836980643	15
180912_LG_Evgeny81_12	MLP1	NUP157	NUP	150	2	0.316653936150025	22
180912_LG_Evgeny81_12	MLP1	NUP159	NUP	150	2	0.307078647176518	36
180912_LG_Evgeny81_12	MLP1	NUP170	NUP	150	2	0.326831369822622	32
180912_LG_Evgeny81_12	MLP1	NUP188	NUP	150	2	0.256685031402316	29
180912_LG_Evgeny81_12	MLP1	NUP192	NUP	150	2	0.283217028072234	24
180912_LG_Evgeny81_12	MLP1	NUP2	NUP	150	2	0.534038274653537	29
180912_LG_Evgeny81_12	MLP1	NUP49	NUP	150	2	0.336147579840561	6
180912_LG_Evgeny81_12	MLP1	NUP53	NUP	150	2	0.367463845826489	10
180912_LG_Evgeny81_12	MLP1	NUP57	NUP	150	2	0.316772709718172	13
180912_LG_Evgeny81_12	MLP1	NUP59	NUP	150	2	0.374609424716152	8
180912_LG_Evgeny81_12	MLP1	NUP60	NUP	150	2	0.53546078127936	17
180912_LG_Evgeny81_12	MLP1	NUP82	NUP	150	2	0.323045887994375	13
180912_LG_Evgeny81_12	MLP1	NUP84	NUP	150	2	0.359785285044655	13
180912_LG_Evgeny81_12	MLP1	NUP85	NUP	150	2	0.373383935692637	14
180912_LG_Evgeny81_12	MLP1	PAB1	NTR-like	150	2	0.522412375623099	11
180912_LG_Evgeny81_12	MLP1	POM152	NUP	150	2	0.311877171902835	25
180912_LG_Evgeny81_12	MLP1	POM34	NUP	150	2	0.339156011832687	8
180912_LG_Evgeny81_12	MLP1	PSE1	NTR	150	2	0.536213972963311	4
180912_LG_Evgeny81_12	MLP1	PUF6	NTR-like	150	2	0.524068069463964	6
180912_LG_Evgeny81_12	MLP1	RPP0	NTR-like	150	2	0.548598233868075	5
180912_LG_Evgeny81_12	MLP1	RPS2	NTR-like	150	2	0.543392508953589	5
180912_LG_Evgeny81_12	MLP1	RPS3	NTR-like	150	2	0.55533610034873	5
180912_LG_Evgeny81_12	MLP1	SAC3	NTR-like	150	2	0.537636618642667	26
180912_LG_Evgeny81_12	MLP1	SEC13	NUP	150	2	0.410106630437912	7
180912_LG_Evgeny81_12	MLP1	SEH1	NUP	150	2	0.304021376878061	5
180912_LG_Evgeny81_12	MLP1	SPT5	NTR-like	150	2	0.544551501110241	10
180912_LG_Evgeny81_12	MLP1	SRM1	NTR-like	150	2	0.535999369805409	6
180912_LG_Evgeny81_12	MLP1	SRP1	NTR	150	2	0.532186098855845	7
180912_LG_Evgeny81_12	MLP1	SSE1	NTR-like	150	2	0.554126663659302	13
180912_LG_Evgeny81_12	MLP1	SUP35	NTR-like	150	2	0.527837286609373	7
180912_LG_Evgeny81_12	MLP1	TCB3	NTR-like	150	2	0.522896568463231	8
180912_LG_Evgeny81_12	MLP1	UTP22	NTR-like	150	2	0.537132978171259	23
180912_LG_Evgeny81_12	MLP1	UTP25	NTR-like	150	2	0.523907048918389	5
180912_LG_Evgeny81_12	MLP1	YEF3	NTR-like	150	2	0.536607500872288	15
180912_LG_Evgeny81_14	MLP1	CRM1	NTR	30	3	0.087016567027767	3
180912_LG_Evgeny81_14	MLP1	DBP9	NTR-like	30	3	0.098461940305137	6
180912_LG_Evgeny81_14	MLP1	ENP1	NTR-like	30	3	0.125227950786219	4
180912_LG_Evgeny81_14	MLP1	FBA1	NTR-like	30	3	0.097465341935309	3
180912_LG_Evgeny81_14	MLP1	GLE1	NUP	30	3	0.072076115802697	4
180912_LG_Evgeny81_14	MLP1	GLE2	NUP	30	3	0.03240977954452	6
180912_LG_Evgeny81_14	MLP1	KAP123	NTR	30	3	0.103398003602711	13
180912_LG_Evgeny81_14	MLP1	KAP95	NTR	30	3	0.10597427448296	13
180912_LG_Evgeny81_14	MLP1	KRE33	NTR-like	30	3	0.119575715003223	23
180912_LG_Evgeny81_14	MLP1	MAK21	NTR-like	30	3	0.11753349357611	15
180912_LG_Evgeny81_14	MLP1	MEX67	NTR	30	3	0.100026190337664	10
180912_LG_Evgeny81_14	MLP1	MLP1	NUP	30	3	0.097933387059311	95
180912_LG_Evgeny81_14	MLP1	MLP2	NUP	30	3	0.04893794823768	56
180912_LG_Evgeny81_14	MLP1	NDC1	NUP	30	3	0.084289195543542	5
180912_LG_Evgeny81_14	MLP1	NIC96	NUP	30	3	0.026642005392638	14
180912_LG_Evgeny81_14	MLP1	NSP1	NUP	30	3	0.006778526777387	40
180912_LG_Evgeny81_14	MLP1	NUP1	NUP	30	3	0.059774325927006	20
180912_LG_Evgeny81_14	MLP1	NUP100	NUP	30	3	0.043330049329604	13
180912_LG_Evgeny81_14	MLP1	NUP116	NUP	30	3	0.062200621223609	17
180912_LG_Evgeny81_14	MLP1	NUP120	NUP	30	3	0.034188418116083	15
180912_LG_Evgeny81_14	MLP1	NUP133	NUP	30	3	0.019842631538688	31
180912_LG_Evgeny81_14	MLP1	NUP145C	NUP	30	3	0.041098776247954	20
180912_LG_Evgeny81_14	MLP1	NUP145N	NUP	30	3	0.060860070742179	15
180912_LG_Evgeny81_14	MLP1	NUP157	NUP	30	3	0.022953041013538	21
180912_LG_Evgeny81_14	MLP1	NUP159	NUP	30	3	0.027359839363252	36
180912_LG_Evgeny81_14	MLP1	NUP170	NUP	30	3	0.031688091838613	32
180912_LG_Evgeny81_14	MLP1	NUP188	NUP	30	3	0.012058583337226	29
180912_LG_Evgeny81_14	MLP1	NUP192	NUP	30	3	0.015078759028147	24
180912_LG_Evgeny81_14	MLP1	NUP2	NUP	30	3	0.093436595134566	29
180912_LG_Evgeny81_14	MLP1	NUP49	NUP	30	3	0.017463552055053	6
180912_LG_Evgeny81_14	MLP1	NUP53	NUP	30	3	0.041854217713058	10
180912_LG_Evgeny81_14	MLP1	NUP57	NUP	30	3	0.012541195860769	13
180912_LG_Evgeny81_14	MLP1	NUP59	NUP	30	3	0.031433339638761	8
180912_LG_Evgeny81_14	MLP1	NUP60	NUP	30	3	0.073684480417547	17
180912_LG_Evgeny81_14	MLP1	NUP82	NUP	30	3	0.033840141510535	13
180912_LG_Evgeny81_14	MLP1	NUP84	NUP	30	3	0.027843095518124	13
180912_LG_Evgeny81_14	MLP1	NUP85	NUP	30	3	0.036837351508863	14
180912_LG_Evgeny81_14	MLP1	PAB1	NTR-like	30	3	0.097560784636408	11
180912_LG_Evgeny81_14	MLP1	POM152	NUP	30	3	0.019586446859333	25
180912_LG_Evgeny81_14	MLP1	POM34	NUP	30	3	0.026140796603149	7
180912_LG_Evgeny81_14	MLP1	PSE1	NTR	30	3	0.100028427379957	4
180912_LG_Evgeny81_14	MLP1	PUF6	NTR-like	30	3	0.130912719244316	6
180912_LG_Evgeny81_14	MLP1	RPP0	NTR-like	30	3	0.089471051886678	5
180912_LG_Evgeny81_14	MLP1	RPS2	NTR-like	30	3	0.093110532260681	5
180912_LG_Evgeny81_14	MLP1	RPS3	NTR-like	30	3	0.095435926026906	5
180912_LG_Evgeny81_14	MLP1	SAC3	NTR-like	30	3	0.089158614661838	26
180912_LG_Evgeny81_14	MLP1	SEC13	NUP	30	3	0.052035344072842	7
180912_LG_Evgeny81_14	MLP1	SEH1	NUP	30	3	0.012249177683858	5
180912_LG_Evgeny81_14	MLP1	SPT5	NTR-like	30	3	0.099691898117355	10
180912_LG_Evgeny81_14	MLP1	SRM1	NTR-like	30	3	0.10046057623728	6
180912_LG_Evgeny81_14	MLP1	SRP1	NTR	30	3	0.100918505897271	7
180912_LG_Evgeny81_14	MLP1	SSE1	NTR-like	30	3	0.10668277651713	13
180912_LG_Evgeny81_14	MLP1	SUP35	NTR-like	30	3	0.10945612240353	7
180912_LG_Evgeny81_14	MLP1	TCB3	NTR-like	30	3	0.094145358225496	9
180912_LG_Evgeny81_14	MLP1	UTP22	NTR-like	30	3	0.105727214603421	22
180912_LG_Evgeny81_14	MLP1	UTP25	NTR-like	30	3	0.124348294282321	5
180912_LG_Evgeny81_14	MLP1	YEF3	NTR-like	30	3	0.102060442787058	14
180912_LG_Evgeny81_15	MLP1	CRM1	NTR	60	3	0.194947807008098	3
180912_LG_Evgeny81_15	MLP1	DBP9	NTR-like	60	3	0.217509779929119	6
180912_LG_Evgeny81_15	MLP1	ENP1	NTR-like	60	3	0.23792367553856	5
180912_LG_Evgeny81_15	MLP1	FBA1	NTR-like	60	3	0.194263094948574	3
180912_LG_Evgeny81_15	MLP1	GLE1	NUP	60	3	0.181475095254158	4
180912_LG_Evgeny81_15	MLP1	GLE2	NUP	60	3	0.104369972467117	6
180912_LG_Evgeny81_15	MLP1	KAP123	NTR	60	3	0.223015524469132	13
180912_LG_Evgeny81_15	MLP1	KAP95	NTR	60	3	0.214619829786755	13
180912_LG_Evgeny81_15	MLP1	KRE33	NTR-like	60	3	0.231029130952891	22
180912_LG_Evgeny81_15	MLP1	MAK21	NTR-like	60	3	0.223811163086875	15
180912_LG_Evgeny81_15	MLP1	MEX67	NTR	60	3	0.213840857502388	10
180912_LG_Evgeny81_15	MLP1	MLP1	NUP	60	3	0.223576644789972	95
180912_LG_Evgeny81_15	MLP1	MLP2	NUP	60	3	0.147115530759788	56
180912_LG_Evgeny81_15	MLP1	NDC1	NUP	60	3	0.199958674204991	5
180912_LG_Evgeny81_15	MLP1	NIC96	NUP	60	3	0.079112878961477	14
180912_LG_Evgeny81_15	MLP1	NSP1	NUP	60	3	0.031465742649971	40
180912_LG_Evgeny81_15	MLP1	NUP1	NUP	60	3	0.156795417334208	20
180912_LG_Evgeny81_15	MLP1	NUP100	NUP	60	3	0.10838338284099	13
180912_LG_Evgeny81_15	MLP1	NUP116	NUP	60	3	0.148781955874294	17
180912_LG_Evgeny81_15	MLP1	NUP120	NUP	60	3	0.092779803910941	15
180912_LG_Evgeny81_15	MLP1	NUP133	NUP	60	3	0.060442400998174	31
180912_LG_Evgeny81_15	MLP1	NUP145C	NUP	60	3	0.103176062525758	20
180912_LG_Evgeny81_15	MLP1	NUP145N	NUP	60	3	0.138378763653492	15
180912_LG_Evgeny81_15	MLP1	NUP157	NUP	60	3	0.06799678485814	22
180912_LG_Evgeny81_15	MLP1	NUP159	NUP	60	3	0.070371307222642	36
180912_LG_Evgeny81_15	MLP1	NUP170	NUP	60	3	0.08142770812648	33
180912_LG_Evgeny81_15	MLP1	NUP188	NUP	60	3	0.043261925402883	28
180912_LG_Evgeny81_15	MLP1	NUP192	NUP	60	3	0.051333989223907	24
180912_LG_Evgeny81_15	MLP1	NUP2	NUP	60	3	0.207550765078386	28
180912_LG_Evgeny81_15	MLP1	NUP49	NUP	60	3	0.063900252241756	6
180912_LG_Evgeny81_15	MLP1	NUP53	NUP	60	3	0.102985829947669	10
180912_LG_Evgeny81_15	MLP1	NUP57	NUP	60	3	0.055281466468287	13
180912_LG_Evgeny81_15	MLP1	NUP59	NUP	60	3	0.095886923498729	8
180912_LG_Evgeny81_15	MLP1	NUP60	NUP	60	3	0.190703941551636	17
180912_LG_Evgeny81_15	MLP1	NUP82	NUP	60	3	0.083443246880745	13
180912_LG_Evgeny81_15	MLP1	NUP84	NUP	60	3	0.083173842125194	13
180912_LG_Evgeny81_15	MLP1	NUP85	NUP	60	3	0.099160001491184	14
180912_LG_Evgeny81_15	MLP1	PAB1	NTR-like	60	3	0.209620930091976	11
180912_LG_Evgeny81_15	MLP1	POM152	NUP	60	3	0.061932325491466	25
180912_LG_Evgeny81_15	MLP1	POM34	NUP	60	3	0.077667951014755	8
180912_LG_Evgeny81_15	MLP1	PSE1	NTR	60	3	0.20899616805195	4
180912_LG_Evgeny81_15	MLP1	PUF6	NTR-like	60	3	0.239560935527134	6
180912_LG_Evgeny81_15	MLP1	RPP0	NTR-like	60	3	0.199520882620338	5
180912_LG_Evgeny81_15	MLP1	RPS2	NTR-like	60	3	0.200051506290583	5
180912_LG_Evgeny81_15	MLP1	RPS3	NTR-like	60	3	0.205227889523408	5
180912_LG_Evgeny81_15	MLP1	SAC3	NTR-like	60	3	0.206461557120291	26
180912_LG_Evgeny81_15	MLP1	SEC13	NUP	60	3	0.121480902436209	7
180912_LG_Evgeny81_15	MLP1	SEH1	NUP	60	3	0.04944854857977	5
180912_LG_Evgeny81_15	MLP1	SPT5	NTR-like	60	3	0.220578331927798	10
180912_LG_Evgeny81_15	MLP1	SRM1	NTR-like	60	3	0.211134260866708	6
180912_LG_Evgeny81_15	MLP1	SRP1	NTR	60	3	0.212744407791597	7
180912_LG_Evgeny81_15	MLP1	SSE1	NTR-like	60	3	0.227691222378078	13
180912_LG_Evgeny81_15	MLP1	SUP35	NTR-like	60	3	0.218130111176743	7
180912_LG_Evgeny81_15	MLP1	TCB3	NTR-like	60	3	0.203995556116136	9
180912_LG_Evgeny81_15	MLP1	UTP22	NTR-like	60	3	0.213399398470751	23
180912_LG_Evgeny81_15	MLP1	UTP25	NTR-like	60	3	0.234572546603157	5
180912_LG_Evgeny81_15	MLP1	YEF3	NTR-like	60	3	0.219066850456799	15
180912_LG_Evgeny81_16	MLP1	CRM1	NTR	90	3	0.283282846445086	3
180912_LG_Evgeny81_16	MLP1	DBP9	NTR-like	90	3	0.344081612445387	6
180912_LG_Evgeny81_16	MLP1	ENP1	NTR-like	90	3	0.360469383195485	5
180912_LG_Evgeny81_16	MLP1	FBA1	NTR-like	90	3	0.322663506861463	3
180912_LG_Evgeny81_16	MLP1	GLE1	NUP	90	3	0.290850987606047	4
180912_LG_Evgeny81_16	MLP1	GLE2	NUP	90	3	0.197781884080912	6
180912_LG_Evgeny81_16	MLP1	KAP123	NTR	90	3	0.350563156374448	13
180912_LG_Evgeny81_16	MLP1	KAP95	NTR	90	3	0.326162578244153	13
180912_LG_Evgeny81_16	MLP1	KRE33	NTR-like	90	3	0.356038146813753	23
180912_LG_Evgeny81_16	MLP1	MAK21	NTR-like	90	3	0.345953229463487	16
180912_LG_Evgeny81_16	MLP1	MEX67	NTR	90	3	0.324513004491339	10
180912_LG_Evgeny81_16	MLP1	MLP1	NUP	90	3	0.344646910972323	95
180912_LG_Evgeny81_16	MLP1	MLP2	NUP	90	3	0.264635423254589	56
180912_LG_Evgeny81_16	MLP1	NDC1	NUP	90	3	0.312362989134224	5
180912_LG_Evgeny81_16	MLP1	NIC96	NUP	90	3	0.157732999079921	14
180912_LG_Evgeny81_16	MLP1	NSP1	NUP	90	3	0.082458513066313	40
180912_LG_Evgeny81_16	MLP1	NUP1	NUP	90	3	0.274840353394652	20
180912_LG_Evgeny81_16	MLP1	NUP100	NUP	90	3	0.195496509197832	13
180912_LG_Evgeny81_16	MLP1	NUP116	NUP	90	3	0.250974647975003	17
180912_LG_Evgeny81_16	MLP1	NUP120	NUP	90	3	0.173697575889261	15
180912_LG_Evgeny81_16	MLP1	NUP133	NUP	90	3	0.12393773751599	31
180912_LG_Evgeny81_16	MLP1	NUP145C	NUP	90	3	0.188871039317579	20
180912_LG_Evgeny81_16	MLP1	NUP145N	NUP	90	3	0.231918750923226	15
180912_LG_Evgeny81_16	MLP1	NUP157	NUP	90	3	0.139942443194643	22
180912_LG_Evgeny81_16	MLP1	NUP159	NUP	90	3	0.138995072050012	36
180912_LG_Evgeny81_16	MLP1	NUP170	NUP	90	3	0.1565912813628	33
180912_LG_Evgeny81_16	MLP1	NUP188	NUP	90	3	0.09786606096417	29
180912_LG_Evgeny81_16	MLP1	NUP192	NUP	90	3	0.113180244806323	24
180912_LG_Evgeny81_16	MLP1	NUP2	NUP	90	3	0.318946264501813	29
180912_LG_Evgeny81_16	MLP1	NUP49	NUP	90	3	0.142932468468292	6
180912_LG_Evgeny81_16	MLP1	NUP53	NUP	90	3	0.185671228408239	10
180912_LG_Evgeny81_16	MLP1	NUP57	NUP	90	3	0.128736493956539	13
180912_LG_Evgeny81_16	MLP1	NUP59	NUP	90	3	0.178403942895142	8
180912_LG_Evgeny81_16	MLP1	NUP60	NUP	90	3	0.312774279256418	17
180912_LG_Evgeny81_16	MLP1	NUP82	NUP	90	3	0.150837023282202	13
180912_LG_Evgeny81_16	MLP1	NUP84	NUP	90	3	0.16228352530544	13
180912_LG_Evgeny81_16	MLP1	NUP85	NUP	90	3	0.183146666753121	14
180912_LG_Evgeny81_16	MLP1	PAB1	NTR-like	90	3	0.327531100505397	11
180912_LG_Evgeny81_16	MLP1	POM152	NUP	90	3	0.131259554957376	25
180912_LG_Evgeny81_16	MLP1	POM34	NUP	90	3	0.161514963513047	8
180912_LG_Evgeny81_16	MLP1	PSE1	NTR	90	3	0.321943542931319	4
180912_LG_Evgeny81_16	MLP1	PUF6	NTR-like	90	3	0.355877357599412	6
180912_LG_Evgeny81_16	MLP1	RPP0	NTR-like	90	3	0.325899187154878	5
180912_LG_Evgeny81_16	MLP1	RPS2	NTR-like	90	3	0.329209665399626	5
180912_LG_Evgeny81_16	MLP1	RPS3	NTR-like	90	3	0.331531813699344	5
180912_LG_Evgeny81_16	MLP1	SAC3	NTR-like	90	3	0.322978807751707	26
180912_LG_Evgeny81_16	MLP1	SEC13	NUP	90	3	0.208222859507735	7
180912_LG_Evgeny81_16	MLP1	SEH1	NUP	90	3	0.115479708377761	5
180912_LG_Evgeny81_16	MLP1	SPT5	NTR-like	90	3	0.339425709437482	10
180912_LG_Evgeny81_16	MLP1	SRM1	NTR-like	90	3	0.331698603366044	6
180912_LG_Evgeny81_16	MLP1	SRP1	NTR	90	3	0.325667936545114	7
180912_LG_Evgeny81_16	MLP1	SSE1	NTR-like	90	3	0.345871722698952	13
180912_LG_Evgeny81_16	MLP1	SUP35	NTR-like	90	3	0.335613995968966	7
180912_LG_Evgeny81_16	MLP1	TCB3	NTR-like	90	3	0.316121241130509	9
180912_LG_Evgeny81_16	MLP1	UTP22	NTR-like	90	3	0.332248344875446	23
180912_LG_Evgeny81_16	MLP1	UTP25	NTR-like	90	3	0.355175693448463	5
180912_LG_Evgeny81_16	MLP1	YEF3	NTR-like	90	3	0.349692734392974	14
180912_LG_Evgeny81_17	MLP1	CRM1	NTR	120	3	0.395173817956571	3
180912_LG_Evgeny81_17	MLP1	DBP9	NTR-like	120	3	0.441953783394205	6
180912_LG_Evgeny81_17	MLP1	ENP1	NTR-like	120	3	0.450291656613945	5
180912_LG_Evgeny81_17	MLP1	FBA1	NTR-like	120	3	0.41951287911921	2
180912_LG_Evgeny81_17	MLP1	GLE1	NUP	120	3	0.396134192123182	4
180912_LG_Evgeny81_17	MLP1	GLE2	NUP	120	3	0.300454884682361	6
180912_LG_Evgeny81_17	MLP1	KAP123	NTR	120	3	0.442478929753656	13
180912_LG_Evgeny81_17	MLP1	KAP95	NTR	120	3	0.429023823553543	12
180912_LG_Evgeny81_17	MLP1	KRE33	NTR-like	120	3	0.447806955740068	23
180912_LG_Evgeny81_17	MLP1	MAK21	NTR-like	120	3	0.440543053082743	15
180912_LG_Evgeny81_17	MLP1	MEX67	NTR	120	3	0.427182757632343	10
180912_LG_Evgeny81_17	MLP1	MLP1	NUP	120	3	0.456727506455348	95
180912_LG_Evgeny81_17	MLP1	MLP2	NUP	120	3	0.376337396984076	56
180912_LG_Evgeny81_17	MLP1	NDC1	NUP	120	3	0.428788297845921	5
180912_LG_Evgeny81_17	MLP1	NIC96	NUP	120	3	0.253585231953359	14
180912_LG_Evgeny81_17	MLP1	NSP1	NUP	120	3	0.155107501946449	40
180912_LG_Evgeny81_17	MLP1	NUP1	NUP	120	3	0.389568489834025	19
180912_LG_Evgeny81_17	MLP1	NUP100	NUP	120	3	0.291769170188173	13
180912_LG_Evgeny81_17	MLP1	NUP116	NUP	120	3	0.354897179998167	17
180912_LG_Evgeny81_17	MLP1	NUP120	NUP	120	3	0.269825605049197	15
180912_LG_Evgeny81_17	MLP1	NUP133	NUP	120	3	0.20506802739122	31
180912_LG_Evgeny81_17	MLP1	NUP145C	NUP	120	3	0.284104011412064	20
180912_LG_Evgeny81_17	MLP1	NUP145N	NUP	120	3	0.320567067702715	15
180912_LG_Evgeny81_17	MLP1	NUP157	NUP	120	3	0.224860585494073	22
180912_LG_Evgeny81_17	MLP1	NUP159	NUP	120	3	0.220194846124007	35
180912_LG_Evgeny81_17	MLP1	NUP170	NUP	120	3	0.241661316346286	33
180912_LG_Evgeny81_17	MLP1	NUP188	NUP	120	3	0.173983433604656	29
180912_LG_Evgeny81_17	MLP1	NUP192	NUP	120	3	0.192931610929517	24
180912_LG_Evgeny81_17	MLP1	NUP2	NUP	120	3	0.426401889939386	29
180912_LG_Evgeny81_17	MLP1	NUP49	NUP	120	3	0.238635589398157	6
180912_LG_Evgeny81_17	MLP1	NUP53	NUP	120	3	0.279346708298422	10
180912_LG_Evgeny81_17	MLP1	NUP57	NUP	120	3	0.222077175931344	13
180912_LG_Evgeny81_17	MLP1	NUP59	NUP	120	3	0.283445449092259	8
180912_LG_Evgeny81_17	MLP1	NUP60	NUP	120	3	0.420364716381067	17
180912_LG_Evgeny81_17	MLP1	NUP82	NUP	120	3	0.235273233358995	13
180912_LG_Evgeny81_17	MLP1	NUP84	NUP	120	3	0.259254061006675	13
180912_LG_Evgeny81_17	MLP1	NUP85	NUP	120	3	0.276042269908349	14
180912_LG_Evgeny81_17	MLP1	PAB1	NTR-like	120	3	0.42818759758957	11
180912_LG_Evgeny81_17	MLP1	POM152	NUP	120	3	0.218321790887947	25
180912_LG_Evgeny81_17	MLP1	POM34	NUP	120	3	0.254274436577399	8
180912_LG_Evgeny81_17	MLP1	PSE1	NTR	120	3	0.432436397348631	4
180912_LG_Evgeny81_17	MLP1	PUF6	NTR-like	120	3	0.448065191350895	6
180912_LG_Evgeny81_17	MLP1	RPP0	NTR-like	120	3	0.43079199438952	5
180912_LG_Evgeny81_17	MLP1	RPS2	NTR-like	120	3	0.429315466311235	5
180912_LG_Evgeny81_17	MLP1	RPS3	NTR-like	120	3	0.441924778820216	5
180912_LG_Evgeny81_17	MLP1	SAC3	NTR-like	120	3	0.425554263883176	26
180912_LG_Evgeny81_17	MLP1	SEC13	NUP	120	3	0.311494320988902	7
180912_LG_Evgeny81_17	MLP1	SEH1	NUP	120	3	0.196802353581194	5
180912_LG_Evgeny81_17	MLP1	SPT5	NTR-like	120	3	0.446112249906824	10
180912_LG_Evgeny81_17	MLP1	SRM1	NTR-like	120	3	0.430977296375708	6
180912_LG_Evgeny81_17	MLP1	SRP1	NTR	120	3	0.433629179560113	7
180912_LG_Evgeny81_17	MLP1	SSE1	NTR-like	120	3	0.446830014372574	13
180912_LG_Evgeny81_17	MLP1	SUP35	NTR-like	120	3	0.432946643250362	7
180912_LG_Evgeny81_17	MLP1	TCB3	NTR-like	120	3	0.418546009323716	9
180912_LG_Evgeny81_17	MLP1	UTP22	NTR-like	120	3	0.433001499758875	23
180912_LG_Evgeny81_17	MLP1	UTP25	NTR-like	120	3	0.448115689434305	5
180912_LG_Evgeny81_17	MLP1	YEF3	NTR-like	120	3	0.445691005111993	15
180912_LG_Evgeny81_18	MLP1	CRM1	NTR	150	3	0.497405759137607	3
180912_LG_Evgeny81_18	MLP1	DBP9	NTR-like	150	3	0.502773572718923	6
180912_LG_Evgeny81_18	MLP1	ENP1	NTR-like	150	3	0.521132596695967	5
180912_LG_Evgeny81_18	MLP1	FBA1	NTR-like	150	3	0.512771986443429	2
180912_LG_Evgeny81_18	MLP1	GLE1	NUP	150	3	0.500344919346978	4
180912_LG_Evgeny81_18	MLP1	GLE2	NUP	150	3	0.391424643942225	6
180912_LG_Evgeny81_18	MLP1	KAP123	NTR	150	3	0.521109393651188	13
180912_LG_Evgeny81_18	MLP1	KAP95	NTR	150	3	0.515464494592904	13
180912_LG_Evgeny81_18	MLP1	KRE33	NTR-like	150	3	0.51881874647967	23
180912_LG_Evgeny81_18	MLP1	MAK21	NTR-like	150	3	0.510216334873625	15
180912_LG_Evgeny81_18	MLP1	MEX67	NTR	150	3	0.519529435084947	10
180912_LG_Evgeny81_18	MLP1	MLP1	NUP	150	3	0.549973777702584	95
180912_LG_Evgeny81_18	MLP1	MLP2	NUP	150	3	0.478668699941684	56
180912_LG_Evgeny81_18	MLP1	NDC1	NUP	150	3	0.513386939424083	5
180912_LG_Evgeny81_18	MLP1	NIC96	NUP	150	3	0.339309028670002	14
180912_LG_Evgeny81_18	MLP1	NSP1	NUP	150	3	0.236212026749478	40
180912_LG_Evgeny81_18	MLP1	NUP1	NUP	150	3	0.492124667238595	20
180912_LG_Evgeny81_18	MLP1	NUP100	NUP	150	3	0.373573026030349	13
180912_LG_Evgeny81_18	MLP1	NUP116	NUP	150	3	0.43861836592571	17
180912_LG_Evgeny81_18	MLP1	NUP120	NUP	150	3	0.361333976901955	15
180912_LG_Evgeny81_18	MLP1	NUP133	NUP	150	3	0.296693559074816	31
180912_LG_Evgeny81_18	MLP1	NUP145C	NUP	150	3	0.377746854078671	20
180912_LG_Evgeny81_18	MLP1	NUP145N	NUP	150	3	0.418914771630387	15
180912_LG_Evgeny81_18	MLP1	NUP157	NUP	150	3	0.307623605066274	22
180912_LG_Evgeny81_18	MLP1	NUP159	NUP	150	3	0.309584552162947	36
180912_LG_Evgeny81_18	MLP1	NUP170	NUP	150	3	0.325345241134337	33
180912_LG_Evgeny81_18	MLP1	NUP188	NUP	150	3	0.253471246119424	29
180912_LG_Evgeny81_18	MLP1	NUP192	NUP	150	3	0.277535458528207	24
180912_LG_Evgeny81_18	MLP1	NUP2	NUP	150	3	0.516195104381708	29
180912_LG_Evgeny81_18	MLP1	NUP49	NUP	150	3	0.323866911927854	5
180912_LG_Evgeny81_18	MLP1	NUP53	NUP	150	3	0.355767116590699	10
180912_LG_Evgeny81_18	MLP1	NUP57	NUP	150	3	0.309013692766054	13
180912_LG_Evgeny81_18	MLP1	NUP59	NUP	150	3	0.367704886308485	8
180912_LG_Evgeny81_18	MLP1	NUP60	NUP	150	3	0.518005483775826	17
180912_LG_Evgeny81_18	MLP1	NUP82	NUP	150	3	0.324272807324327	13
180912_LG_Evgeny81_18	MLP1	NUP84	NUP	150	3	0.355644280897583	13
180912_LG_Evgeny81_18	MLP1	NUP85	NUP	150	3	0.372956817675181	14
180912_LG_Evgeny81_18	MLP1	PAB1	NTR-like	150	3	0.511445790797792	11
180912_LG_Evgeny81_18	MLP1	POM152	NUP	150	3	0.302334933702197	25
180912_LG_Evgeny81_18	MLP1	POM34	NUP	150	3	0.332922760887318	8
180912_LG_Evgeny81_18	MLP1	PSE1	NTR	150	3	0.510845360126805	4
180912_LG_Evgeny81_18	MLP1	PUF6	NTR-like	150	3	0.5173982345009	6
180912_LG_Evgeny81_18	MLP1	RPP0	NTR-like	150	3	0.522275868398085	5
180912_LG_Evgeny81_18	MLP1	RPS2	NTR-like	150	3	0.519938293420734	5
180912_LG_Evgeny81_18	MLP1	RPS3	NTR-like	150	3	0.524507794480816	5
180912_LG_Evgeny81_18	MLP1	SAC3	NTR-like	150	3	0.530955195655628	26
180912_LG_Evgeny81_18	MLP1	SEC13	NUP	150	3	0.398939946345077	7
180912_LG_Evgeny81_18	MLP1	SEH1	NUP	150	3	0.288439123861026	5
180912_LG_Evgeny81_18	MLP1	SPT5	NTR-like	150	3	0.534042675382968	10
180912_LG_Evgeny81_18	MLP1	SRM1	NTR-like	150	3	0.524381794255925	6
180912_LG_Evgeny81_18	MLP1	SRP1	NTR	150	3	0.516000418538897	7
180912_LG_Evgeny81_18	MLP1	SSE1	NTR-like	150	3	0.526428356278739	13
180912_LG_Evgeny81_18	MLP1	SUP35	NTR-like	150	3	0.50650781404952	7
180912_LG_Evgeny81_18	MLP1	TCB3	NTR-like	150	3	0.513776522612434	9
180912_LG_Evgeny81_18	MLP1	UTP22	NTR-like	150	3	0.517500116855728	23
180912_LG_Evgeny81_18	MLP1	UTP25	NTR-like	150	3	0.52036624477515	5
180912_LG_Evgeny81_18	MLP1	YEF3	NTR-like	150	3	0.526462649333762	14
180912_LG_Evgeny81_2	MLP1	CRM1	NTR	30	1	0.052803538590054	3
180912_LG_Evgeny81_2	MLP1	DBP9	NTR-like	30	1	0.10320168576635	6
180912_LG_Evgeny81_2	MLP1	ENP1	NTR-like	30	1	0.11106004431478	5
180912_LG_Evgeny81_2	MLP1	FBA1	NTR-like	30	1	0.093780841780263	3
180912_LG_Evgeny81_2	MLP1	GLE1	NUP	30	1	0.073123762405283	4
180912_LG_Evgeny81_2	MLP1	GLE2	NUP	30	1	0.031877591941266	6
180912_LG_Evgeny81_2	MLP1	KAP123	NTR	30	1	0.093099156677646	13
180912_LG_Evgeny81_2	MLP1	KAP95	NTR	30	1	0.103375739768694	12
180912_LG_Evgeny81_2	MLP1	KRE33	NTR-like	30	1	0.106221111495293	23
180912_LG_Evgeny81_2	MLP1	MAK21	NTR-like	30	1	0.094701021493449	16
180912_LG_Evgeny81_2	MLP1	MEX67	NTR	30	1	0.099652524327213	10
180912_LG_Evgeny81_2	MLP1	MLP1	NUP	30	1	0.100112310914525	95
180912_LG_Evgeny81_2	MLP1	MLP2	NUP	30	1	0.050277270773034	56
180912_LG_Evgeny81_2	MLP1	NDC1	NUP	30	1	0.082704804563745	5
180912_LG_Evgeny81_2	MLP1	NIC96	NUP	30	1	0.027436058898106	14
180912_LG_Evgeny81_2	MLP1	NSP1	NUP	30	1	0.005820270117699	39
180912_LG_Evgeny81_2	MLP1	NUP1	NUP	30	1	0.054231785310158	20
180912_LG_Evgeny81_2	MLP1	NUP100	NUP	30	1	0.043342567695824	13
180912_LG_Evgeny81_2	MLP1	NUP116	NUP	30	1	0.067194034284664	17
180912_LG_Evgeny81_2	MLP1	NUP120	NUP	30	1	0.03131099304252	15
180912_LG_Evgeny81_2	MLP1	NUP133	NUP	30	1	0.016577735548634	31
180912_LG_Evgeny81_2	MLP1	NUP145C	NUP	30	1	0.036987588989009	20
180912_LG_Evgeny81_2	MLP1	NUP145N	NUP	30	1	0.05869822666768	15
180912_LG_Evgeny81_2	MLP1	NUP157	NUP	30	1	0.021902383076352	22
180912_LG_Evgeny81_2	MLP1	NUP159	NUP	30	1	0.02279598280494	36
180912_LG_Evgeny81_2	MLP1	NUP170	NUP	30	1	0.02959805411007	33
180912_LG_Evgeny81_2	MLP1	NUP188	NUP	30	1	0.010821800354495	29
180912_LG_Evgeny81_2	MLP1	NUP192	NUP	30	1	0.013046437039419	24
180912_LG_Evgeny81_2	MLP1	NUP2	NUP	30	1	0.091420409266023	29
180912_LG_Evgeny81_2	MLP1	NUP49	NUP	30	1	0.016394274038104	6
180912_LG_Evgeny81_2	MLP1	NUP53	NUP	30	1	0.040948447919084	10
180912_LG_Evgeny81_2	MLP1	NUP57	NUP	30	1	0.012005698597873	13
180912_LG_Evgeny81_2	MLP1	NUP59	NUP	30	1	0.034680436169679	8
180912_LG_Evgeny81_2	MLP1	NUP60	NUP	30	1	0.071768246049701	17
180912_LG_Evgeny81_2	MLP1	NUP82	NUP	30	1	0.030185612700772	13
180912_LG_Evgeny81_2	MLP1	NUP84	NUP	30	1	0.023592096040922	13
180912_LG_Evgeny81_2	MLP1	NUP85	NUP	30	1	0.033219517092132	14
180912_LG_Evgeny81_2	MLP1	PAB1	NTR-like	30	1	0.092232145464531	11
180912_LG_Evgeny81_2	MLP1	POM152	NUP	30	1	0.018607098203306	25
180912_LG_Evgeny81_2	MLP1	POM34	NUP	30	1	0.023861261761308	8
180912_LG_Evgeny81_2	MLP1	PSE1	NTR	30	1	0.079332890254516	4
180912_LG_Evgeny81_2	MLP1	PUF6	NTR-like	30	1	0.111420130689163	6
180912_LG_Evgeny81_2	MLP1	RPP0	NTR-like	30	1	0.093817737199292	5
180912_LG_Evgeny81_2	MLP1	RPS2	NTR-like	30	1	0.09156580811099	5
180912_LG_Evgeny81_2	MLP1	RPS3	NTR-like	30	1	0.09789965714587	5
180912_LG_Evgeny81_2	MLP1	SAC3	NTR-like	30	1	0.086442600387477	26
180912_LG_Evgeny81_2	MLP1	SEC13	NUP	30	1	0.047165160070297	7
180912_LG_Evgeny81_2	MLP1	SEH1	NUP	30	1	0.010077689272724	5
180912_LG_Evgeny81_2	MLP1	SPT5	NTR-like	30	1	0.094524099232697	10
180912_LG_Evgeny81_2	MLP1	SRM1	NTR-like	30	1	0.095878817424642	6
180912_LG_Evgeny81_2	MLP1	SRP1	NTR	30	1	0.09824453788303	7
180912_LG_Evgeny81_2	MLP1	SSE1	NTR-like	30	1	0.107550730529129	13
180912_LG_Evgeny81_2	MLP1	SUP35	NTR-like	30	1	0.09583387338912	7
180912_LG_Evgeny81_2	MLP1	TCB3	NTR-like	30	1	0.086755306906255	7
180912_LG_Evgeny81_2	MLP1	UTP22	NTR-like	30	1	0.093423383130792	23
180912_LG_Evgeny81_2	MLP1	UTP25	NTR-like	30	1	0.101913800700832	5
180912_LG_Evgeny81_2	MLP1	YEF3	NTR-like	30	1	0.095626211529411	15
180912_LG_Evgeny81_3b	MLP1	CRM1	NTR	60	1	0.141853955854765	3
180912_LG_Evgeny81_3b	MLP1	DBP9	NTR-like	60	1	0.208787604827032	6
180912_LG_Evgeny81_3b	MLP1	ENP1	NTR-like	60	1	0.214062149755018	5
180912_LG_Evgeny81_3b	MLP1	FBA1	NTR-like	60	1	0.210223004094942	3
180912_LG_Evgeny81_3b	MLP1	GLE1	NUP	60	1	0.18153200979435	4
180912_LG_Evgeny81_3b	MLP1	GLE2	NUP	60	1	0.106842858549389	6
180912_LG_Evgeny81_3b	MLP1	KAP123	NTR	60	1	0.207565771143294	13
180912_LG_Evgeny81_3b	MLP1	KAP95	NTR	60	1	0.213371780211182	13
180912_LG_Evgeny81_3b	MLP1	KRE33	NTR-like	60	1	0.215939224540158	22
180912_LG_Evgeny81_3b	MLP1	MAK21	NTR-like	60	1	0.205044219551317	15
180912_LG_Evgeny81_3b	MLP1	MEX67	NTR	60	1	0.208527399852643	10
180912_LG_Evgeny81_3b	MLP1	MLP1	NUP	60	1	0.225012385413959	94
180912_LG_Evgeny81_3b	MLP1	MLP2	NUP	60	1	0.148501795137928	56
180912_LG_Evgeny81_3b	MLP1	NDC1	NUP	60	1	0.192447239490905	5
180912_LG_Evgeny81_3b	MLP1	NIC96	NUP	60	1	0.074119357762999	14
180912_LG_Evgeny81_3b	MLP1	NSP1	NUP	60	1	0.029326524140669	40
180912_LG_Evgeny81_3b	MLP1	NUP1	NUP	60	1	0.147717685169139	20
180912_LG_Evgeny81_3b	MLP1	NUP100	NUP	60	1	0.106533203971921	13
180912_LG_Evgeny81_3b	MLP1	NUP116	NUP	60	1	0.150029548651361	17
180912_LG_Evgeny81_3b	MLP1	NUP120	NUP	60	1	0.090003723158987	15
180912_LG_Evgeny81_3b	MLP1	NUP133	NUP	60	1	0.053826973706389	31
180912_LG_Evgeny81_3b	MLP1	NUP145C	NUP	60	1	0.099761586519764	20
180912_LG_Evgeny81_3b	MLP1	NUP145N	NUP	60	1	0.136480442957573	15
180912_LG_Evgeny81_3b	MLP1	NUP157	NUP	60	1	0.064068391359107	22
180912_LG_Evgeny81_3b	MLP1	NUP159	NUP	60	1	0.069918333618019	36
180912_LG_Evgeny81_3b	MLP1	NUP170	NUP	60	1	0.075627673284444	33
180912_LG_Evgeny81_3b	MLP1	NUP188	NUP	60	1	0.039282012841005	29
180912_LG_Evgeny81_3b	MLP1	NUP192	NUP	60	1	0.048451999671613	24
180912_LG_Evgeny81_3b	MLP1	NUP2	NUP	60	1	0.203213834759378	29
180912_LG_Evgeny81_3b	MLP1	NUP49	NUP	60	1	0.062603590294493	5
180912_LG_Evgeny81_3b	MLP1	NUP53	NUP	60	1	0.101145951426562	10
180912_LG_Evgeny81_3b	MLP1	NUP57	NUP	60	1	0.050672216994543	13
180912_LG_Evgeny81_3b	MLP1	NUP59	NUP	60	1	0.094201827928459	8
180912_LG_Evgeny81_3b	MLP1	NUP60	NUP	60	1	0.182711060540959	17
180912_LG_Evgeny81_3b	MLP1	NUP82	NUP	60	1	0.085776943262409	13
180912_LG_Evgeny81_3b	MLP1	NUP84	NUP	60	1	0.07798506723161	13
180912_LG_Evgeny81_3b	MLP1	NUP85	NUP	60	1	0.095386456294307	14
180912_LG_Evgeny81_3b	MLP1	PAB1	NTR-like	60	1	0.20206775798117	10
180912_LG_Evgeny81_3b	MLP1	POM152	NUP	60	1	0.059313426280381	24
180912_LG_Evgeny81_3b	MLP1	POM34	NUP	60	1	0.079580192633324	7
180912_LG_Evgeny81_3b	MLP1	PSE1	NTR	60	1	0.202130884861565	4
180912_LG_Evgeny81_3b	MLP1	PUF6	NTR-like	60	1	0.215801510067592	6
180912_LG_Evgeny81_3b	MLP1	RPP0	NTR-like	60	1	0.203104222424189	5
180912_LG_Evgeny81_3b	MLP1	RPS2	NTR-like	60	1	0.199450861776469	5
180912_LG_Evgeny81_3b	MLP1	RPS3	NTR-like	60	1	0.204358526300813	5
180912_LG_Evgeny81_3b	MLP1	SAC3	NTR-like	60	1	0.198005508150006	26
180912_LG_Evgeny81_3b	MLP1	SEC13	NUP	60	1	0.114075365799714	7
180912_LG_Evgeny81_3b	MLP1	SEH1	NUP	60	1	0.046448861532971	5
180912_LG_Evgeny81_3b	MLP1	SPT5	NTR-like	60	1	0.215348171954502	10
180912_LG_Evgeny81_3b	MLP1	SRM1	NTR-like	60	1	0.201931474249469	6
180912_LG_Evgeny81_3b	MLP1	SRP1	NTR	60	1	0.209967224794414	7
180912_LG_Evgeny81_3b	MLP1	SSE1	NTR-like	60	1	0.222558746170198	12
180912_LG_Evgeny81_3b	MLP1	SUP35	NTR-like	60	1	0.205917760887796	7
180912_LG_Evgeny81_3b	MLP1	TCB3	NTR-like	60	1	0.182774827178897	9
180912_LG_Evgeny81_3b	MLP1	UTP22	NTR-like	60	1	0.200673322705551	23
180912_LG_Evgeny81_3b	MLP1	UTP25	NTR-like	60	1	0.212087108187335	5
180912_LG_Evgeny81_3b	MLP1	YEF3	NTR-like	60	1	0.204693095430649	14
180912_LG_Evgeny81_4	MLP1	CRM1	NTR	90	1	0.282467190874706	3
180912_LG_Evgeny81_4	MLP1	DBP9	NTR-like	90	1	0.332859178894149	6
180912_LG_Evgeny81_4	MLP1	ENP1	NTR-like	90	1	0.348434492000515	5
180912_LG_Evgeny81_4	MLP1	FBA1	NTR-like	90	1	0.311292475347252	3
180912_LG_Evgeny81_4	MLP1	GLE1	NUP	90	1	0.275371292845642	4
180912_LG_Evgeny81_4	MLP1	GLE2	NUP	90	1	0.1931060829289	6
180912_LG_Evgeny81_4	MLP1	KAP123	NTR	90	1	0.325409466173999	13
180912_LG_Evgeny81_4	MLP1	KAP95	NTR	90	1	0.318028534553448	13
180912_LG_Evgeny81_4	MLP1	KRE33	NTR-like	90	1	0.347534533349656	23
180912_LG_Evgeny81_4	MLP1	MAK21	NTR-like	90	1	0.330674164140221	16
180912_LG_Evgeny81_4	MLP1	MEX67	NTR	90	1	0.314073268507227	10
180912_LG_Evgeny81_4	MLP1	MLP1	NUP	90	1	0.33758162415248	95
180912_LG_Evgeny81_4	MLP1	MLP2	NUP	90	1	0.262627680935926	55
180912_LG_Evgeny81_4	MLP1	NDC1	NUP	90	1	0.30383729473701	5
180912_LG_Evgeny81_4	MLP1	NIC96	NUP	90	1	0.171876955534166	14
180912_LG_Evgeny81_4	MLP1	NSP1	NUP	90	1	0.089336683310274	39
180912_LG_Evgeny81_4	MLP1	NUP1	NUP	90	1	0.266164134693366	20
180912_LG_Evgeny81_4	MLP1	NUP100	NUP	90	1	0.199114646098077	13
180912_LG_Evgeny81_4	MLP1	NUP116	NUP	90	1	0.254594368248613	17
180912_LG_Evgeny81_4	MLP1	NUP120	NUP	90	1	0.174182621457543	15
180912_LG_Evgeny81_4	MLP1	NUP133	NUP	90	1	0.121638015379198	31
180912_LG_Evgeny81_4	MLP1	NUP145C	NUP	90	1	0.190561296711415	20
180912_LG_Evgeny81_4	MLP1	NUP145N	NUP	90	1	0.222154088748602	14
180912_LG_Evgeny81_4	MLP1	NUP157	NUP	90	1	0.154026433274933	22
180912_LG_Evgeny81_4	MLP1	NUP159	NUP	90	1	0.139688213783015	36
180912_LG_Evgeny81_4	MLP1	NUP170	NUP	90	1	0.168060681260748	33
180912_LG_Evgeny81_4	MLP1	NUP188	NUP	90	1	0.10610717415369	29
180912_LG_Evgeny81_4	MLP1	NUP192	NUP	90	1	0.124949428353169	24
180912_LG_Evgeny81_4	MLP1	NUP2	NUP	90	1	0.315857672614814	29
180912_LG_Evgeny81_4	MLP1	NUP49	NUP	90	1	0.15486754093857	6
180912_LG_Evgeny81_4	MLP1	NUP53	NUP	90	1	0.195401965991856	10
180912_LG_Evgeny81_4	MLP1	NUP57	NUP	90	1	0.138607217290635	13
180912_LG_Evgeny81_4	MLP1	NUP59	NUP	90	1	0.192876221671627	7
180912_LG_Evgeny81_4	MLP1	NUP60	NUP	90	1	0.299719895991232	17
180912_LG_Evgeny81_4	MLP1	NUP82	NUP	90	1	0.151493521582497	13
180912_LG_Evgeny81_4	MLP1	NUP84	NUP	90	1	0.163351144239646	12
180912_LG_Evgeny81_4	MLP1	NUP85	NUP	90	1	0.178422432481967	14
180912_LG_Evgeny81_4	MLP1	PAB1	NTR-like	90	1	0.312877797181228	11
180912_LG_Evgeny81_4	MLP1	POM152	NUP	90	1	0.145713631100027	25
180912_LG_Evgeny81_4	MLP1	POM34	NUP	90	1	0.17068163760384	8
180912_LG_Evgeny81_4	MLP1	PSE1	NTR	90	1	0.298250455187662	4
180912_LG_Evgeny81_4	MLP1	PUF6	NTR-like	90	1	0.347777224439876	6
180912_LG_Evgeny81_4	MLP1	RPP0	NTR-like	90	1	0.317125868327246	5
180912_LG_Evgeny81_4	MLP1	RPS2	NTR-like	90	1	0.319555278442136	5
180912_LG_Evgeny81_4	MLP1	RPS3	NTR-like	90	1	0.32559670184664	5
180912_LG_Evgeny81_4	MLP1	SAC3	NTR-like	90	1	0.314867256502212	26
180912_LG_Evgeny81_4	MLP1	SEC13	NUP	90	1	0.218767465439382	7
180912_LG_Evgeny81_4	MLP1	SEH1	NUP	90	1	0.116120858935059	5
180912_LG_Evgeny81_4	MLP1	SPT5	NTR-like	90	1	0.322334541971952	10
180912_LG_Evgeny81_4	MLP1	SRM1	NTR-like	90	1	0.317143860650188	6
180912_LG_Evgeny81_4	MLP1	SRP1	NTR	90	1	0.321884772131011	7
180912_LG_Evgeny81_4	MLP1	SSE1	NTR-like	90	1	0.339201547397806	13
180912_LG_Evgeny81_4	MLP1	SUP35	NTR-like	90	1	0.317297358386528	7
180912_LG_Evgeny81_4	MLP1	TCB3	NTR-like	90	1	0.310660045954505	9
180912_LG_Evgeny81_4	MLP1	UTP22	NTR-like	90	1	0.321523149836246	23
180912_LG_Evgeny81_4	MLP1	UTP25	NTR-like	90	1	0.342451472240491	5
180912_LG_Evgeny81_4	MLP1	YEF3	NTR-like	90	1	0.329102475645327	15
180912_LG_Evgeny81_5	MLP1	CRM1	NTR	120	1	0.403989905884502	3
180912_LG_Evgeny81_5	MLP1	DBP9	NTR-like	120	1	0.435134818905127	6
180912_LG_Evgeny81_5	MLP1	ENP1	NTR-like	120	1	0.455084296297466	5
180912_LG_Evgeny81_5	MLP1	FBA1	NTR-like	120	1	0.41134568603059	3
180912_LG_Evgeny81_5	MLP1	GLE1	NUP	120	1	0.385504458117685	4
180912_LG_Evgeny81_5	MLP1	GLE2	NUP	120	1	0.289418073209574	6
180912_LG_Evgeny81_5	MLP1	KAP123	NTR	120	1	0.430103684125028	13
180912_LG_Evgeny81_5	MLP1	KAP95	NTR	120	1	0.424942089159935	13
180912_LG_Evgeny81_5	MLP1	KRE33	NTR-like	120	1	0.444786735023915	23
180912_LG_Evgeny81_5	MLP1	MAK21	NTR-like	120	1	0.432422491479662	16
180912_LG_Evgeny81_5	MLP1	MEX67	NTR	120	1	0.419665905485872	10
180912_LG_Evgeny81_5	MLP1	MLP1	NUP	120	1	0.446705817927821	95
180912_LG_Evgeny81_5	MLP1	MLP2	NUP	120	1	0.372129769242359	56
180912_LG_Evgeny81_5	MLP1	NDC1	NUP	120	1	0.418976106547686	5
180912_LG_Evgeny81_5	MLP1	NIC96	NUP	120	1	0.246077827554641	14
180912_LG_Evgeny81_5	MLP1	NSP1	NUP	120	1	0.152180147475527	40
180912_LG_Evgeny81_5	MLP1	NUP1	NUP	120	1	0.374297414957938	20
180912_LG_Evgeny81_5	MLP1	NUP100	NUP	120	1	0.282104060191561	13
180912_LG_Evgeny81_5	MLP1	NUP116	NUP	120	1	0.343386527296876	17
180912_LG_Evgeny81_5	MLP1	NUP120	NUP	120	1	0.262576822917243	15
180912_LG_Evgeny81_5	MLP1	NUP133	NUP	120	1	0.200594123589383	31
180912_LG_Evgeny81_5	MLP1	NUP145C	NUP	120	1	0.278613249995625	20
180912_LG_Evgeny81_5	MLP1	NUP145N	NUP	120	1	0.3175031587583	15
180912_LG_Evgeny81_5	MLP1	NUP157	NUP	120	1	0.2235824015007	21
180912_LG_Evgeny81_5	MLP1	NUP159	NUP	120	1	0.217403108989999	35
180912_LG_Evgeny81_5	MLP1	NUP170	NUP	120	1	0.233305598146894	33
180912_LG_Evgeny81_5	MLP1	NUP188	NUP	120	1	0.169198950847898	28
180912_LG_Evgeny81_5	MLP1	NUP192	NUP	120	1	0.189395490288763	24
180912_LG_Evgeny81_5	MLP1	NUP2	NUP	120	1	0.4206379137472	28
180912_LG_Evgeny81_5	MLP1	NUP49	NUP	120	1	0.228875726736157	6
180912_LG_Evgeny81_5	MLP1	NUP53	NUP	120	1	0.268367012356875	10
180912_LG_Evgeny81_5	MLP1	NUP57	NUP	120	1	0.211438479024748	13
180912_LG_Evgeny81_5	MLP1	NUP59	NUP	120	1	0.264066234202434	8
180912_LG_Evgeny81_5	MLP1	NUP60	NUP	120	1	0.41067216090718	17
180912_LG_Evgeny81_5	MLP1	NUP82	NUP	120	1	0.23543758825431	13
180912_LG_Evgeny81_5	MLP1	NUP84	NUP	120	1	0.249945723033121	13
180912_LG_Evgeny81_5	MLP1	NUP85	NUP	120	1	0.267176410470286	14
180912_LG_Evgeny81_5	MLP1	PAB1	NTR-like	120	1	0.417630826915015	11
180912_LG_Evgeny81_5	MLP1	POM152	NUP	120	1	0.215522273155867	25
180912_LG_Evgeny81_5	MLP1	POM34	NUP	120	1	0.247335243698298	8
180912_LG_Evgeny81_5	MLP1	PSE1	NTR	120	1	0.415877308093744	4
180912_LG_Evgeny81_5	MLP1	PUF6	NTR-like	120	1	0.442811166715843	6
180912_LG_Evgeny81_5	MLP1	RPP0	NTR-like	120	1	0.426358541720234	5
180912_LG_Evgeny81_5	MLP1	RPS2	NTR-like	120	1	0.427426349404827	5
180912_LG_Evgeny81_5	MLP1	RPS3	NTR-like	120	1	0.432392570935904	5
180912_LG_Evgeny81_5	MLP1	SAC3	NTR-like	120	1	0.423585861415568	26
180912_LG_Evgeny81_5	MLP1	SEC13	NUP	120	1	0.309284016980106	7
180912_LG_Evgeny81_5	MLP1	SEH1	NUP	120	1	0.198682831639007	5
180912_LG_Evgeny81_5	MLP1	SPT5	NTR-like	120	1	0.437403010691479	10
180912_LG_Evgeny81_5	MLP1	SRM1	NTR-like	120	1	0.423140115213715	6
180912_LG_Evgeny81_5	MLP1	SRP1	NTR	120	1	0.421563825830078	7
180912_LG_Evgeny81_5	MLP1	SSE1	NTR-like	120	1	0.437545410285616	13
180912_LG_Evgeny81_5	MLP1	SUP35	NTR-like	120	1	0.422913196453856	7
180912_LG_Evgeny81_5	MLP1	TCB3	NTR-like	120	1	0.415126934743621	9
180912_LG_Evgeny81_5	MLP1	UTP22	NTR-like	120	1	0.428990752056236	23
180912_LG_Evgeny81_5	MLP1	UTP25	NTR-like	120	1	0.433250493068949	5
180912_LG_Evgeny81_5	MLP1	YEF3	NTR-like	120	1	0.434634335201003	14
180912_LG_Evgeny81_6	MLP1	CRM1	NTR	150	1	0.448871082677019	3
180912_LG_Evgeny81_6	MLP1	DBP9	NTR-like	150	1	0.502415765977659	6
180912_LG_Evgeny81_6	MLP1	ENP1	NTR-like	150	1	0.509304442149519	5
180912_LG_Evgeny81_6	MLP1	FBA1	NTR-like	150	1	0.52339690924393	3
180912_LG_Evgeny81_6	MLP1	GLE1	NUP	150	1	0.491643523987606	4
180912_LG_Evgeny81_6	MLP1	GLE2	NUP	150	1	0.383098526554276	6
180912_LG_Evgeny81_6	MLP1	KAP123	NTR	150	1	0.506330442921777	13
180912_LG_Evgeny81_6	MLP1	KAP95	NTR	150	1	0.509548258650443	13
180912_LG_Evgeny81_6	MLP1	KRE33	NTR-like	150	1	0.516696093570536	23
180912_LG_Evgeny81_6	MLP1	MAK21	NTR-like	150	1	0.504916671575338	16
180912_LG_Evgeny81_6	MLP1	MEX67	NTR	150	1	0.50901355938479	10
180912_LG_Evgeny81_6	MLP1	MLP1	NUP	150	1	0.542631459327495	94
180912_LG_Evgeny81_6	MLP1	MLP2	NUP	150	1	0.475483663527484	56
180912_LG_Evgeny81_6	MLP1	NDC1	NUP	150	1	0.500604005709658	5
180912_LG_Evgeny81_6	MLP1	NIC96	NUP	150	1	0.327713535942507	14
180912_LG_Evgeny81_6	MLP1	NSP1	NUP	150	1	0.232496720452254	39
180912_LG_Evgeny81_6	MLP1	NUP1	NUP	150	1	0.47536788746765	20
180912_LG_Evgeny81_6	MLP1	NUP100	NUP	150	1	0.365765497444342	13
180912_LG_Evgeny81_6	MLP1	NUP116	NUP	150	1	0.432744569238641	17
180912_LG_Evgeny81_6	MLP1	NUP120	NUP	150	1	0.354180883108836	15
180912_LG_Evgeny81_6	MLP1	NUP133	NUP	150	1	0.289194247786262	31
180912_LG_Evgeny81_6	MLP1	NUP145C	NUP	150	1	0.367499370776539	19
180912_LG_Evgeny81_6	MLP1	NUP145N	NUP	150	1	0.407740581697801	15
180912_LG_Evgeny81_6	MLP1	NUP157	NUP	150	1	0.308767204874318	22
180912_LG_Evgeny81_6	MLP1	NUP159	NUP	150	1	0.301004879211737	35
180912_LG_Evgeny81_6	MLP1	NUP170	NUP	150	1	0.316248412316059	33
180912_LG_Evgeny81_6	MLP1	NUP188	NUP	150	1	0.245817872068844	29
180912_LG_Evgeny81_6	MLP1	NUP192	NUP	150	1	0.26941896801291	24
180912_LG_Evgeny81_6	MLP1	NUP2	NUP	150	1	0.513616342783504	29
180912_LG_Evgeny81_6	MLP1	NUP49	NUP	150	1	0.314318611789326	6
180912_LG_Evgeny81_6	MLP1	NUP53	NUP	150	1	0.352532334553674	10
180912_LG_Evgeny81_6	MLP1	NUP57	NUP	150	1	0.298169794195901	13
180912_LG_Evgeny81_6	MLP1	NUP59	NUP	150	1	0.356027130197087	8
180912_LG_Evgeny81_6	MLP1	NUP60	NUP	150	1	0.507211655700464	17
180912_LG_Evgeny81_6	MLP1	NUP82	NUP	150	1	0.31941415850949	13
180912_LG_Evgeny81_6	MLP1	NUP84	NUP	150	1	0.34420959243336	13
180912_LG_Evgeny81_6	MLP1	NUP85	NUP	150	1	0.356874075323664	13
180912_LG_Evgeny81_6	MLP1	PAB1	NTR-like	150	1	0.508572724069687	11
180912_LG_Evgeny81_6	MLP1	POM152	NUP	150	1	0.297215610583515	25
180912_LG_Evgeny81_6	MLP1	POM34	NUP	150	1	0.324562998399959	8
180912_LG_Evgeny81_6	MLP1	PSE1	NTR	150	1	0.499710611799044	4
180912_LG_Evgeny81_6	MLP1	PUF6	NTR-like	150	1	0.509136579875511	6
180912_LG_Evgeny81_6	MLP1	RPP0	NTR-like	150	1	0.520407982978663	5
180912_LG_Evgeny81_6	MLP1	RPS2	NTR-like	150	1	0.517448790095318	5
180912_LG_Evgeny81_6	MLP1	RPS3	NTR-like	150	1	0.520399127303217	5
180912_LG_Evgeny81_6	MLP1	SAC3	NTR-like	150	1	0.525526765299325	26
180912_LG_Evgeny81_6	MLP1	SEC13	NUP	150	1	0.389974058722445	7
180912_LG_Evgeny81_6	MLP1	SEH1	NUP	150	1	0.279933200295798	5
180912_LG_Evgeny81_6	MLP1	SPT5	NTR-like	150	1	0.533207127322076	10
180912_LG_Evgeny81_6	MLP1	SRM1	NTR-like	150	1	0.506744012492028	6
180912_LG_Evgeny81_6	MLP1	SRP1	NTR	150	1	0.509243111724168	7
180912_LG_Evgeny81_6	MLP1	SSE1	NTR-like	150	1	0.517757700060706	13
180912_LG_Evgeny81_6	MLP1	SUP35	NTR-like	150	1	0.508434085578659	7
180912_LG_Evgeny81_6	MLP1	TCB3	NTR-like	150	1	0.498734225058042	9
180912_LG_Evgeny81_6	MLP1	UTP22	NTR-like	150	1	0.514799360912491	23
180912_LG_Evgeny81_6	MLP1	UTP25	NTR-like	150	1	0.517843494016644	5
180912_LG_Evgeny81_6	MLP1	YEF3	NTR-like	150	1	0.516538258454885	15
180912_LG_Evgeny81_8	MLP1	CRM1	NTR	30	2	0.063401210112473	3
180912_LG_Evgeny81_8	MLP1	DBP9	NTR-like	30	2	0.115253942922708	6
180912_LG_Evgeny81_8	MLP1	ENP1	NTR-like	30	2	0.11964701022458	5
180912_LG_Evgeny81_8	MLP1	FBA1	NTR-like	30	2	0.096002565789919	3
180912_LG_Evgeny81_8	MLP1	GLE1	NUP	30	2	0.078560762467496	4
180912_LG_Evgeny81_8	MLP1	GLE2	NUP	30	2	0.033544073350915	6
180912_LG_Evgeny81_8	MLP1	KAP123	NTR	30	2	0.110616340809551	13
180912_LG_Evgeny81_8	MLP1	KAP95	NTR	30	2	0.105584497614618	13
180912_LG_Evgeny81_8	MLP1	KRE33	NTR-like	30	2	0.117911235149143	23
180912_LG_Evgeny81_8	MLP1	MAK21	NTR-like	30	2	0.10664322016185	16
180912_LG_Evgeny81_8	MLP1	MEX67	NTR	30	2	0.100972913469631	10
180912_LG_Evgeny81_8	MLP1	MLP1	NUP	30	2	0.096944098469978	94
180912_LG_Evgeny81_8	MLP1	MLP2	NUP	30	2	0.049460898668754	56
180912_LG_Evgeny81_8	MLP1	NDC1	NUP	30	2	0.083982506309504	5
180912_LG_Evgeny81_8	MLP1	NIC96	NUP	30	2	0.02506788155487	14
180912_LG_Evgeny81_8	MLP1	NSP1	NUP	30	2	0.007074458419699	40
180912_LG_Evgeny81_8	MLP1	NUP1	NUP	30	2	0.053928677552987	20
180912_LG_Evgeny81_8	MLP1	NUP100	NUP	30	2	0.044799661755946	13
180912_LG_Evgeny81_8	MLP1	NUP116	NUP	30	2	0.06784694827198	17
180912_LG_Evgeny81_8	MLP1	NUP120	NUP	30	2	0.033270740138211	15
180912_LG_Evgeny81_8	MLP1	NUP133	NUP	30	2	0.017249126850544	31
180912_LG_Evgeny81_8	MLP1	NUP145C	NUP	30	2	0.039343197897813	20
180912_LG_Evgeny81_8	MLP1	NUP145N	NUP	30	2	0.060371898552185	15
180912_LG_Evgeny81_8	MLP1	NUP157	NUP	30	2	0.023266398831014	22
180912_LG_Evgeny81_8	MLP1	NUP159	NUP	30	2	0.025564808644811	36
180912_LG_Evgeny81_8	MLP1	NUP170	NUP	30	2	0.031143027641601	33
180912_LG_Evgeny81_8	MLP1	NUP188	NUP	30	2	0.010528684080675	29
180912_LG_Evgeny81_8	MLP1	NUP192	NUP	30	2	0.01393042355906	24
180912_LG_Evgeny81_8	MLP1	NUP2	NUP	30	2	0.091805037893209	29
180912_LG_Evgeny81_8	MLP1	NUP49	NUP	30	2	0.017430398795921	6
180912_LG_Evgeny81_8	MLP1	NUP53	NUP	30	2	0.038879363297624	10
180912_LG_Evgeny81_8	MLP1	NUP57	NUP	30	2	0.012555658842023	12
180912_LG_Evgeny81_8	MLP1	NUP59	NUP	30	2	0.031875831584865	8
180912_LG_Evgeny81_8	MLP1	NUP60	NUP	30	2	0.075317183935701	17
180912_LG_Evgeny81_8	MLP1	NUP82	NUP	30	2	0.033881147194427	13
180912_LG_Evgeny81_8	MLP1	NUP84	NUP	30	2	0.026929906455856	13
180912_LG_Evgeny81_8	MLP1	NUP85	NUP	30	2	0.032280505132955	14
180912_LG_Evgeny81_8	MLP1	PAB1	NTR-like	30	2	0.101312859036588	11
180912_LG_Evgeny81_8	MLP1	POM152	NUP	30	2	0.019822213043308	25
180912_LG_Evgeny81_8	MLP1	POM34	NUP	30	2	0.025668386135874	8
180912_LG_Evgeny81_8	MLP1	PSE1	NTR	30	2	0.091627168627275	4
180912_LG_Evgeny81_8	MLP1	PUF6	NTR-like	30	2	0.126224883228168	6
180912_LG_Evgeny81_8	MLP1	RPP0	NTR-like	30	2	0.108397173602637	5
180912_LG_Evgeny81_8	MLP1	RPS2	NTR-like	30	2	0.10851562838086	5
180912_LG_Evgeny81_8	MLP1	RPS3	NTR-like	30	2	0.112860754218492	5
180912_LG_Evgeny81_8	MLP1	SAC3	NTR-like	30	2	0.085595509133324	26
180912_LG_Evgeny81_8	MLP1	SEC13	NUP	30	2	0.049639100306718	7
180912_LG_Evgeny81_8	MLP1	SEH1	NUP	30	2	0.010654810915102	5
180912_LG_Evgeny81_8	MLP1	SPT5	NTR-like	30	2	0.097064395108207	10
180912_LG_Evgeny81_8	MLP1	SRM1	NTR-like	30	2	0.099946448994034	6
180912_LG_Evgeny81_8	MLP1	SRP1	NTR	30	2	0.098268679686253	7
180912_LG_Evgeny81_8	MLP1	SSE1	NTR-like	30	2	0.12156920794046	13
180912_LG_Evgeny81_8	MLP1	SUP35	NTR-like	30	2	0.104307594473344	7
180912_LG_Evgeny81_8	MLP1	TCB3	NTR-like	30	2	0.084270617340503	9
180912_LG_Evgeny81_8	MLP1	UTP22	NTR-like	30	2	0.101988913333675	23
180912_LG_Evgeny81_8	MLP1	UTP25	NTR-like	30	2	0.115942899728275	5
180912_LG_Evgeny81_8	MLP1	YEF3	NTR-like	30	2	0.109739613299019	15
180912_LG_Evgeny81_9	MLP1	CRM1	NTR	60	2	0.169434075426801	3
180912_LG_Evgeny81_9	MLP1	DBP9	NTR-like	60	2	0.229193705155263	6
180912_LG_Evgeny81_9	MLP1	ENP1	NTR-like	60	2	0.23056748434137	5
180912_LG_Evgeny81_9	MLP1	FBA1	NTR-like	60	2	0.208269775615262	3
180912_LG_Evgeny81_9	MLP1	GLE1	NUP	60	2	0.187756448509813	4
180912_LG_Evgeny81_9	MLP1	GLE2	NUP	60	2	0.108294810168594	6
180912_LG_Evgeny81_9	MLP1	KAP123	NTR	60	2	0.228421705795263	13
180912_LG_Evgeny81_9	MLP1	KAP95	NTR	60	2	0.223214670478513	13
180912_LG_Evgeny81_9	MLP1	KRE33	NTR-like	60	2	0.234959852489999	22
180912_LG_Evgeny81_9	MLP1	MAK21	NTR-like	60	2	0.224821352007985	15
180912_LG_Evgeny81_9	MLP1	MEX67	NTR	60	2	0.224382392495024	10
180912_LG_Evgeny81_9	MLP1	MLP1	NUP	60	2	0.229095060525456	95
180912_LG_Evgeny81_9	MLP1	MLP2	NUP	60	2	0.151207164744482	56
180912_LG_Evgeny81_9	MLP1	NDC1	NUP	60	2	0.198250082594989	5
180912_LG_Evgeny81_9	MLP1	NIC96	NUP	60	2	0.075308089824624	14
180912_LG_Evgeny81_9	MLP1	NSP1	NUP	60	2	0.032039112692419	40
180912_LG_Evgeny81_9	MLP1	NUP1	NUP	60	2	0.152724698462857	20
180912_LG_Evgeny81_9	MLP1	NUP100	NUP	60	2	0.112157883305785	13
180912_LG_Evgeny81_9	MLP1	NUP116	NUP	60	2	0.155383693824713	17
180912_LG_Evgeny81_9	MLP1	NUP120	NUP	60	2	0.09945123972874	15
180912_LG_Evgeny81_9	MLP1	NUP133	NUP	60	2	0.059680693630145	31
180912_LG_Evgeny81_9	MLP1	NUP145C	NUP	60	2	0.106632403553753	20
180912_LG_Evgeny81_9	MLP1	NUP145N	NUP	60	2	0.145390636567892	15
180912_LG_Evgeny81_9	MLP1	NUP157	NUP	60	2	0.067587136470086	21
180912_LG_Evgeny81_9	MLP1	NUP159	NUP	60	2	0.076279601141515	36
180912_LG_Evgeny81_9	MLP1	NUP170	NUP	60	2	0.079009139157724	33
180912_LG_Evgeny81_9	MLP1	NUP188	NUP	60	2	0.041709116586941	29
180912_LG_Evgeny81_9	MLP1	NUP192	NUP	60	2	0.04992095226225	24
180912_LG_Evgeny81_9	MLP1	NUP2	NUP	60	2	0.21584473372741	29
180912_LG_Evgeny81_9	MLP1	NUP49	NUP	60	2	0.066887484190527	6
180912_LG_Evgeny81_9	MLP1	NUP53	NUP	60	2	0.096763376122254	10
180912_LG_Evgeny81_9	MLP1	NUP57	NUP	60	2	0.053817375063665	13
180912_LG_Evgeny81_9	MLP1	NUP59	NUP	60	2	0.097198804927032	8
180912_LG_Evgeny81_9	MLP1	NUP60	NUP	60	2	0.199589313464455	17
180912_LG_Evgeny81_9	MLP1	NUP82	NUP	60	2	0.09047189647766	13
180912_LG_Evgeny81_9	MLP1	NUP84	NUP	60	2	0.090705932760562	13
180912_LG_Evgeny81_9	MLP1	NUP85	NUP	60	2	0.100800626301587	14
180912_LG_Evgeny81_9	MLP1	PAB1	NTR-like	60	2	0.21834728722583	11
180912_LG_Evgeny81_9	MLP1	POM152	NUP	60	2	0.06235905046524	25
180912_LG_Evgeny81_9	MLP1	POM34	NUP	60	2	0.072092317060398	8
180912_LG_Evgeny81_9	MLP1	PSE1	NTR	60	2	0.21544659997191	4
180912_LG_Evgeny81_9	MLP1	PUF6	NTR-like	60	2	0.22861314347772	6
180912_LG_Evgeny81_9	MLP1	RPP0	NTR-like	60	2	0.234517718488252	5
180912_LG_Evgeny81_9	MLP1	RPS2	NTR-like	60	2	0.234655854155179	5
180912_LG_Evgeny81_9	MLP1	RPS3	NTR-like	60	2	0.2387124950594	5
180912_LG_Evgeny81_9	MLP1	SAC3	NTR-like	60	2	0.213734160738044	26
180912_LG_Evgeny81_9	MLP1	SEC13	NUP	60	2	0.123157637105798	7
180912_LG_Evgeny81_9	MLP1	SEH1	NUP	60	2	0.053468964578417	5
180912_LG_Evgeny81_9	MLP1	SPT5	NTR-like	60	2	0.230005570476403	10
180912_LG_Evgeny81_9	MLP1	SRM1	NTR-like	60	2	0.217685103985978	6
180912_LG_Evgeny81_9	MLP1	SRP1	NTR	60	2	0.220573210509758	7
180912_LG_Evgeny81_9	MLP1	SSE1	NTR-like	60	2	0.248805151757141	12
180912_LG_Evgeny81_9	MLP1	SUP35	NTR-like	60	2	0.220747547170801	7
180912_LG_Evgeny81_9	MLP1	TCB3	NTR-like	60	2	0.204235745376685	9
180912_LG_Evgeny81_9	MLP1	UTP22	NTR-like	60	2	0.221206237446073	23
180912_LG_Evgeny81_9	MLP1	UTP25	NTR-like	60	2	0.223738236793675	5
180912_LG_Evgeny81_9	MLP1	YEF3	NTR-like	60	2	0.236491170739542	14
