bait	prey	kind	time	replicate	k2	prec.no.K2	k1	prec.no.K1
MLP1	ABF2	other	120	1	0.310563178188412	2	0.425144794996363	5
MLP1	ABF2	other	120	2	0.395992989145649	2	0.416589567205323	5
MLP1	ABF2	other	120	3	0.402184878772165	2	0.426938882421064	5
MLP1	ABF2	other	150	1	0.507745716963748	2	0.520576870399596	5
MLP1	ABF2	other	150	2	0.545447179268025	2	0.531590987268425	5
MLP1	ABF2	other	150	3	0.541789072190322	2	0.536719210325745	5
MLP1	ABF2	other	30	1	0.023825422468493	2	0.091472362793969	5
MLP1	ABF2	other	30	2	7.53906422101767E-05	2	0.088672577751423	5
MLP1	ABF2	other	30	3	0.010413777198883	2	0.099160600437538	5
MLP1	ABF2	other	60	1	0.077752390210949	2	0.204809332969998	5
MLP1	ABF2	other	60	2	0.151598951303432	2	0.198321623390596	5
MLP1	ABF2	other	60	3	0.022443247244722	2	0.208578550867524	5
MLP1	ABF2	other	90	1	0.251469685822587	2	0.312473899664956	5
MLP1	ABF2	other	90	2	0.236124503058764	2	0.303737705016744	5
MLP1	ABF2	other	90	3	0.271269818630728	2	0.321857283014378	5
MLP1	ARP4	other	120	1	0.30811448151935	3	0.334920677392257	6
MLP1	ARP4	other	120	2	0.293183777422964	3	0.330143753902456	6
MLP1	ARP4	other	120	3	0.304963899615515	3	0.342338804205604	6
MLP1	ARP4	other	150	1	0.402396426821479	3	0.426353463825442	6
MLP1	ARP4	other	150	2	0.436458620993608	3	0.45196750158002	6
MLP1	ARP4	other	150	3	0.414116116217686	3	0.444953516569368	6
MLP1	ARP4	other	30	1	0.019540127628346	3	0.033121306978083	6
MLP1	ARP4	other	30	2	0.006456520804718	3	0.034434624584136	6
MLP1	ARP4	other	30	3	0.017198155381117	2	0.0377265407758	6
MLP1	ARP4	other	60	1	0.052094603670066	2	0.11521742208834	6
MLP1	ARP4	other	60	2	0.063301524229962	3	0.124119233818472	6
MLP1	ARP4	other	60	3	0.077379248043603	3	0.128241392779903	6
MLP1	ARP4	other	90	1	0.189286720993355	2	0.21652268577229	6
MLP1	ARP4	other	90	2	0.165192461519756	2	0.224043596599155	6
MLP1	ARP4	other	90	3	0.181696366014113	3	0.232157569674416	6
MLP1	ARP8	other	120	1	0.279511121340678	2	0.34188621637674	7
MLP1	ARP8	other	120	2	0.284569534019829	2	0.338634439122854	7
MLP1	ARP8	other	120	3	0.285704643559924	2	0.345930337109044	7
MLP1	ARP8	other	150	1	0.395191571861878	2	0.43835158963594	7
MLP1	ARP8	other	150	2	0.416430632368366	2	0.459688547532205	7
MLP1	ARP8	other	150	3	0.437326584464566	2	0.445889712492052	7
MLP1	ARP8	other	30	1	0.003858128156962	2	0.036467352528618	7
MLP1	ARP8	other	30	2	0.003762110678332	2	0.036470881999007	7
MLP1	ARP8	other	30	3	0.005809108731498	2	0.035461674528551	6
MLP1	ARP8	other	60	1	0.0246900030109	2	0.121760290839221	7
MLP1	ARP8	other	60	2	0.030481799957734	2	0.122896272607657	6
MLP1	ARP8	other	60	3	0.038285257844284	2	0.11683010700009	7
MLP1	ARP8	other	90	1	0.166040319730824	2	0.2256428665566	7
MLP1	ARP8	other	90	2	0.162878568243708	2	0.232431294014545	7
MLP1	ARP8	other	90	3	0.152540870338271	2	0.232443855497385	7
MLP1	ARP9	other	120	1	0.378045271297756	2	0.368733844325267	6
MLP1	ARP9	other	120	2	0.383416141044635	3	0.386728954641404	6
MLP1	ARP9	other	120	3	0.381546309331448	3	0.380015444458994	6
MLP1	ARP9	other	150	1	0.452638537029158	3	0.467278083289732	6
MLP1	ARP9	other	150	2	0.496093785000884	3	0.497886459384762	6
MLP1	ARP9	other	150	3	0.484938162764698	3	0.477014193889704	6
MLP1	ARP9	other	30	1	0.011637437663028	3	0.057329591396176	6
MLP1	ARP9	other	30	2	0.021336411990609	3	0.061141536074281	6
MLP1	ARP9	other	30	3	0.002250995227933	1	0.061971885175538	6
MLP1	ARP9	other	60	1	0.061128949570645	2	0.159903977904178	6
MLP1	ARP9	other	60	2	0.059214528959737	2	0.179158161395502	6
MLP1	ARP9	other	60	3	0.071304730041159	3	0.158501741453615	6
MLP1	ARP9	other	90	1	0.221267749124615	3	0.263721064836053	6
MLP1	ARP9	other	90	2	0.225317154547743	3	0.270192757646596	6
MLP1	ARP9	other	90	3	0.210094217420044	3	0.271623643331237	6
MLP1	ASC1	other	120	1	0.410657012549844	2	0.426497981026452	4
MLP1	ASC1	other	120	2	0.450081637554181	2	0.457665481332196	4
MLP1	ASC1	other	120	3	0.413816183403154	2	0.435980868820154	4
MLP1	ASC1	other	150	1	0.522337116794792	2	0.511625050743361	4
MLP1	ASC1	other	150	2	0.56565027736644	2	0.547585709030787	4
MLP1	ASC1	other	150	3	0.537111327993253	2	0.519274672098067	4
MLP1	ASC1	other	30	1	0.044640184636006	2	0.091943972933258	4
MLP1	ASC1	other	30	2	0.053152273729789	2	0.105838707217663	4
MLP1	ASC1	other	30	3	0.049862056781978	2	0.091589074718478	4
MLP1	ASC1	other	60	1	0.135848892290108	2	0.204903167902831	4
MLP1	ASC1	other	60	2	0.169466280579906	2	0.232829714477972	4
MLP1	ASC1	other	60	3	0.144563155798949	2	0.201351016745942	4
MLP1	ASC1	other	90	1	0.269837496634	2	0.31197997752404	4
MLP1	ASC1	other	90	2	0.295797698398324	2	0.346479878000796	4
MLP1	ASC1	other	90	3	0.281301318167828	2	0.326829115622689	4
MLP1	BFR2	other	120	1	0.419968243551345	2	0.434068646270135	6
MLP1	BFR2	other	120	2	0.413503456426747	2	0.431254229045903	6
MLP1	BFR2	other	120	3	0.414769664770526	2	0.4303862576081	6
MLP1	BFR2	other	150	1	0.494043103061833	2	0.497643189389457	6
MLP1	BFR2	other	150	2	0.523045157230835	2	0.523448712595703	6
MLP1	BFR2	other	150	3	0.508543253343573	2	0.494945331187123	6
MLP1	BFR2	other	30	1	0.015308437558501	2	0.082612521806273	6
MLP1	BFR2	other	30	2	0.030741180892354	2	0.101274546530837	6
MLP1	BFR2	other	30	3	0.011942926155209	2	0.102302777379181	5
MLP1	BFR2	other	60	1	0.15992083178123	2	0.214739800432598	6
MLP1	BFR2	other	60	2	0.110709042140032	2	0.201021374567178	6
MLP1	BFR2	other	60	3	0.110447996431131	2	0.209756910199019	6
MLP1	BFR2	other	90	1	0.281584027671064	2	0.33182364926962	6
MLP1	BFR2	other	90	2	0.289118145580804	2	0.336347669536861	6
MLP1	BFR2	other	90	3	0.295360979322311	2	0.335620977303787	6
MLP1	CBF5	other	120	1	0.428902202257056	3	0.419784721971253	7
MLP1	CBF5	other	120	2	0.422334009555877	3	0.42213408441366	7
MLP1	CBF5	other	120	3	0.404907867657691	3	0.422172524423629	7
MLP1	CBF5	other	150	1	0.49711687990263	3	0.497004527549485	7
MLP1	CBF5	other	150	2	0.527545704833761	3	0.518504820101218	7
MLP1	CBF5	other	150	3	0.564937334994877	3	0.50154008649751	7
MLP1	CBF5	other	30	1	0.009668868508543	3	0.089842716964655	7
MLP1	CBF5	other	30	2	0.027614374067606	3	0.10029159329642	7
MLP1	CBF5	other	30	3	0.040235682643744	2	0.10750437368489	7
MLP1	CBF5	other	60	1	0.037417111861677	2	0.185678719433629	6
MLP1	CBF5	other	60	2	0.143284249365453	3	0.233472086380917	7
MLP1	CBF5	other	60	3	0.147864294365463	3	0.214069006506409	7
MLP1	CBF5	other	90	1	0.245102697774321	3	0.308927235710411	7
MLP1	CBF5	other	90	2	0.259860644731774	3	0.310166975494302	7
MLP1	CBF5	other	90	3	0.273667888394659	3	0.322999415468314	7
MLP1	CDC19	other	120	1	0.401902045441067	3	0.414012425650394	10
MLP1	CDC19	other	120	2	0.429108577580654	3	0.429055692917145	10
MLP1	CDC19	other	120	3	0.400242606604319	3	0.416231669992197	10
MLP1	CDC19	other	150	1	0.533782785485142	3	0.498116881139664	10
MLP1	CDC19	other	150	2	0.550615503054557	3	0.536013382325598	10
MLP1	CDC19	other	150	3	0.530857912193579	3	0.502663269474983	10
MLP1	CDC19	other	30	1	0.049060940977341	3	0.095214932503377	10
MLP1	CDC19	other	30	2	0.026239706491566	3	0.093627859408413	10
MLP1	CDC19	other	30	3	0.052438504753328	3	0.093239394620535	10
MLP1	CDC19	other	60	1	0.1143786386447	3	0.199365947905487	9
MLP1	CDC19	other	60	2	0.164353200838308	3	0.212432697190242	10
MLP1	CDC19	other	60	3	0.139339963414017	3	0.196102726965552	10
MLP1	CDC19	other	90	1	0.271488714857165	3	0.305839742605435	10
MLP1	CDC19	other	90	2	0.281341851722397	3	0.317052320931653	10
MLP1	CDC19	other	90	3	0.260335453100115	3	0.308946450132524	10
MLP1	DED1	other	120	1	0.439080058729939	2	0.441630824866161	3
MLP1	DED1	other	120	2	0.443944141292324	2	0.461394300125105	3
MLP1	DED1	other	120	3	0.432438993274407	2	0.456552086478566	3
MLP1	DED1	other	150	1	0.551475783574711	2	0.532377111688318	3
MLP1	DED1	other	150	2	0.560036226543646	2	0.561140367843826	3
MLP1	DED1	other	150	3	0.547215196043316	2	0.544200658693971	3
MLP1	DED1	other	30	1	0.050722527061541	2	0.102792376557535	3
MLP1	DED1	other	30	2	0.05492875727043	2	0.113598782861683	3
MLP1	DED1	other	30	3	0.053332128221712	1	0.107990873094269	3
MLP1	DED1	other	60	1	0.160441726286489	2	0.220540997870137	3
MLP1	DED1	other	60	2	0.183324076898663	1	0.242915417287588	3
MLP1	DED1	other	60	3	0.156724785970729	2	0.220242297349075	3
MLP1	DED1	other	90	1	0.28914348273873	2	0.334812331664564	3
MLP1	DED1	other	90	2	0.317233270948621	2	0.347065962164028	3
MLP1	DED1	other	90	3	0.297833966890971	2	0.345405180829138	3
MLP1	ESC1	other	120	1	0.363521645132643	2	0.381112358596338	11
MLP1	ESC1	other	120	2	0.370210766578337	2	0.383797562421733	12
MLP1	ESC1	other	120	3	0.370722714757773	2	0.396873610343761	12
MLP1	ESC1	other	150	1	0.501236056147264	2	0.488041629622869	12
MLP1	ESC1	other	150	2	0.525676378258616	2	0.496975170104317	12
MLP1	ESC1	other	150	3	0.515625048986939	2	0.501057517023367	12
MLP1	ESC1	other	30	1	0.020786447467314	2	0.065499634041703	12
MLP1	ESC1	other	30	2	0.019860621398479	2	0.066015571631487	12
MLP1	ESC1	other	30	3	0.0284602602151	2	0.071017422795602	11
MLP1	ESC1	other	60	1	0.108266565838017	2	0.171599229458943	12
MLP1	ESC1	other	60	2	0.131471746565517	2	0.170915978379406	11
MLP1	ESC1	other	60	3	0.12239787796656	2	0.172346251412504	12
MLP1	ESC1	other	90	1	0.193684006902896	2	0.276814516004537	12
MLP1	ESC1	other	90	2	0.262802498927568	2	0.270411586603276	9
MLP1	ESC1	other	90	3	0.265701073183327	2	0.278222941249779	12
MLP1	HPR1	other	120	1	0.403738736535875	2	0.370009230205062	7
MLP1	HPR1	other	120	2	0.369690405468157	2	0.375339810553085	7
MLP1	HPR1	other	120	3	0.389018970288493	2	0.371561528535817	6
MLP1	HPR1	other	150	1	0.502968851411113	2	0.471447897025873	6
MLP1	HPR1	other	150	2	0.562025133412723	2	0.479700745631263	7
MLP1	HPR1	other	150	3	0.488344381153966	2	0.487224771117313	7
MLP1	HPR1	other	30	1	0.04040967503199	2	0.060714404527752	7
MLP1	HPR1	other	30	2	0.039978616014733	2	0.057709951229845	6
MLP1	HPR1	other	30	3	0.061573387946217	2	0.06170301589929	7
MLP1	HPR1	other	60	1	0.065795484013787	2	0.165774519834774	7
MLP1	HPR1	other	60	2	0.124036855616328	2	0.178483083503314	6
MLP1	HPR1	other	60	3	0.155592865485499	2	0.172834820488813	7
MLP1	HPR1	other	90	1	0.273412246576555	2	0.259547724210427	7
MLP1	HPR1	other	90	2	0.242041402614724	2	0.255564898156639	6
MLP1	HPR1	other	90	3	0.262804196776264	2	0.265557087291345	7
MLP1	ISW1	other	120	1	0.324684932850518	3	0.368397620508884	24
MLP1	ISW1	other	120	2	0.331055120413692	3	0.374618812622655	24
MLP1	ISW1	other	120	3	0.31614036504737	3	0.36684719277806	24
MLP1	ISW1	other	150	1	0.446251212090913	3	0.471222093048532	24
MLP1	ISW1	other	150	2	0.470393974261052	3	0.484934323418088	24
MLP1	ISW1	other	150	3	0.45921065819258	3	0.471567542129268	24
MLP1	ISW1	other	30	1	0.024561989306504	3	0.063081285267095	24
MLP1	ISW1	other	30	2	0.026426310470395	3	0.065114310832196	24
MLP1	ISW1	other	30	3	0.02789083865398	3	0.069684007737147	24
MLP1	ISW1	other	60	1	0.096101411011043	3	0.170063369308908	23
MLP1	ISW1	other	60	2	0.108965654002289	3	0.181314259351352	24
MLP1	ISW1	other	60	3	0.10831992177423	3	0.168335911335594	24
MLP1	ISW1	other	90	1	0.192003050454201	3	0.25301269824054	24
MLP1	ISW1	other	90	2	0.191668162639166	3	0.262457631927561	24
MLP1	ISW1	other	90	3	0.20958821136821	3	0.259702537234814	24
MLP1	KRE33	NTR-like	120	1	0.38995697593525	2	0.444786735023915	23
MLP1	KRE33	NTR-like	120	2	0.443172914506531	2	0.445281429095995	23
MLP1	KRE33	NTR-like	120	3	0.438884049669015	2	0.447806955740068	23
MLP1	KRE33	NTR-like	150	1	0.535864814722635	2	0.516696093570536	23
MLP1	KRE33	NTR-like	150	2	0.560431097476808	2	0.527888623387635	23
MLP1	KRE33	NTR-like	150	3	0.484119162941854	2	0.51881874647967	23
MLP1	KRE33	NTR-like	30	1	0.008179430775343	2	0.106221111495293	23
MLP1	KRE33	NTR-like	30	2	0.029228602960685	2	0.117911235149143	23
MLP1	KRE33	NTR-like	30	3	0.038220938614996	2	0.119575715003223	23
MLP1	KRE33	NTR-like	60	1	0.089094499290486	2	0.215939224540158	22
MLP1	KRE33	NTR-like	60	2	0.156211811938486	2	0.234959852489999	22
MLP1	KRE33	NTR-like	60	3	0.138797774437759	2	0.231029130952891	22
MLP1	KRE33	NTR-like	90	1	0.296629934415554	2	0.347534533349656	23
MLP1	KRE33	NTR-like	90	2	0.279342057848364	2	0.345246164783513	23
MLP1	KRE33	NTR-like	90	3	0.290726687103559	2	0.356038146813753	23
MLP1	MLP1	NUP	120	1	0.444234096977971	34	0.446705817927821	95
MLP1	MLP1	NUP	120	2	0.453496966541446	34	0.4555757074386	95
MLP1	MLP1	NUP	120	3	0.455564184359742	34	0.456727506455348	95
MLP1	MLP1	NUP	150	1	0.564412482729324	34	0.542631459327495	94
MLP1	MLP1	NUP	150	2	0.58416633322033	34	0.561855043587061	95
MLP1	MLP1	NUP	150	3	0.572444638659691	34	0.549973777702584	95
MLP1	MLP1	NUP	30	1	0.056101650818421	34	0.100112310914525	95
MLP1	MLP1	NUP	30	2	0.056122070195923	34	0.096944098469978	94
MLP1	MLP1	NUP	30	3	0.058204402782396	34	0.097933387059311	95
MLP1	MLP1	NUP	60	1	0.169554668894705	33	0.225012385413959	94
MLP1	MLP1	NUP	60	2	0.180486798958695	34	0.229095060525456	95
MLP1	MLP1	NUP	60	3	0.173572198681763	34	0.223576644789972	95
MLP1	MLP1	NUP	90	1	0.305311514052929	34	0.33758162415248	95
MLP1	MLP1	NUP	90	2	0.308153585120652	31	0.339696610427903	95
MLP1	MLP1	NUP	90	3	0.312665934716378	34	0.344646910972323	95
MLP1	MLP2	NUP	120	1	0.338303165801827	9	0.372129769242359	56
MLP1	MLP2	NUP	120	2	0.336465860644178	9	0.372153900051433	56
MLP1	MLP2	NUP	120	3	0.345597392165427	9	0.376337396984076	56
MLP1	MLP2	NUP	150	1	0.468571311897432	9	0.475483663527484	56
MLP1	MLP2	NUP	150	2	0.470988952020703	9	0.485515979169699	56
MLP1	MLP2	NUP	150	3	0.473732836497251	9	0.478668699941684	56
MLP1	MLP2	NUP	30	1	0.016749828027437	9	0.050277270773034	56
MLP1	MLP2	NUP	30	2	0.01452105460063	9	0.049460898668754	56
MLP1	MLP2	NUP	30	3	0.015998049034476	9	0.04893794823768	56
MLP1	MLP2	NUP	60	1	0.086117674619346	9	0.148501795137928	56
MLP1	MLP2	NUP	60	2	0.100690738897609	8	0.151207164744482	56
MLP1	MLP2	NUP	60	3	0.092197194807511	9	0.147115530759788	56
MLP1	MLP2	NUP	90	1	0.207126762606919	9	0.262627680935926	55
MLP1	MLP2	NUP	90	2	0.202343500280278	9	0.259645257432372	52
MLP1	MLP2	NUP	90	3	0.206979716976939	9	0.264635423254589	56
MLP1	NAB2	other	120	1	0.402307540658449	2	0.430997760938281	5
MLP1	NAB2	other	120	2	0.403892818581774	2	0.444974177160165	5
MLP1	NAB2	other	120	3	0.360734455865291	2	0.454604781419813	5
MLP1	NAB2	other	150	1	0.498006248954679	2	0.537217029618442	5
MLP1	NAB2	other	150	2	0.529157005248114	2	0.548496693261935	5
MLP1	NAB2	other	150	3	0.489897046854412	2	0.549707273586057	5
MLP1	NAB2	other	30	1	0.015829879736664	2	0.111881718343987	5
MLP1	NAB2	other	30	2	0.040412122824605	2	0.119628596406312	5
MLP1	NAB2	other	30	3	0.030585178701713	2	0.12294035297594	5
MLP1	NAB2	other	60	1	0.116707115569069	2	0.223924451980112	5
MLP1	NAB2	other	60	2	0.145443760095334	2	0.235261156357365	5
MLP1	NAB2	other	60	3	0.138130868121124	2	0.229124021723528	5
MLP1	NAB2	other	90	1	0.214815680736852	2	0.339734101180119	5
MLP1	NAB2	other	90	2	0.238592105834618	2	0.33695770192614	4
MLP1	NAB2	other	90	3	0.25896549462309	2	0.35075422475601	5
MLP1	NAN1	other	120	1	0.364909822957875	2	0.378088162295395	14
MLP1	NAN1	other	120	2	0.339425871320322	2	0.376283607426381	14
MLP1	NAN1	other	120	3	0.345066702394157	2	0.379972292745583	14
MLP1	NAN1	other	150	1	0.44874314745961	2	0.458604224195262	14
MLP1	NAN1	other	150	2	0.484660061667677	2	0.473394181257721	14
MLP1	NAN1	other	150	3	0.44360681192887	2	0.456402312153139	14
MLP1	NAN1	other	30	1	0.015897384979814	2	0.059450484008098	14
MLP1	NAN1	other	30	2	0.024204936632242	2	0.06742069305507	14
MLP1	NAN1	other	30	3	0.046939915752552	2	0.081648912308552	14
MLP1	NAN1	other	60	1	0.080470369987994	1	0.1612842782667	14
MLP1	NAN1	other	60	2	0.071644540496833	2	0.176420181406514	14
MLP1	NAN1	other	60	3	0.103188237263514	2	0.176609693504504	14
MLP1	NAN1	other	90	1	0.214720775651235	2	0.270175993240669	14
MLP1	NAN1	other	90	2	0.224047768981259	2	0.2688135089328	14
MLP1	NAN1	other	90	3	0.225287875627351	2	0.285159019870544	14
MLP1	NET1	other	120	1	0.383578114719792	5	0.409194080617483	17
MLP1	NET1	other	120	2	0.39495777834619	5	0.419994582429526	17
MLP1	NET1	other	120	3	0.40860329686213	5	0.418222292969022	17
MLP1	NET1	other	150	1	0.482144090303734	5	0.495290054810111	17
MLP1	NET1	other	150	2	0.534389059294796	5	0.519039845262625	16
MLP1	NET1	other	150	3	0.520333759304551	5	0.510131625401497	17
MLP1	NET1	other	30	1	0.033022188803451	5	0.085778253530874	17
MLP1	NET1	other	30	2	0.044442293186878	5	0.087530370831789	17
MLP1	NET1	other	30	3	0.041339142214587	5	0.092406524909022	15
MLP1	NET1	other	60	1	0.12969108277555	5	0.19425666096617	16
MLP1	NET1	other	60	2	0.144894879206164	5	0.206288358440203	16
MLP1	NET1	other	60	3	0.139166521093856	4	0.206496504211707	17
MLP1	NET1	other	90	1	0.257756610699395	5	0.303927277325328	17
MLP1	NET1	other	90	2	0.252805261854256	5	0.311396207975368	17
MLP1	NET1	other	90	3	0.271845771006611	5	0.318074760040034	17
MLP1	NHP2	other	120	1	0.41531258921762	2	0.411369573839735	4
MLP1	NHP2	other	120	2	0.401327393282235	2	0.424105702881133	4
MLP1	NHP2	other	120	3	0.422341469024014	2	0.428513147586237	4
MLP1	NHP2	other	150	1	0.502792490124898	2	0.509360150868687	4
MLP1	NHP2	other	150	2	0.547111790957146	2	0.506909054346276	4
MLP1	NHP2	other	150	3	0.479970750115902	2	0.514047776784722	4
MLP1	NHP2	other	30	1	0.035207922988938	2	0.088252137431443	4
MLP1	NHP2	other	30	2	0.038501061596954	2	0.09849136950322	4
MLP1	NHP2	other	30	3	0.046996885779572	2	0.111869283922711	4
MLP1	NHP2	other	60	1	0.11306424854009	2	0.202635874937188	4
MLP1	NHP2	other	60	2	0.154486218588832	2	0.217670075539848	4
MLP1	NHP2	other	60	3	0.129869423111487	2	0.221479566016452	4
MLP1	NHP2	other	90	1	0.273682086408603	2	0.313661650826209	4
MLP1	NHP2	other	90	2	0.265058332456659	2	0.317837859873833	4
MLP1	NHP2	other	90	3	0.283751136552262	2	0.325759097617755	4
MLP1	NOP1	other	120	1	0.434709970158463	3	0.439241622214711	10
MLP1	NOP1	other	120	2	0.447455302411127	3	0.455605550004603	10
MLP1	NOP1	other	120	3	0.443528099683683	3	0.458188623153467	10
MLP1	NOP1	other	150	1	0.523952681972486	3	0.516621175778984	10
MLP1	NOP1	other	150	2	0.555537266533963	3	0.538542977112532	10
MLP1	NOP1	other	150	3	0.537337522965941	3	0.53030178428109	10
MLP1	NOP1	other	30	1	0.057685993594898	3	0.105162601709235	10
MLP1	NOP1	other	30	2	0.069890545444315	3	0.116537436161637	10
MLP1	NOP1	other	30	3	0.06419992174967	3	0.111856234982815	10
MLP1	NOP1	other	60	1	0.161277579665107	3	0.210904056712887	10
MLP1	NOP1	other	60	2	0.183410068845153	3	0.23732900811456	10
MLP1	NOP1	other	60	3	0.175893557126959	3	0.229534327966297	10
MLP1	NOP1	other	90	1	0.303769571188809	3	0.342576352901816	10
MLP1	NOP1	other	90	2	0.315582931776292	3	0.355264502331486	10
MLP1	NOP1	other	90	3	0.313202312391633	3	0.353631291335463	10
MLP1	NOP12	other	120	1	0.421291301932156	3	0.441804121754237	8
MLP1	NOP12	other	120	2	0.421542272800582	3	0.447452277980134	8
MLP1	NOP12	other	120	3	0.420260245741061	3	0.453354629570504	8
MLP1	NOP12	other	150	1	0.512556466663775	3	0.518930540574011	8
MLP1	NOP12	other	150	2	0.533734083042582	3	0.532128740116066	8
MLP1	NOP12	other	150	3	0.511506572511235	3	0.523049553543959	8
MLP1	NOP12	other	30	1	0.047305735339874	3	0.11035696207709	8
MLP1	NOP12	other	30	2	0.054504377102419	3	0.118505293483593	8
MLP1	NOP12	other	30	3	0.063212128824648	3	0.129647801295214	8
MLP1	NOP12	other	60	1	0.178543045584158	3	0.2226688118934	8
MLP1	NOP12	other	60	2	0.186750586047288	3	0.23271435887039	8
MLP1	NOP12	other	60	3	0.164227204017417	3	0.228691505616513	8
MLP1	NOP12	other	90	1	0.311716099262191	3	0.343129408313406	8
MLP1	NOP12	other	90	2	0.321383985967108	3	0.346561035464262	8
MLP1	NOP12	other	90	3	0.312798166522619	3	0.353342772517187	8
MLP1	NOP13	other	120	1	0.461288458827084	3	0.458272986722303	7
MLP1	NOP13	other	120	2	0.465840953156335	4	0.46719116099886	7
MLP1	NOP13	other	120	3	0.474785015266478	4	0.460799256030306	7
MLP1	NOP13	other	150	1	0.55142796346567	4	0.534549531216215	7
MLP1	NOP13	other	150	2	0.57048820793724	4	0.541995690915078	7
MLP1	NOP13	other	150	3	0.568637264540713	4	0.533772680837973	7
MLP1	NOP13	other	30	1	0.048543048033255	4	0.109009524118653	7
MLP1	NOP13	other	30	2	0.061783242898758	4	0.134104158305187	7
MLP1	NOP13	other	30	3	0.042527282857729	3	0.128339425737481	7
MLP1	NOP13	other	60	1	0.170272799323532	4	0.210954884848684	7
MLP1	NOP13	other	60	2	0.183725709813868	3	0.245715353211633	7
MLP1	NOP13	other	60	3	0.172869593096272	3	0.237192677582077	7
MLP1	NOP13	other	90	1	0.341751486776033	4	0.361225668284782	7
MLP1	NOP13	other	90	2	0.32651146111581	4	0.397148115103352	6
MLP1	NOP13	other	90	3	0.348544794525215	4	0.373045271145896	7
MLP1	NOP14	other	120	1	0.382966600321623	2	0.392369821795079	9
MLP1	NOP14	other	120	2	0.357643678492011	2	0.383150476752676	9
MLP1	NOP14	other	120	3	0.395304101293659	2	0.396582121875792	9
MLP1	NOP14	other	150	1	0.451138907950307	2	0.465373153035072	9
MLP1	NOP14	other	150	2	0.518426592397345	2	0.471372867134807	9
MLP1	NOP14	other	150	3	0.444401801828432	2	0.472281424949303	9
MLP1	NOP14	other	30	1	0.059417134409004	2	0.070228249257617	9
MLP1	NOP14	other	30	2	0.04467989255222	2	0.080291060258806	9
MLP1	NOP14	other	30	3	0.05437515628267	2	0.100995393083295	9
MLP1	NOP14	other	60	1	0.094091743099107	2	0.175088021857357	9
MLP1	NOP14	other	60	2	0.130842886906393	2	0.192162857428437	9
MLP1	NOP14	other	60	3	0.212554337027262	2	0.191575223604818	9
MLP1	NOP14	other	90	1	0.244653774406701	2	0.284280332365403	9
MLP1	NOP14	other	90	2	0.235939788183216	2	0.273407283972246	9
MLP1	NOP14	other	90	3	0.250686170061403	2	0.307874565646513	9
MLP1	NOP56	other	120	1	0.424352701405545	2	0.412869186776283	12
MLP1	NOP56	other	120	2	0.405180949225773	2	0.4288494307136	12
MLP1	NOP56	other	120	3	0.40252284432799	2	0.431376054780429	12
MLP1	NOP56	other	150	1	0.522041994280014	2	0.498465995317295	12
MLP1	NOP56	other	150	2	0.520031831758814	2	0.51950203042353	12
MLP1	NOP56	other	150	3	0.506195451973984	1	0.507116325984954	12
MLP1	NOP56	other	30	1	4.65860522397884E-05	2	0.085963965828124	12
MLP1	NOP56	other	30	2	0.024655463226989	2	0.092800870893484	12
MLP1	NOP56	other	30	3	8.99273264745482E-05	2	0.112039153272583	12
MLP1	NOP56	other	60	1	0.064695335876996	2	0.193322426833733	12
MLP1	NOP56	other	60	2	0.118792297228644	2	0.216777951825523	12
MLP1	NOP56	other	60	3	0.064735933067629	1	0.219062342445217	12
MLP1	NOP56	other	90	1	0.257359067878188	2	0.315338331843864	12
MLP1	NOP56	other	90	2	0.261507012634	2	0.316985712408663	12
MLP1	NOP56	other	90	3	0.265088005364651	2	0.330681920016885	12
MLP1	NOP7	other	120	1	0.448617568500451	3	0.467254245252979	6
MLP1	NOP7	other	120	2	0.418734129671191	3	0.465347133426492	6
MLP1	NOP7	other	120	3	0.444170719421733	3	0.450386942546468	6
MLP1	NOP7	other	150	1	0.534322933428789	3	0.519263811624766	6
MLP1	NOP7	other	150	2	0.48985319077955	3	0.536454482293375	6
MLP1	NOP7	other	150	3	0.552856023771671	3	0.518021171314032	6
MLP1	NOP7	other	30	1	0.047692512645966	3	0.115535040309548	6
MLP1	NOP7	other	30	2	0.077179373014476	3	0.133683403834074	6
MLP1	NOP7	other	30	3	0.07448136996264	3	0.118502321212563	6
MLP1	NOP7	other	60	1	0.152969507309545	3	0.228294141145261	5
MLP1	NOP7	other	60	2	0.168830444355027	3	0.229747313912078	6
MLP1	NOP7	other	60	3	0.186537349425701	3	0.239581373826626	6
MLP1	NOP7	other	90	1	0.329174596619335	3	0.363820053202454	6
MLP1	NOP7	other	90	2	0.335064667502497	3	0.360186393253519	6
MLP1	NOP7	other	90	3	0.324252996532859	3	0.366533482559806	6
MLP1	NSP1	NUP	120	1	0.10301962794983	24	0.152180147475527	40
MLP1	NSP1	NUP	120	2	0.11041797657021	24	0.154042095788583	39
MLP1	NSP1	NUP	120	3	0.105524342624766	24	0.155107501946449	40
MLP1	NSP1	NUP	150	1	0.179792472415095	24	0.232496720452254	39
MLP1	NSP1	NUP	150	2	0.19412676386519	23	0.241347042555508	39
MLP1	NSP1	NUP	150	3	0.181828043284577	24	0.236212026749478	40
MLP1	NSP1	NUP	30	1	0.005915777956355	24	0.005820270117699	39
MLP1	NSP1	NUP	30	2	0.005834303757557	24	0.007074458419699	40
MLP1	NSP1	NUP	30	3	0.006760524572329	24	0.006778526777387	40
MLP1	NSP1	NUP	60	1	0.013086755605736	24	0.029326524140669	40
MLP1	NSP1	NUP	60	2	0.016330899685547	24	0.032039112692419	40
MLP1	NSP1	NUP	60	3	0.015387713450908	24	0.031465742649971	40
MLP1	NSP1	NUP	90	1	0.054574336080667	24	0.089336683310274	39
MLP1	NSP1	NUP	90	2	0.069462097374043	22	0.087333224192351	38
MLP1	NSP1	NUP	90	3	0.048996241857683	24	0.082458513066313	40
MLP1	NSR1	other	120	1	0.3339820257681	3	0.371056047139323	7
MLP1	NSR1	other	120	2	0.328503146218539	3	0.355808394811703	7
MLP1	NSR1	other	120	3	0.341347700928815	3	0.382082342605968	7
MLP1	NSR1	other	150	1	0.41647486027125	3	0.450887915413411	7
MLP1	NSR1	other	150	2	0.438636061655274	3	0.455581670373655	7
MLP1	NSR1	other	150	3	0.425039928548567	3	0.460576206155761	7
MLP1	NSR1	other	30	1	0.008962861322534	3	0.063223856036483	7
MLP1	NSR1	other	30	2	0.027856776791179	3	0.064650200868656	7
MLP1	NSR1	other	30	3	0.03037964697499	3	0.096325169340674	7
MLP1	NSR1	other	60	1	0.061412978206898	3	0.168362817596737	7
MLP1	NSR1	other	60	2	0.079453564150784	3	0.173246096879212	7
MLP1	NSR1	other	60	3	0.097502588122136	3	0.18177813436233	7
MLP1	NSR1	other	90	1	0.193715753916165	3	0.255825167654553	7
MLP1	NSR1	other	90	2	0.210141793986972	3	0.254910254115371	7
MLP1	NSR1	other	90	3	0.218215739632134	3	0.28536627708048	7
MLP1	NUP1	NUP	120	1	0.331176840286327	5	0.374297414957938	20
MLP1	NUP1	NUP	120	2	0.357365363822529	6	0.387089344559984	20
MLP1	NUP1	NUP	120	3	0.362417227063472	6	0.389568489834025	19
MLP1	NUP1	NUP	150	1	0.475924838324658	6	0.47536788746765	20
MLP1	NUP1	NUP	150	2	0.49288795875528	6	0.497445937660835	20
MLP1	NUP1	NUP	150	3	0.504911046515382	5	0.492124667238595	20
MLP1	NUP1	NUP	30	1	0.025115077253865	6	0.054231785310158	20
MLP1	NUP1	NUP	30	2	0.025498394593133	6	0.053928677552987	20
MLP1	NUP1	NUP	30	3	0.027172933827478	5	0.059774325927006	20
MLP1	NUP1	NUP	60	1	0.078798010659645	6	0.147717685169139	20
MLP1	NUP1	NUP	60	2	0.084212654987672	5	0.152724698462857	20
MLP1	NUP1	NUP	60	3	0.100757818487915	6	0.156795417334208	20
MLP1	NUP1	NUP	90	1	0.213562654943943	6	0.266164134693366	20
MLP1	NUP1	NUP	90	2	0.199326989324353	6	0.267575610276306	19
MLP1	NUP1	NUP	90	3	0.211442354565311	5	0.274840353394652	20
MLP1	NUP100	NUP	120	1	0.270041436228936	4	0.282104060191561	13
MLP1	NUP100	NUP	120	2	0.271720501464373	4	0.290714552153841	13
MLP1	NUP100	NUP	120	3	0.265433933928146	4	0.291769170188173	13
MLP1	NUP100	NUP	150	1	0.342406389937585	4	0.365765497444342	13
MLP1	NUP100	NUP	150	2	0.368679763966977	4	0.379169774476418	13
MLP1	NUP100	NUP	150	3	0.358786528696545	4	0.373573026030349	13
MLP1	NUP100	NUP	30	1	0.01758783045476	4	0.043342567695824	13
MLP1	NUP100	NUP	30	2	0.033439871874976	4	0.044799661755946	13
MLP1	NUP100	NUP	30	3	0.026415555032166	4	0.043330049329604	13
MLP1	NUP100	NUP	60	1	0.06514711352815	4	0.106533203971921	13
MLP1	NUP100	NUP	60	2	0.085273001591565	4	0.112157883305785	13
MLP1	NUP100	NUP	60	3	0.077181447461557	4	0.10838338284099	13
MLP1	NUP100	NUP	90	1	0.169043011142003	4	0.199114646098077	13
MLP1	NUP100	NUP	90	2	0.167994120346762	3	0.199025272936427	12
MLP1	NUP100	NUP	90	3	0.165095686550282	4	0.195496509197832	13
MLP1	NUP116	NUP	120	1	0.29770030268321	4	0.343386527296876	17
MLP1	NUP116	NUP	120	2	0.313591789828356	4	0.351401878725198	17
MLP1	NUP116	NUP	120	3	0.307107731280932	4	0.354897179998167	17
MLP1	NUP116	NUP	150	1	0.417709930528026	4	0.432744569238641	17
MLP1	NUP116	NUP	150	2	0.430333147106377	4	0.447775534815315	17
MLP1	NUP116	NUP	150	3	0.418603208162391	4	0.43861836592571	17
MLP1	NUP116	NUP	30	1	0.028619284307715	4	0.067194034284664	17
MLP1	NUP116	NUP	30	2	0.030177485168445	4	0.06784694827198	17
MLP1	NUP116	NUP	30	3	0.029730351258589	4	0.062200621223609	17
MLP1	NUP116	NUP	60	1	0.098358430694354	4	0.150029548651361	17
MLP1	NUP116	NUP	60	2	0.103263189639422	4	0.155383693824713	17
MLP1	NUP116	NUP	60	3	0.096885582026474	4	0.148781955874294	17
MLP1	NUP116	NUP	90	1	0.195157634959844	4	0.254594368248613	17
MLP1	NUP116	NUP	90	2	0.199061575551948	4	0.246825614873987	16
MLP1	NUP116	NUP	90	3	0.193411559590923	4	0.250974647975003	17
MLP1	NUP120	NUP	120	1	0.222042491509194	2	0.262576822917243	15
MLP1	NUP120	NUP	120	2	0.248945254179901	2	0.268357890238709	15
MLP1	NUP120	NUP	120	3	0.221684268687238	2	0.269825605049197	15
MLP1	NUP120	NUP	150	1	0.328426340285892	2	0.354180883108836	15
MLP1	NUP120	NUP	150	2	0.351852864962015	2	0.370106479298229	15
MLP1	NUP120	NUP	150	3	0.325429416568664	2	0.361333976901955	15
MLP1	NUP120	NUP	30	1	0.017055906576988	2	0.03131099304252	15
MLP1	NUP120	NUP	30	2	0.021896810632273	2	0.033270740138211	15
MLP1	NUP120	NUP	30	3	0.022165756945879	2	0.034188418116083	15
MLP1	NUP120	NUP	60	1	0.050264566829986	2	0.090003723158987	15
MLP1	NUP120	NUP	60	2	0.067216788032581	2	0.09945123972874	15
MLP1	NUP120	NUP	60	3	0.059768954615714	2	0.092779803910941	15
MLP1	NUP120	NUP	90	1	0.160853424070942	2	0.174182621457543	15
MLP1	NUP120	NUP	90	2	0.162738300269005	2	0.178079497082759	15
MLP1	NUP120	NUP	90	3	0.131824025602383	2	0.173697575889261	15
MLP1	NUP133	NUP	120	1	0.162439982650412	4	0.200594123589383	31
MLP1	NUP133	NUP	120	2	0.166168446915822	4	0.203070750032293	31
MLP1	NUP133	NUP	120	3	0.169250354880824	4	0.20506802739122	31
MLP1	NUP133	NUP	150	1	0.256459379684783	4	0.289194247786262	31
MLP1	NUP133	NUP	150	2	0.270448222159809	4	0.302864184238803	31
MLP1	NUP133	NUP	150	3	0.264771234796068	4	0.296693559074816	31
MLP1	NUP133	NUP	30	1	0.003596320725655	4	0.016577735548634	31
MLP1	NUP133	NUP	30	2	0.007857407380396	4	0.017249126850544	31
MLP1	NUP133	NUP	30	3	0.006865139304621	4	0.019842631538688	31
MLP1	NUP133	NUP	60	1	0.027833078977021	4	0.053826973706389	31
MLP1	NUP133	NUP	60	2	0.034833216749047	4	0.059680693630145	31
MLP1	NUP133	NUP	60	3	0.034038595676462	4	0.060442400998174	31
MLP1	NUP133	NUP	90	1	0.089422437019466	3	0.121638015379198	31
MLP1	NUP133	NUP	90	2	0.089863580030339	3	0.119805334413944	30
MLP1	NUP133	NUP	90	3	0.088153010265115	4	0.12393773751599	31
MLP1	NUP145C	NUP	120	1	0.224446645364482	3	0.278613249995625	20
MLP1	NUP145C	NUP	120	2	0.235396145973062	3	0.282473995800518	19
MLP1	NUP145C	NUP	120	3	0.231014724705158	3	0.284104011412064	20
MLP1	NUP145C	NUP	150	1	0.329210447885146	3	0.367499370776539	19
MLP1	NUP145C	NUP	150	2	0.348583593195901	3	0.382974366531672	20
MLP1	NUP145C	NUP	150	3	0.332819163933608	3	0.377746854078671	20
MLP1	NUP145C	NUP	30	1	0.014911987368551	3	0.036987588989009	20
MLP1	NUP145C	NUP	30	2	0.009646532340378	3	0.039343197897813	20
MLP1	NUP145C	NUP	30	3	0.016077495726377	3	0.041098776247954	20
MLP1	NUP145C	NUP	60	1	0.052285610141209	3	0.099761586519764	20
MLP1	NUP145C	NUP	60	2	0.063344042080651	3	0.106632403553753	20
MLP1	NUP145C	NUP	60	3	0.055269075513925	3	0.103176062525758	20
MLP1	NUP145C	NUP	90	1	0.115052102378786	3	0.190561296711415	20
MLP1	NUP145C	NUP	90	2	0.126534767304565	3	0.189598872740682	20
MLP1	NUP145C	NUP	90	3	0.135636871641332	3	0.188871039317579	20
MLP1	NUP157	NUP	120	1	0.191833505026782	2	0.2235824015007	21
MLP1	NUP157	NUP	120	2	0.192519406826993	2	0.229160396831275	22
MLP1	NUP157	NUP	120	3	0.188233121227614	2	0.224860585494073	22
MLP1	NUP157	NUP	150	1	0.278811138918708	2	0.308767204874318	22
MLP1	NUP157	NUP	150	2	0.288663807366083	2	0.316653936150025	22
MLP1	NUP157	NUP	150	3	0.291214729788699	2	0.307623605066274	22
MLP1	NUP157	NUP	30	1	0.007279831021977	2	0.021902383076352	22
MLP1	NUP157	NUP	30	2	0.011485615298757	2	0.023266398831014	22
MLP1	NUP157	NUP	30	3	0.008582493939119	2	0.022953041013538	21
MLP1	NUP157	NUP	60	1	0.032756994279154	2	0.064068391359107	22
MLP1	NUP157	NUP	60	2	0.047634672808484	2	0.067587136470086	21
MLP1	NUP157	NUP	60	3	0.04534855019139	2	0.06799678485814	22
MLP1	NUP157	NUP	90	1	0.124785297070338	2	0.154026433274933	22
MLP1	NUP157	NUP	90	2	0.121694396654153	2	0.151057875099496	22
MLP1	NUP157	NUP	90	3	0.108194929197317	2	0.139942443194643	22
MLP1	NUP159	NUP	120	1	0.162858603781271	6	0.217403108989999	35
MLP1	NUP159	NUP	120	2	0.173656245754781	6	0.218538005385757	35
MLP1	NUP159	NUP	120	3	0.187463844082965	6	0.220194846124007	35
MLP1	NUP159	NUP	150	1	0.245587711934035	6	0.301004879211737	35
MLP1	NUP159	NUP	150	2	0.292142104951733	6	0.307078647176518	36
MLP1	NUP159	NUP	150	3	0.271751247828917	6	0.309584552162947	36
MLP1	NUP159	NUP	30	1	0.004726284549932	6	0.02279598280494	36
MLP1	NUP159	NUP	30	2	0.009344509004572	6	0.025564808644811	36
MLP1	NUP159	NUP	30	3	0.003160631152758	6	0.027359839363252	36
MLP1	NUP159	NUP	60	1	0.032326331830418	6	0.069918333618019	36
MLP1	NUP159	NUP	60	2	0.046807613847657	6	0.076279601141515	36
MLP1	NUP159	NUP	60	3	0.033043752508403	6	0.070371307222642	36
MLP1	NUP159	NUP	90	1	0.079634370247352	6	0.139688213783015	36
MLP1	NUP159	NUP	90	2	0.069757196818613	5	0.138165925849392	33
MLP1	NUP159	NUP	90	3	0.085874210792312	6	0.138995072050012	36
MLP1	NUP170	NUP	120	1	0.196504930084088	5	0.233305598146894	33
MLP1	NUP170	NUP	120	2	0.19755464373966	5	0.242284421055177	33
MLP1	NUP170	NUP	120	3	0.191129080572104	5	0.241661316346286	33
MLP1	NUP170	NUP	150	1	0.278699848802942	5	0.316248412316059	33
MLP1	NUP170	NUP	150	2	0.289534089544893	5	0.326831369822622	32
MLP1	NUP170	NUP	150	3	0.293037388002181	5	0.325345241134337	33
MLP1	NUP170	NUP	30	1	0.012910198120476	5	0.02959805411007	33
MLP1	NUP170	NUP	30	2	0.013887669348535	5	0.031143027641601	33
MLP1	NUP170	NUP	30	3	0.015201091186625	5	0.031688091838613	32
MLP1	NUP170	NUP	60	1	0.045711456954082	5	0.075627673284444	33
MLP1	NUP170	NUP	60	2	0.051546741990673	5	0.079009139157724	33
MLP1	NUP170	NUP	60	3	0.052484541880615	5	0.08142770812648	33
MLP1	NUP170	NUP	90	1	0.119476337867052	5	0.168060681260748	33
MLP1	NUP170	NUP	90	2	0.110035938074055	5	0.162360335852564	32
MLP1	NUP170	NUP	90	3	0.111433123773159	5	0.1565912813628	33
MLP1	NUP188	NUP	120	1	0.134845694019335	4	0.169198950847898	28
MLP1	NUP188	NUP	120	2	0.139823682270294	5	0.171677515449689	29
MLP1	NUP188	NUP	120	3	0.137000510167734	5	0.173983433604656	29
MLP1	NUP188	NUP	150	1	0.217776340461669	5	0.245817872068844	29
MLP1	NUP188	NUP	150	2	0.223450886183378	4	0.256685031402316	29
MLP1	NUP188	NUP	150	3	0.215733395773759	5	0.253471246119424	29
MLP1	NUP188	NUP	30	1	0.012812934631876	5	0.010821800354495	29
MLP1	NUP188	NUP	30	2	0.001295507319802	5	0.010528684080675	29
MLP1	NUP188	NUP	30	3	0.003279417030034	5	0.012058583337226	29
MLP1	NUP188	NUP	60	1	0.015885564640534	5	0.039282012841005	29
MLP1	NUP188	NUP	60	2	0.01904025714795	5	0.041709116586941	29
MLP1	NUP188	NUP	60	3	0.021973921373132	5	0.043261925402883	28
MLP1	NUP188	NUP	90	1	0.066192452855916	5	0.10610717415369	29
MLP1	NUP188	NUP	90	2	0.055207930604754	5	0.102199935421998	29
MLP1	NUP188	NUP	90	3	0.058745282932106	5	0.09786606096417	29
MLP1	NUP2	NUP	120	1	0.415864348163227	6	0.4206379137472	28
MLP1	NUP2	NUP	120	2	0.42808310444974	8	0.431900671775139	29
MLP1	NUP2	NUP	120	3	0.373726935891844	8	0.426401889939386	29
MLP1	NUP2	NUP	150	1	0.490050931511524	7	0.513616342783504	29
MLP1	NUP2	NUP	150	2	0.5607897631965	8	0.534038274653537	29
MLP1	NUP2	NUP	150	3	0.528491932226368	8	0.516195104381708	29
MLP1	NUP2	NUP	30	1	0.048240918997873	8	0.091420409266023	29
MLP1	NUP2	NUP	30	2	0.045589029836671	8	0.091805037893209	29
MLP1	NUP2	NUP	30	3	0.050137788106256	8	0.093436595134566	29
MLP1	NUP2	NUP	60	1	0.144865095202313	8	0.203213834759378	29
MLP1	NUP2	NUP	60	2	0.151275601433015	7	0.21584473372741	29
MLP1	NUP2	NUP	60	3	0.118239896198828	6	0.207550765078386	28
MLP1	NUP2	NUP	90	1	0.278332925240115	8	0.315857672614814	29
MLP1	NUP2	NUP	90	2	0.238396415449222	8	0.326097035827616	29
MLP1	NUP2	NUP	90	3	0.26685270361361	8	0.318946264501813	29
MLP1	NUP53	NUP	120	1	0.118971300414465	4	0.268367012356875	10
MLP1	NUP53	NUP	120	2	0.183309960121784	4	0.277652246077876	10
MLP1	NUP53	NUP	120	3	0.128193207263818	4	0.279346708298422	10
MLP1	NUP53	NUP	150	1	0.253386944397338	4	0.352532334553674	10
MLP1	NUP53	NUP	150	2	0.294857247845121	4	0.367463845826489	10
MLP1	NUP53	NUP	150	3	0.303992509422761	4	0.355767116590699	10
MLP1	NUP53	NUP	30	1	0.015915798218392	4	0.040948447919084	10
MLP1	NUP53	NUP	30	2	0.01508004697807	4	0.038879363297624	10
MLP1	NUP53	NUP	30	3	0.00888858254975	4	0.041854217713058	10
MLP1	NUP53	NUP	60	1	0.015106604797304	3	0.101145951426562	10
MLP1	NUP53	NUP	60	2	0.034275497500814	4	0.096763376122254	10
MLP1	NUP53	NUP	60	3	0.037903585239635	4	0.102985829947669	10
MLP1	NUP53	NUP	90	1	0.04511373343974	2	0.195401965991856	10
MLP1	NUP53	NUP	90	2	0.167736502423897	2	0.190374706095945	10
MLP1	NUP53	NUP	90	3	0.079381958117243	4	0.185671228408239	10
MLP1	NUP60	NUP	120	1	0.395785688074212	8	0.41067216090718	17
MLP1	NUP60	NUP	120	2	0.409165825351043	8	0.424996393180874	17
MLP1	NUP60	NUP	120	3	0.396584640616016	8	0.420364716381067	17
MLP1	NUP60	NUP	150	1	0.521408938104821	8	0.507211655700464	17
MLP1	NUP60	NUP	150	2	0.547853256788735	8	0.53546078127936	17
MLP1	NUP60	NUP	150	3	0.529220517936381	8	0.518005483775826	17
MLP1	NUP60	NUP	30	1	0.029315291836779	8	0.071768246049701	17
MLP1	NUP60	NUP	30	2	0.035947752136333	8	0.075317183935701	17
MLP1	NUP60	NUP	30	3	0.03511741491003	8	0.073684480417547	17
MLP1	NUP60	NUP	60	1	0.131368525018652	8	0.182711060540959	17
MLP1	NUP60	NUP	60	2	0.146451673818396	8	0.199589313464455	17
MLP1	NUP60	NUP	60	3	0.140292615486224	8	0.190703941551636	17
MLP1	NUP60	NUP	90	1	0.252004389848354	8	0.299719895991232	17
MLP1	NUP60	NUP	90	2	0.248583885226844	7	0.305522765210524	15
MLP1	NUP60	NUP	90	3	0.269498075367652	8	0.312774279256418	17
MLP1	NUP82	NUP	120	1	0.184647663392273	2	0.23543758825431	13
MLP1	NUP82	NUP	120	2	0.194672248329088	2	0.234418796865583	13
MLP1	NUP82	NUP	120	3	0.207349529487339	2	0.235273233358995	13
MLP1	NUP82	NUP	150	1	0.30942381854432	2	0.31941415850949	13
MLP1	NUP82	NUP	150	2	0.308319503527737	2	0.323045887994375	13
MLP1	NUP82	NUP	150	3	0.30185150424396	2	0.324272807324327	13
MLP1	NUP82	NUP	30	1	0.016867546561741	2	0.030185612700772	13
MLP1	NUP82	NUP	30	2	0.019240384268202	2	0.033881147194427	13
MLP1	NUP82	NUP	30	3	0.024941185561232	2	0.033840141510535	13
MLP1	NUP82	NUP	60	1	0.058242801165393	2	0.085776943262409	13
MLP1	NUP82	NUP	60	2	0.059026776404618	2	0.09047189647766	13
MLP1	NUP82	NUP	60	3	0.053331199919077	2	0.083443246880745	13
MLP1	NUP82	NUP	90	1	0.115413205667303	2	0.151493521582497	13
MLP1	NUP82	NUP	90	2	0.127845365674394	2	0.148535328407126	13
MLP1	NUP82	NUP	90	3	0.121956341481903	2	0.150837023282202	13
MLP1	PDC1	other	120	1	0.375963600113146	3	0.412036929196162	10
MLP1	PDC1	other	120	2	0.401509558278367	3	0.449633739465434	10
MLP1	PDC1	other	120	3	0.429620154534374	3	0.457206557922298	10
MLP1	PDC1	other	150	1	0.481473962313161	3	0.509649881332193	10
MLP1	PDC1	other	150	2	0.542566390582572	3	0.554207402626477	10
MLP1	PDC1	other	150	3	0.507260474465799	3	0.50745934636634	9
MLP1	PDC1	other	30	1	0.043177023020321	3	0.08686473773764	10
MLP1	PDC1	other	30	2	0.045803329556906	3	0.101224439353513	10
MLP1	PDC1	other	30	3	0.044534897287647	3	0.089075829929323	10
MLP1	PDC1	other	60	1	0.113434940587878	3	0.182690582980194	10
MLP1	PDC1	other	60	2	0.152602088377957	3	0.227106508648602	10
MLP1	PDC1	other	60	3	0.120826770437553	3	0.186797780627806	10
MLP1	PDC1	other	90	1	0.239046803888656	3	0.296134024466629	10
MLP1	PDC1	other	90	2	0.279121763093147	3	0.336810453464097	10
MLP1	PDC1	other	90	3	0.290307692001637	3	0.329988276562017	10
MLP1	POB3	other	120	1	0.42040255116165	2	0.414583820095307	12
MLP1	POB3	other	120	2	0.420008343981538	2	0.419824204165542	12
MLP1	POB3	other	120	3	0.392435523586024	2	0.414433004265018	12
MLP1	POB3	other	150	1	0.52964604184027	2	0.508695171530031	12
MLP1	POB3	other	150	2	0.54890683410229	2	0.527806127122236	12
MLP1	POB3	other	150	3	0.504639676554516	2	0.513308612470267	12
MLP1	POB3	other	30	1	0.062190661244675	2	0.089547875204049	12
MLP1	POB3	other	30	2	0.065243306513399	2	0.085021631335813	12
MLP1	POB3	other	30	3	0.111562841286824	2	0.095751026586784	12
MLP1	POB3	other	60	1	0.148708242140159	2	0.200838418775198	12
MLP1	POB3	other	60	2	0.150073833367256	2	0.212700462292352	12
MLP1	POB3	other	60	3	0.200900132736267	2	0.206871055961216	12
MLP1	POB3	other	90	1	0.268494192466768	2	0.302767177336437	12
MLP1	POB3	other	90	2	0.272832886642627	2	0.305414664296789	11
MLP1	POB3	other	90	3	0.305351653156511	2	0.310788125721796	12
MLP1	POM152	NUP	120	1	0.164002054947154	6	0.215522273155867	25
MLP1	POM152	NUP	120	2	0.162032436778372	6	0.220560628677885	25
MLP1	POM152	NUP	120	3	0.159976111477828	6	0.218321790887947	25
MLP1	POM152	NUP	150	1	0.25022790531529	6	0.297215610583515	25
MLP1	POM152	NUP	150	2	0.255935908541714	6	0.311877171902835	25
MLP1	POM152	NUP	150	3	0.255724213993854	6	0.302334933702197	25
MLP1	POM152	NUP	30	1	0.003648181170127	6	0.018607098203306	25
MLP1	POM152	NUP	30	2	0.005458075210652	6	0.019822213043308	25
MLP1	POM152	NUP	30	3	0.008243567310059	6	0.019586446859333	25
MLP1	POM152	NUP	60	1	0.025100039451622	5	0.059313426280381	24
MLP1	POM152	NUP	60	2	0.029173010651725	6	0.06235905046524	25
MLP1	POM152	NUP	60	3	0.027648505864345	6	0.061932325491466	25
MLP1	POM152	NUP	90	1	0.092301183502924	6	0.145713631100027	25
MLP1	POM152	NUP	90	2	0.088736127125398	6	0.141105469493787	25
MLP1	POM152	NUP	90	3	0.081112700666397	6	0.131259554957376	25
MLP1	RPA190	other	120	1	0.43989464277374	5	0.447021371982552	29
MLP1	RPA190	other	120	2	0.477739369674616	5	0.447613614532392	29
MLP1	RPA190	other	120	3	0.449670021367774	4	0.452804758281589	29
MLP1	RPA190	other	150	1	0.538621734189557	5	0.519960986549982	29
MLP1	RPA190	other	150	2	0.572904647254396	4	0.54028082318312	29
MLP1	RPA190	other	150	3	0.563242523000578	5	0.528774957408828	29
MLP1	RPA190	other	30	1	0.035897614351381	5	0.094338944897427	29
MLP1	RPA190	other	30	2	0.052479920114761	5	0.102576194014526	29
MLP1	RPA190	other	30	3	0.06768605830027	5	0.112838327498437	29
MLP1	RPA190	other	60	1	0.052235818999179	3	0.209302212460409	29
MLP1	RPA190	other	60	2	0.155470991902897	5	0.228434895257841	29
MLP1	RPA190	other	60	3	0.171763337652132	5	0.227982863223527	29
MLP1	RPA190	other	90	1	0.32145198250257	5	0.33803571177497	29
MLP1	RPA190	other	90	2	0.305698578461633	5	0.339276883513532	29
MLP1	RPA190	other	90	3	0.313375541749624	5	0.352766662116551	29
MLP1	RPA43	other	120	1	0.393256969870241	2	0.407964491768525	6
MLP1	RPA43	other	120	2	0.412618870169885	2	0.406332902260417	6
MLP1	RPA43	other	120	3	0.421940232584074	2	0.410979651144353	6
MLP1	RPA43	other	150	1	0.488847439607279	2	0.475959544489865	6
MLP1	RPA43	other	150	2	0.521958546257554	2	0.499626377848854	6
MLP1	RPA43	other	150	3	0.513514299861075	2	0.481468653423752	6
MLP1	RPA43	other	30	1	0.025270978093432	2	0.07120110289567	6
MLP1	RPA43	other	30	2	0.034729888723008	2	0.074156299164866	6
MLP1	RPA43	other	30	3	0.021352022913835	1	0.084888484062057	6
MLP1	RPA43	other	60	1	0.089942303490932	2	0.173575051262218	6
MLP1	RPA43	other	60	2	0.136786040374264	2	0.190152589769343	6
MLP1	RPA43	other	60	3	0.134360927071082	2	0.194650163294976	6
MLP1	RPA43	other	90	1	0.268806494017926	2	0.293872356253379	6
MLP1	RPA43	other	90	2	0.266112061954943	2	0.297902676109205	6
MLP1	RPA43	other	90	3	0.274004484946061	2	0.308208026715665	6
MLP1	RPC53	other	120	1	0.252575422684344	2	0.363426744541551	5
MLP1	RPC53	other	120	2	0.282051289041187	2	0.384846697832634	5
MLP1	RPC53	other	120	3	0.329962370979249	2	0.378900322029307	5
MLP1	RPC53	other	150	1	0.421066371402905	2	0.462082772467487	5
MLP1	RPC53	other	150	2	0.415272303327882	2	0.481526067710286	4
MLP1	RPC53	other	150	3	0.426366349662753	2	0.487729683706798	5
MLP1	RPC53	other	30	1	0.001209978583546	2	0.052813576128445	5
MLP1	RPC53	other	30	2	0.003355421259273	2	0.061084222424145	5
MLP1	RPC53	other	30	3	0.038361365930888	2	0.093886375901937	5
MLP1	RPC53	other	60	1	0.039329763525377	2	0.135437973842598	5
MLP1	RPC53	other	60	2	0.079685623742158	2	0.169430331342423	5
MLP1	RPC53	other	60	3	0.070591572602623	2	0.175292507188494	5
MLP1	RPC53	other	90	1	0.158190577177488	2	0.262091173148377	5
MLP1	RPC53	other	90	2	0.171467952348875	2	0.272213551709531	5
MLP1	RPC53	other	90	3	0.164117992714646	2	0.284245371436025	5
MLP1	RPC82	other	120	1	0.356423975681537	3	0.402706460010159	8
MLP1	RPC82	other	120	2	0.400934760860399	3	0.41828309520301	8
MLP1	RPC82	other	120	3	0.391986361224688	3	0.419428088548829	8
MLP1	RPC82	other	150	1	0.495429245317581	3	0.485896581636094	8
MLP1	RPC82	other	150	2	0.523453351914727	3	0.513922709197786	8
MLP1	RPC82	other	150	3	0.469617589919136	3	0.501748721545772	8
MLP1	RPC82	other	30	1	0.007245403578853	2	0.075351153592534	8
MLP1	RPC82	other	30	2	0.008056946009452	3	0.084807507573797	8
MLP1	RPC82	other	30	3	8.94500629349067E-05	3	0.086242263281341	8
MLP1	RPC82	other	60	1	0.042177298785015	3	0.170780290928419	8
MLP1	RPC82	other	60	2	0.071735773077365	2	0.198426013891183	8
MLP1	RPC82	other	60	3	0.042262603230229	3	0.194884537707806	8
MLP1	RPC82	other	90	1	0.231845889881122	3	0.293234288077654	8
MLP1	RPC82	other	90	2	0.25289929502284	3	0.305466406957288	8
MLP1	RPC82	other	90	3	0.282130572979664	3	0.313146001941008	8
MLP1	RPL10	other	120	1	0.361666202313307	2	0.478538693285386	4
MLP1	RPL10	other	120	2	0.392633776346661	2	0.497695139547172	4
MLP1	RPL10	other	120	3	0.369670236765709	2	0.484527081732228	4
MLP1	RPL10	other	150	1	0.48106648262832	2	0.552065301323525	4
MLP1	RPL10	other	150	2	0.506232425775479	2	0.605783807696048	4
MLP1	RPL10	other	150	3	0.491324567425523	2	0.580824290007084	4
MLP1	RPL10	other	30	1	0.036293608546149	2	0.091416204294009	4
MLP1	RPL10	other	30	2	0.042556983737451	2	0.106344415112652	4
MLP1	RPL10	other	30	3	0.042610339521628	2	0.093440407153406	4
MLP1	RPL10	other	60	1	0.121607122737079	2	0.204709127962322	4
MLP1	RPL10	other	60	2	0.156315644266688	2	0.258798843509581	4
MLP1	RPL10	other	60	3	0.116534809626995	2	0.220967359250934	4
MLP1	RPL10	other	90	1	0.229963513003838	2	0.360879519188369	4
MLP1	RPL10	other	90	2	0.255733668902036	2	0.387161857903946	4
MLP1	RPL10	other	90	3	0.248320869611531	2	0.371376885386061	4
MLP1	RPO21	other	120	1	0.353866154384535	2	0.392894988058821	14
MLP1	RPO21	other	120	2	0.381061174879147	2	0.391102366523648	14
MLP1	RPO21	other	120	3	0.371765088587201	2	0.391152053301547	14
MLP1	RPO21	other	150	1	0.539517053241114	2	0.483065810162822	13
MLP1	RPO21	other	150	2	0.488761800530042	2	0.508767270447638	13
MLP1	RPO21	other	150	3	0.524322787741016	2	0.494196051365472	14
MLP1	RPO21	other	30	1	9.41234798253346E-05	2	0.055436419214307	14
MLP1	RPO21	other	30	2	0.000288377944897	2	0.054880288501057	13
MLP1	RPO21	other	30	3	7.5245872077715E-05	2	0.070740203441463	14
MLP1	RPO21	other	60	1	0.039403107167234	2	0.164137518026029	14
MLP1	RPO21	other	60	2	0.090119421893209	2	0.175473586259266	13
MLP1	RPO21	other	60	3	0.000110194642934	2	0.169918947071562	14
MLP1	RPO21	other	90	1	0.229096290695842	2	0.273016496829417	14
MLP1	RPO21	other	90	2	0.217094226422903	2	0.271796349935404	14
MLP1	RPO21	other	90	3	0.179995780470061	2	0.281369861546764	14
MLP1	RRP5	other	120	1	0.418780792158608	5	0.445532681616724	39
MLP1	RRP5	other	120	2	0.429815695635335	5	0.445386470926172	39
MLP1	RRP5	other	120	3	0.453113336336161	5	0.457758425600029	39
MLP1	RRP5	other	150	1	0.512573369920839	5	0.516387025585793	39
MLP1	RRP5	other	150	2	0.535220791901425	5	0.530802269884668	39
MLP1	RRP5	other	150	3	0.530970363600855	5	0.524865879341654	39
MLP1	RRP5	other	30	1	0.04874692836057	5	0.110476593898068	39
MLP1	RRP5	other	30	2	0.060006384857559	5	0.117490371250899	39
MLP1	RRP5	other	30	3	0.041343440866453	5	0.124798461530167	37
MLP1	RRP5	other	60	1	0.137385189627189	4	0.224486098821094	39
MLP1	RRP5	other	60	2	0.170564302574991	5	0.237063072551593	39
MLP1	RRP5	other	60	3	0.164459628948917	5	0.2394158785073	39
MLP1	RRP5	other	90	1	0.305036453717305	5	0.348797071353211	38
MLP1	RRP5	other	90	2	0.313295769274714	5	0.344239848115988	39
MLP1	RRP5	other	90	3	0.326983904143867	5	0.363931026449572	39
MLP1	RRP8	other	120	1	0.40594987242894	2	0.459664257637896	5
MLP1	RRP8	other	120	2	0.424350622872675	2	0.461214426590843	5
MLP1	RRP8	other	120	3	0.441989858729151	2	0.468224622412166	5
MLP1	RRP8	other	150	1	0.505905966073718	2	0.52219286453662	5
MLP1	RRP8	other	150	2	0.511120894833764	1	0.532289800792987	5
MLP1	RRP8	other	150	3	0.514667197902358	2	0.537349061687364	5
MLP1	RRP8	other	30	1	0.040982118786245	2	0.102135989905606	5
MLP1	RRP8	other	30	2	0.043852368791283	2	0.121997571017871	5
MLP1	RRP8	other	30	3	0.052036010248592	2	0.131346655316842	5
MLP1	RRP8	other	60	1	0.135985523592854	2	0.191378422738418	5
MLP1	RRP8	other	60	2	0.145617201998335	2	0.224897356315013	5
MLP1	RRP8	other	60	3	0.06872876614017	2	0.22241868196432	5
MLP1	RRP8	other	90	1	0.301717783364068	2	0.352622296307655	5
MLP1	RRP8	other	90	2	0.323541227560774	2	0.367097152830319	4
MLP1	RRP8	other	90	3	0.319987387201081	2	0.376294401460971	5
MLP1	RSC4	other	120	1	0.342357506523865	3	0.376947504573867	15
MLP1	RSC4	other	120	2	0.318878080581725	3	0.381844420073582	15
MLP1	RSC4	other	120	3	0.317659803013453	3	0.373723978403185	15
MLP1	RSC4	other	150	1	0.457614747688671	3	0.470609292750305	15
MLP1	RSC4	other	150	2	0.47756374610519	3	0.496304275296425	15
MLP1	RSC4	other	150	3	0.474415613972738	3	0.473530162688931	15
MLP1	RSC4	other	30	1	5.28139367507425E-05	3	0.050466360222871	15
MLP1	RSC4	other	30	2	0.011242006404307	3	0.055205251505092	15
MLP1	RSC4	other	30	3	0.010351004245075	3	0.047199546032276	15
MLP1	RSC4	other	60	1	0.055417707207944	3	0.153243353931818	15
MLP1	RSC4	other	60	2	0.070786910983443	3	0.158057472320356	15
MLP1	RSC4	other	60	3	0.055774040461216	3	0.147337920004757	15
MLP1	RSC4	other	90	1	0.199950024114734	3	0.258196871778565	15
MLP1	RSC4	other	90	2	0.142866919963241	3	0.27468895698201	15
MLP1	RSC4	other	90	3	0.183445433893996	3	0.262031803423194	15
MLP1	RSC8	other	120	1	0.301319038096712	3	0.338078633572548	11
MLP1	RSC8	other	120	2	0.330929168944359	3	0.347140756047033	11
MLP1	RSC8	other	120	3	0.34060001803686	3	0.351108072055446	11
MLP1	RSC8	other	150	1	0.461291818231731	3	0.438855593107547	11
MLP1	RSC8	other	150	2	0.482904127555025	3	0.462444485602153	11
MLP1	RSC8	other	150	3	0.460875538257067	3	0.453896587617198	11
MLP1	RSC8	other	30	1	0.007920424987787	3	0.039005009848929	11
MLP1	RSC8	other	30	2	0.016446755243239	3	0.03775132686164	11
MLP1	RSC8	other	30	3	0.009958405730095	3	0.044981484050576	11
MLP1	RSC8	other	60	1	0.056374193478714	3	0.127689343057668	11
MLP1	RSC8	other	60	2	0.085884708118434	3	0.135569688739652	11
MLP1	RSC8	other	60	3	0.041526163666614	3	0.134714665455359	11
MLP1	RSC8	other	90	1	0.183960887916302	3	0.229182047595707	11
MLP1	RSC8	other	90	2	0.205472576925982	3	0.231893015514765	11
MLP1	RSC8	other	90	3	0.184194110474759	3	0.244083215231229	11
MLP1	SAC3	NTR-like	120	1	0.426575720048347	4	0.423585861415568	26
MLP1	SAC3	NTR-like	120	2	0.441686288068307	4	0.427117389592554	26
MLP1	SAC3	NTR-like	120	3	0.425338057801592	4	0.425554263883176	26
MLP1	SAC3	NTR-like	150	1	0.554089041103022	4	0.525526765299325	26
MLP1	SAC3	NTR-like	150	2	0.564735097093247	4	0.537636618642667	26
MLP1	SAC3	NTR-like	150	3	0.559327080105405	4	0.530955195655628	26
MLP1	SAC3	NTR-like	30	1	0.042544517678367	4	0.086442600387477	26
MLP1	SAC3	NTR-like	30	2	0.048636457647986	4	0.085595509133324	26
MLP1	SAC3	NTR-like	30	3	0.050648805157546	4	0.089158614661838	26
MLP1	SAC3	NTR-like	60	1	0.143386145041772	4	0.198005508150006	26
MLP1	SAC3	NTR-like	60	2	0.169814718024185	4	0.213734160738044	26
MLP1	SAC3	NTR-like	60	3	0.158920462581108	4	0.206461557120291	26
MLP1	SAC3	NTR-like	90	1	0.260972715434135	4	0.314867256502212	26
MLP1	SAC3	NTR-like	90	2	0.295774148391097	4	0.314973217608764	25
MLP1	SAC3	NTR-like	90	3	0.296119130637757	4	0.322978807751707	26
MLP1	SCP160	other	120	1	0.411147563341844	2	0.433727429382119	15
MLP1	SCP160	other	120	2	0.436533036354504	2	0.435155446139022	14
MLP1	SCP160	other	120	3	0.418016022129202	2	0.419279459876552	15
MLP1	SCP160	other	150	1	0.537815118701069	2	0.515696864965266	14
MLP1	SCP160	other	150	2	0.563359199195873	2	0.535664405230803	15
MLP1	SCP160	other	150	3	0.536236337879396	2	0.513952618647432	15
MLP1	SCP160	other	30	1	0.059961152895518	2	0.080104556356684	15
MLP1	SCP160	other	30	2	0.065593198201837	2	0.078755117604233	15
MLP1	SCP160	other	30	3	0.061830338835408	2	0.087314341567804	15
MLP1	SCP160	other	60	1	0.159798961540747	2	0.188365820075714	14
MLP1	SCP160	other	60	2	0.198787411744989	2	0.213872925126996	15
MLP1	SCP160	other	60	3	0.158273898314969	2	0.197127672013726	15
MLP1	SCP160	other	90	1	0.284291336056372	2	0.309415607079912	15
MLP1	SCP160	other	90	2	0.297191261377083	2	0.325151533910491	13
MLP1	SCP160	other	90	3	0.269054289180052	2	0.320157416668659	15
MLP1	SPC110	other	120	1	0.374889346585277	5	0.408050593125931	20
MLP1	SPC110	other	120	2	0.40903018555165	5	0.431597917629044	20
MLP1	SPC110	other	120	3	0.392429176525574	6	0.429286422705401	20
MLP1	SPC110	other	150	1	0.542142898471806	6	0.52275742403219	20
MLP1	SPC110	other	150	2	0.599866635440745	3	0.545741080163955	20
MLP1	SPC110	other	150	3	0.520497230865646	6	0.537590872868677	20
MLP1	SPC110	other	30	1	0.017128266141767	3	0.067452051343803	20
MLP1	SPC110	other	30	2	0.013524767013766	6	0.067985228956018	20
MLP1	SPC110	other	30	3	0.01251239883823	5	0.072895571100733	20
MLP1	SPC110	other	60	1	0.11197666422164	5	0.186428044314402	20
MLP1	SPC110	other	60	2	0.132789479222625	6	0.203906785296452	20
MLP1	SPC110	other	60	3	0.106843435391552	6	0.193281604216789	20
MLP1	SPC110	other	90	1	0.256823202266841	4	0.295842891865073	19
MLP1	SPC110	other	90	2	0.22940431331201	6	0.307126773165052	18
MLP1	SPC110	other	90	3	0.233533440247417	6	0.303841998550209	20
MLP1	SPT16	other	120	1	0.314607286025719	7	0.353884007174078	19
MLP1	SPT16	other	120	2	0.337593822298166	7	0.353459488493767	19
MLP1	SPT16	other	120	3	0.327303995318023	7	0.350961333225125	19
MLP1	SPT16	other	150	1	0.4496185165939	7	0.450774930111273	19
MLP1	SPT16	other	150	2	0.476727827195595	7	0.470479447164672	19
MLP1	SPT16	other	150	3	0.452162012826554	7	0.455244603234584	19
MLP1	SPT16	other	30	1	0.021327639667011	7	0.046488927199898	19
MLP1	SPT16	other	30	2	0.024324612910175	7	0.0465042822192	19
MLP1	SPT16	other	30	3	0.028870119232279	7	0.056660570137373	19
MLP1	SPT16	other	60	1	0.086885154116458	7	0.148713735682272	19
MLP1	SPT16	other	60	2	0.106630594063359	7	0.152362117502081	19
MLP1	SPT16	other	60	3	0.103063493765653	7	0.151394516717021	19
MLP1	SPT16	other	90	1	0.186324216971361	7	0.233659869697145	19
MLP1	SPT16	other	90	2	0.190969365053386	7	0.235063674378126	19
MLP1	SPT16	other	90	3	0.201402440958381	7	0.248255228497452	19
MLP1	SPT6	other	120	1	0.425209819106842	3	0.429013677139901	21
MLP1	SPT6	other	120	2	0.423520520021096	3	0.42845293593148	21
MLP1	SPT6	other	120	3	0.420233000501415	3	0.4314173300451	21
MLP1	SPT6	other	150	1	0.53933334825416	3	0.517315068294298	21
MLP1	SPT6	other	150	2	0.563325386078404	3	0.532967993773864	21
MLP1	SPT6	other	150	3	0.533168126698384	3	0.522629913136713	21
MLP1	SPT6	other	30	1	0.034184756295844	3	0.100677272396442	21
MLP1	SPT6	other	30	2	0.03332060766031	3	0.097764947038816	21
MLP1	SPT6	other	30	3	0.020157880096873	3	0.105010983555301	19
MLP1	SPT6	other	60	1	0.119627492377253	3	0.214547577112786	21
MLP1	SPT6	other	60	2	0.165182909987251	3	0.219965732599304	21
MLP1	SPT6	other	60	3	0.129416920085338	3	0.219080219529412	21
MLP1	SPT6	other	90	1	0.281759316791413	3	0.322253536738291	21
MLP1	SPT6	other	90	2	0.289241989108808	3	0.31796761554284	21
MLP1	SPT6	other	90	3	0.281885028090686	3	0.325074177289446	21
MLP1	STH1	other	120	1	0.365323504164757	3	0.410872535289936	14
MLP1	STH1	other	120	2	0.369254484123759	3	0.416511693846568	15
MLP1	STH1	other	120	3	0.377715489322708	3	0.411916777666895	15
MLP1	STH1	other	150	1	0.518217460492088	3	0.506450647057137	15
MLP1	STH1	other	150	2	0.524294093103487	3	0.527190145314534	14
MLP1	STH1	other	150	3	0.506102905137412	3	0.511849838433541	15
MLP1	STH1	other	30	1	0.009988250602654	3	0.07975796565466	15
MLP1	STH1	other	30	2	0.019319481617023	3	0.079766740723074	15
MLP1	STH1	other	30	3	0.009017673630323	2	0.077101825236159	15
MLP1	STH1	other	60	1	0.037916834863053	3	0.194763541979217	14
MLP1	STH1	other	60	2	0.061154033479099	3	0.195659690400443	15
MLP1	STH1	other	60	3	0.084523262100917	3	0.180805610736402	15
MLP1	STH1	other	90	1	0.208930171657826	3	0.294002812883594	15
MLP1	STH1	other	90	2	0.253447308935662	3	0.306392110285881	15
MLP1	STH1	other	90	3	0.23078160973559	3	0.301657959690297	15
MLP1	SUB2	other	120	1	0.406879768081385	2	0.395033535622927	9
MLP1	SUB2	other	120	2	0.443181933251912	2	0.407304233978096	9
MLP1	SUB2	other	120	3	0.426860518799352	2	0.402709278620034	9
MLP1	SUB2	other	150	1	0.541896247595858	2	0.487403619170611	9
MLP1	SUB2	other	150	2	0.565916405899837	2	0.509439790251076	9
MLP1	SUB2	other	150	3	0.542178389130441	2	0.496222018466291	8
MLP1	SUB2	other	30	1	0.032649516691532	2	0.084464301704255	9
MLP1	SUB2	other	30	2	0.050683443210053	2	0.083239825797092	9
MLP1	SUB2	other	30	3	0.046852900762533	2	0.083149972686509	9
MLP1	SUB2	other	60	1	0.144724893690098	2	0.17960342950426	7
MLP1	SUB2	other	60	2	0.172756813475564	2	0.193720829803277	9
MLP1	SUB2	other	60	3	0.176941277106682	2	0.194160733212857	9
MLP1	SUB2	other	90	1	0.298744982679527	2	0.292137925731655	9
MLP1	SUB2	other	90	2	0.301960201143701	2	0.299954263750084	9
MLP1	SUB2	other	90	3	0.297336540494747	2	0.301514841477965	9
MLP1	SWI3	other	120	1	0.273599721280919	3	0.376369299157986	10
MLP1	SWI3	other	120	2	0.359633552744183	3	0.389005131798419	10
MLP1	SWI3	other	120	3	0.408492753862688	3	0.394647638054768	10
MLP1	SWI3	other	150	1	0.418670623762922	3	0.471399605254222	10
MLP1	SWI3	other	150	2	0.497584983367312	3	0.50065732630626	10
MLP1	SWI3	other	150	3	0.626302473357158	3	0.495124401807164	10
MLP1	SWI3	other	30	1	0.000123778280506	3	0.035315938934175	10
MLP1	SWI3	other	30	2	9.17899584095787E-05	3	0.042198525812046	10
MLP1	SWI3	other	30	3	0.000181111827541	2	0.043422932154707	8
MLP1	SWI3	other	60	1	0.00023793325888	2	0.141301975784569	9
MLP1	SWI3	other	60	2	0.000277222699155	3	0.136427894915847	10
MLP1	SWI3	other	60	3	0.000274650460772	3	0.141702973657823	10
MLP1	SWI3	other	90	1	0.264924672622196	3	0.260379176241778	10
MLP1	SWI3	other	90	2	0.2001407343586	3	0.273601725624663	10
MLP1	SWI3	other	90	3	0.1911844046212	3	0.272184714363583	10
MLP1	TEF4	other	120	1	0.419847936757909	2	0.437608383626045	5
MLP1	TEF4	other	120	2	0.415862349034128	2	0.447620177572318	5
MLP1	TEF4	other	120	3	0.40515166131535	2	0.440403800912337	5
MLP1	TEF4	other	150	1	0.507858380205651	2	0.522624651528302	5
MLP1	TEF4	other	150	2	0.561124742125333	2	0.545819850617337	5
MLP1	TEF4	other	150	3	0.510332340214095	2	0.521368207117059	5
MLP1	TEF4	other	30	1	0.028622199395708	2	0.092035812434744	5
MLP1	TEF4	other	30	2	0.037261852118546	2	0.103702148514294	5
MLP1	TEF4	other	30	3	0.03189479636875	2	0.095446215459331	5
MLP1	TEF4	other	60	1	0.141969678043527	2	0.211414303391658	4
MLP1	TEF4	other	60	2	0.154639166934647	2	0.239674171851671	5
MLP1	TEF4	other	60	3	0.143220783476755	2	0.215101197915071	5
MLP1	TEF4	other	90	1	0.278511624751993	2	0.330342053010098	5
MLP1	TEF4	other	90	2	0.287806813791718	2	0.336943440781676	5
MLP1	TEF4	other	90	3	0.276335047293258	2	0.336311322605863	5
MLP1	TOP2	other	120	1	0.419697083832154	5	0.422272534580184	22
MLP1	TOP2	other	120	2	0.446413523779847	5	0.43989251869376	22
MLP1	TOP2	other	120	3	0.442654797974014	5	0.44023955738358	22
MLP1	TOP2	other	150	1	0.556374928420504	5	0.52295968600692	22
MLP1	TOP2	other	150	2	0.581727592963828	5	0.550095496003987	22
MLP1	TOP2	other	150	3	0.575217955271113	5	0.533658835441892	22
MLP1	TOP2	other	30	1	0.025991046005328	5	0.073527714421228	21
MLP1	TOP2	other	30	2	0.030075389177342	5	0.07722363193594	22
MLP1	TOP2	other	30	3	0.029990594654711	5	0.077168496074771	22
MLP1	TOP2	other	60	1	0.081983061811417	5	0.18966636788719	19
MLP1	TOP2	other	60	2	0.150226778318338	5	0.214187394762137	21
MLP1	TOP2	other	60	3	0.126320816549287	5	0.203558573448208	22
MLP1	TOP2	other	90	1	0.270164808363342	5	0.3071072129351	22
MLP1	TOP2	other	90	2	0.302873165888997	5	0.325792770853084	21
MLP1	TOP2	other	90	3	0.2727532337845	5	0.316947510790652	22
MLP1	URB1	other	120	1	0.291620508404432	2	0.342570307306888	20
MLP1	URB1	other	120	2	0.272601944489777	2	0.335211107488061	20
MLP1	URB1	other	120	3	0.295425662443232	2	0.340702843975753	20
MLP1	URB1	other	150	1	0.383273177286794	2	0.416340414931862	20
MLP1	URB1	other	150	2	0.405955546718236	2	0.431467095501321	20
MLP1	URB1	other	150	3	0.375859867664527	2	0.417700875140501	19
MLP1	URB1	other	30	1	0.00555692451327	2	0.042202938525187	20
MLP1	URB1	other	30	2	0.008394018491962	2	0.047919588644217	20
MLP1	URB1	other	30	3	0.023342806834238	2	0.063188992569163	20
MLP1	URB1	other	60	1	0.039612332084249	2	0.121547993923139	19
MLP1	URB1	other	60	2	0.067455500543431	2	0.153175334264932	20
MLP1	URB1	other	60	3	0.062634897227952	2	0.149372685141063	20
MLP1	URB1	other	90	1	0.162900105242479	2	0.233466760504006	20
MLP1	URB1	other	90	2	0.172977084101708	2	0.231888096724146	20
MLP1	URB1	other	90	3	0.180329186485951	2	0.25434393596196	20
MLP1	UTP22	NTR-like	120	1	0.413202455017629	4	0.428990752056236	23
MLP1	UTP22	NTR-like	120	2	0.429246433284678	4	0.437482965053083	23
MLP1	UTP22	NTR-like	120	3	0.443333669735508	4	0.433001499758875	23
MLP1	UTP22	NTR-like	150	1	0.538910311684617	4	0.514799360912491	23
MLP1	UTP22	NTR-like	150	2	0.558094007493414	4	0.537132978171259	23
MLP1	UTP22	NTR-like	150	3	0.554216321553544	4	0.517500116855728	23
MLP1	UTP22	NTR-like	30	1	0.027027169786694	4	0.093423383130792	23
MLP1	UTP22	NTR-like	30	2	0.029273051986389	4	0.101988913333675	23
MLP1	UTP22	NTR-like	30	3	0.024545784725494	4	0.105727214603421	22
MLP1	UTP22	NTR-like	60	1	0.116736741634843	4	0.200673322705551	23
MLP1	UTP22	NTR-like	60	2	0.14088845127815	4	0.221206237446073	23
MLP1	UTP22	NTR-like	60	3	0.140352202480959	4	0.213399398470751	23
MLP1	UTP22	NTR-like	90	1	0.278925455922492	4	0.321523149836246	23
MLP1	UTP22	NTR-like	90	2	0.312515248425919	4	0.328653784210344	23
MLP1	UTP22	NTR-like	90	3	0.309312844184765	4	0.332248344875446	23
MLP1	YRA1	other	120	1	0.432046055567551	3	0.407048078972007	8
MLP1	YRA1	other	120	2	0.439711281258785	3	0.424605191437778	8
MLP1	YRA1	other	120	3	0.422018558301829	3	0.405641463249766	8
MLP1	YRA1	other	150	1	0.530827038089664	3	0.497142915990699	8
MLP1	YRA1	other	150	2	0.558176811296179	3	0.530548479440696	8
MLP1	YRA1	other	150	3	0.533730756448755	3	0.507083995864858	8
MLP1	YRA1	other	30	1	0.049289890634382	3	0.092349448950857	8
MLP1	YRA1	other	30	2	0.045093068430672	3	0.093296036629018	8
MLP1	YRA1	other	30	3	0.052042849236369	3	0.086371866034868	8
MLP1	YRA1	other	60	1	0.165352122080875	3	0.205564462415219	8
MLP1	YRA1	other	60	2	0.193892372435658	3	0.219564920976303	8
MLP1	YRA1	other	60	3	0.177500146235896	3	0.198928311235402	8
MLP1	YRA1	other	90	1	0.278121940895243	3	0.294754499777656	8
MLP1	YRA1	other	90	2	0.318851138548216	3	0.312235109520611	8
MLP1	YRA1	other	90	3	0.289056117588317	3	0.305128809112493	8
MLP1	YTA7	other	120	1	0.351399388111644	3	0.401973827171455	12
MLP1	YTA7	other	120	2	0.38206890519901	3	0.402321412208674	12
MLP1	YTA7	other	120	3	0.395520085907679	3	0.420444952801184	12
MLP1	YTA7	other	150	1	0.486367929769784	3	0.500397779042202	12
MLP1	YTA7	other	150	2	0.542401340752107	3	0.519997323845422	12
MLP1	YTA7	other	150	3	0.513948006396638	3	0.516482462284552	12
MLP1	YTA7	other	30	1	0.022844295635712	3	0.068612097769636	12
MLP1	YTA7	other	30	2	0.026301768020361	3	0.061440244378774	12
MLP1	YTA7	other	30	3	0.014247428879067	3	0.063947264976887	12
MLP1	YTA7	other	60	1	0.06472920856265	3	0.169853359104696	12
MLP1	YTA7	other	60	2	0.113340462530193	3	0.181075361572508	12
MLP1	YTA7	other	60	3	0.110490041645537	3	0.197537394161441	12
MLP1	YTA7	other	90	1	0.223482878433871	3	0.288617775994293	12
MLP1	YTA7	other	90	2	0.220049237117937	3	0.294288663669135	12
MLP1	YTA7	other	90	3	0.237616472213417	3	0.304625484901498	12
