!!!SBtab DocumentName='pathways' SBtabVersion='1.0' Date='2021-5-17'
!!SBtab TableID='Pathway_000_reactions' TableType='Reaction' TableName='Pathway_000_reactions' SBtabVersion='1.0'
!Reaction	!QuantityType	!Value	!ReactionFormula
G3PD5	flux	1.0	e_acceptor + glyc3p_c <=> dhap_c + e_donor
GLYK	flux	1.0	atp_c + glyc_c <=> adp_c + glyc3p_c
GLYOX3	flux	1.0	mthgxl_c --> lac__D_c
LDH_D2	flux	1.0	e_acceptor + lac__D_c <=> e_donor + pyr_c
MGSA	flux	1.0	dhap_c <=> mthgxl_c + pi_c

!!SBtab TableID='Pathway_000_stats' TableType='Quantity' TableName='Pathway_000_stats' SBtabVersion='1.0'
!ID	!QuantityType	!Unit	!Value
mdf	max-min driving force	kJ/mol	0.0
nr	number of reactions	dimensionless	5.0
sum_flux	sum of fluxes	dimensionless	5.0

!!SBtab TableID='Pathway_001_reactions' TableType='Reaction' TableName='Pathway_001_reactions' SBtabVersion='1.0'
!Reaction	!QuantityType	!Value	!ReactionFormula
DHAPT	flux	1.0	dha_c + pep_c <=> dhap_c + pyr_c
GLYCDx	flux	1.0	e_acceptor + glyc_c <=> dha_c + e_donor
LALDO3	flux	1.0	e_donor + mthgxl_c --> e_acceptor + lald__L_c
LCADi	flux	1.0	e_acceptor + lald__L_c <=> e_donor + lac__L_c
L_LACD3	flux	1.0	e_acceptor + lac__L_c --> e_donor + pyr_c
MGSA	flux	1.0	dhap_c <=> mthgxl_c + pi_c
PYK	flux	-1.0	adp_c + pep_c <=> atp_c + pyr_c

!!SBtab TableID='Pathway_001_stats' TableType='Quantity' TableName='Pathway_001_stats' SBtabVersion='1.0'
!ID	!QuantityType	!Unit	!Value
mdf	max-min driving force	kJ/mol	0.0
nr	number of reactions	dimensionless	7.0
sum_flux	sum of fluxes	dimensionless	7.0

!!SBtab TableID='Pathway_002_reactions' TableType='Reaction' TableName='Pathway_002_reactions' SBtabVersion='1.0'
!Reaction	!QuantityType	!Value	!ReactionFormula
DHAPT	flux	1.0	dha_c + pep_c <=> dhap_c + pyr_c
GLYCDx	flux	1.0	e_acceptor + glyc_c <=> dha_c + e_donor
GLYOX	flux	1.0	lgt__S_c <=> gthrd_c + lac__D_c
LDH_D2	flux	1.0	e_acceptor + lac__D_c <=> e_donor + pyr_c
LGTHL	flux	1.0	gthrd_c + mthgxl_c <=> lgt__S_c
MGSA	flux	1.0	dhap_c <=> mthgxl_c + pi_c
PYK	flux	-1.0	adp_c + pep_c <=> atp_c + pyr_c

!!SBtab TableID='Pathway_002_stats' TableType='Quantity' TableName='Pathway_002_stats' SBtabVersion='1.0'
!ID	!QuantityType	!Unit	!Value
mdf	max-min driving force	kJ/mol	0.0
nr	number of reactions	dimensionless	7.0
sum_flux	sum of fluxes	dimensionless	7.0

!!SBtab TableID='Pathway_003_reactions' TableType='Reaction' TableName='Pathway_003_reactions' SBtabVersion='1.0'
!Reaction	!QuantityType	!Value	!ReactionFormula
EDA	flux	1.0	2ddg6p_c <=> g3p_c + pyr_c
EDD	flux	1.0	6pgc_c <=> 2ddg6p_c
FBA	flux	-1.0	fdp_c <=> dhap_c + g3p_c
FBP	flux	1.0	fdp_c <=> f6p_c + pi_c
G3PD5	flux	1.0	e_acceptor + glyc3p_c <=> dhap_c + e_donor
G6PDH2r	flux	1.0	e_acceptor + g6p_c <=> 6pgl_c + e_donor
GLYK	flux	1.0	atp_c + glyc_c <=> adp_c + glyc3p_c
PGI	flux	-1.0	g6p_c <=> f6p_c
PGL	flux	1.0	6pgl_c <=> 6pgc_c

!!SBtab TableID='Pathway_003_stats' TableType='Quantity' TableName='Pathway_003_stats' SBtabVersion='1.0'
!ID	!QuantityType	!Unit	!Value
mdf	max-min driving force	kJ/mol	0.0
nr	number of reactions	dimensionless	9.0
sum_flux	sum of fluxes	dimensionless	9.0

!!SBtab TableID='Pathway_004_reactions' TableType='Reaction' TableName='Pathway_004_reactions' SBtabVersion='1.0'
!Reaction	!QuantityType	!Value	!ReactionFormula
EDA	flux	1.0	2ddg6p_c <=> g3p_c + pyr_c
EDD	flux	1.0	6pgc_c <=> 2ddg6p_c
F6PA	flux	-1.0	f6p_c <=> dha_c + g3p_c
F6PP	flux	1.0	f6p_c --> fru_c + pi_c
G6PDH2r	flux	1.0	e_acceptor + g6p_c <=> 6pgl_c + e_donor
GLYCDx	flux	1.0	e_acceptor + glyc_c <=> dha_c + e_donor
HEX1	flux	1.0	atp_c + glc__D_c <=> adp_c + g6p_c
PGL	flux	1.0	6pgl_c <=> 6pgc_c
XYLI2	flux	-1.0	glc__D_c <=> fru_c

!!SBtab TableID='Pathway_004_stats' TableType='Quantity' TableName='Pathway_004_stats' SBtabVersion='1.0'
!ID	!QuantityType	!Unit	!Value
mdf	max-min driving force	kJ/mol	0.0
nr	number of reactions	dimensionless	9.0
sum_flux	sum of fluxes	dimensionless	9.0

!!SBtab TableID='Pathway_005_reactions' TableType='Reaction' TableName='Pathway_005_reactions' SBtabVersion='1.0'
!Reaction	!QuantityType	!Value	!ReactionFormula
G3PD5	flux	1.0	e_acceptor + glyc3p_c <=> dhap_c + e_donor
GAPD	flux	1.0	e_acceptor + g3p_c + pi_c <=> 13dpg_c + e_donor
GLNS	flux	1.0	atp_c + glu__L_c + nh4_c <=> adp_c + gln__L_c + pi_c
GLUSy	flux	1.0	akg_c + e_donor + gln__L_c <=> e_acceptor + 2.0 glu__L_c
GLYK	flux	1.0	atp_c + glyc_c <=> adp_c + glyc3p_c
PGCD	flux	1.0	3pg_c + e_acceptor <=> 3php_c + e_donor
PGK	flux	-1.0	3pg_c + atp_c <=> 13dpg_c + adp_c
PSERT	flux	1.0	3php_c + glu__L_c <=> akg_c + pser__L_c
PSP_L	flux	1.0	pser__L_c <=> pi_c + ser__L_c
SERD_L	flux	1.0	ser__L_c <=> nh4_c + pyr_c
TPI	flux	1.0	dhap_c <=> g3p_c

!!SBtab TableID='Pathway_005_stats' TableType='Quantity' TableName='Pathway_005_stats' SBtabVersion='1.0'
!ID	!QuantityType	!Unit	!Value
mdf	max-min driving force	kJ/mol	0.0
nr	number of reactions	dimensionless	11.0
sum_flux	sum of fluxes	dimensionless	11.0

!!SBtab TableID='Pathway_006_reactions' TableType='Reaction' TableName='Pathway_006_reactions' SBtabVersion='1.0'
!Reaction	!QuantityType	!Value	!ReactionFormula
CYTK1	flux	1.0	atp_c + cmp_c <=> adp_c + cdp_c
ENO	flux	1.0	2pg_c <=> pep_c
G3PD5	flux	1.0	e_acceptor + glyc3p_c <=> dhap_c + e_donor
GAPD	flux	1.0	e_acceptor + g3p_c + pi_c <=> 13dpg_c + e_donor
GLYK	flux	1.0	atp_c + glyc_c <=> adp_c + glyc3p_c
NTPP4	flux	1.0	ctp_c <=> cmp_c + ppi_c
PGK	flux	-1.0	3pg_c + atp_c <=> 13dpg_c + adp_c
PGM	flux	-1.0	2pg_c <=> 3pg_c
PPA	flux	1.0	ppi_c <=> 2.0 pi_c
PYK4	flux	1.0	cdp_c + pep_c <=> ctp_c + pyr_c
TPI	flux	1.0	dhap_c <=> g3p_c

!!SBtab TableID='Pathway_006_stats' TableType='Quantity' TableName='Pathway_006_stats' SBtabVersion='1.0'
!ID	!QuantityType	!Unit	!Value
mdf	max-min driving force	kJ/mol	0.0
nr	number of reactions	dimensionless	11.0
sum_flux	sum of fluxes	dimensionless	11.0

!!SBtab TableID='Pathway_007_reactions' TableType='Reaction' TableName='Pathway_007_reactions' SBtabVersion='1.0'
!Reaction	!QuantityType	!Value	!ReactionFormula
ENO	flux	1.0	2pg_c <=> pep_c
G3PD5	flux	1.0	e_acceptor + glyc3p_c <=> dhap_c + e_donor
GAPD	flux	1.0	e_acceptor + g3p_c + pi_c <=> 13dpg_c + e_donor
GLYK	flux	1.0	atp_c + glyc_c <=> adp_c + glyc3p_c
NTPP8	flux	1.0	utp_c <=> ppi_c + ump_c
PGK	flux	-1.0	3pg_c + atp_c <=> 13dpg_c + adp_c
PGM	flux	-1.0	2pg_c <=> 3pg_c
PPA	flux	1.0	ppi_c <=> 2.0 pi_c
PYK2	flux	1.0	pep_c + udp_c --> pyr_c + utp_c
TPI	flux	1.0	dhap_c <=> g3p_c
UMPK	flux	1.0	atp_c + ump_c <=> adp_c + udp_c

!!SBtab TableID='Pathway_007_stats' TableType='Quantity' TableName='Pathway_007_stats' SBtabVersion='1.0'
!ID	!QuantityType	!Unit	!Value
mdf	max-min driving force	kJ/mol	0.0
nr	number of reactions	dimensionless	11.0
sum_flux	sum of fluxes	dimensionless	11.0

!!SBtab TableID='Pathway_008_reactions' TableType='Reaction' TableName='Pathway_008_reactions' SBtabVersion='1.0'
!Reaction	!QuantityType	!Value	!ReactionFormula
ENO	flux	1.0	2pg_c <=> pep_c
G3PD5	flux	1.0	e_acceptor + glyc3p_c <=> dhap_c + e_donor
GAPD	flux	1.0	e_acceptor + g3p_c + pi_c <=> 13dpg_c + e_donor
GK1	flux	1.0	atp_c + gmp_c <=> adp_c + gdp_c
GLYK	flux	1.0	atp_c + glyc_c <=> adp_c + glyc3p_c
NTPP2	flux	1.0	gtp_c <=> gmp_c + ppi_c
PGK	flux	-1.0	3pg_c + atp_c <=> 13dpg_c + adp_c
PGM	flux	-1.0	2pg_c <=> 3pg_c
PPA	flux	1.0	ppi_c <=> 2.0 pi_c
PYK3	flux	1.0	gdp_c + pep_c <=> gtp_c + pyr_c
TPI	flux	1.0	dhap_c <=> g3p_c

!!SBtab TableID='Pathway_008_stats' TableType='Quantity' TableName='Pathway_008_stats' SBtabVersion='1.0'
!ID	!QuantityType	!Unit	!Value
mdf	max-min driving force	kJ/mol	0.0
nr	number of reactions	dimensionless	11.0
sum_flux	sum of fluxes	dimensionless	11.0

!!SBtab TableID='Pathway_009_reactions' TableType='Reaction' TableName='Pathway_009_reactions' SBtabVersion='1.0'
!Reaction	!QuantityType	!Value	!ReactionFormula
DTMPK	flux	1.0	atp_c + dtmp_c <=> adp_c + dtdp_c
ENO	flux	1.0	2pg_c <=> pep_c
G3PD5	flux	1.0	e_acceptor + glyc3p_c <=> dhap_c + e_donor
GAPD	flux	1.0	e_acceptor + g3p_c + pi_c <=> 13dpg_c + e_donor
GLYK	flux	1.0	atp_c + glyc_c <=> adp_c + glyc3p_c
NTPP7	flux	1.0	dttp_c <=> dtmp_c + ppi_c
PGK	flux	-1.0	3pg_c + atp_c <=> 13dpg_c + adp_c
PGM	flux	-1.0	2pg_c <=> 3pg_c
PPA	flux	1.0	ppi_c <=> 2.0 pi_c
PYK6	flux	1.0	dtdp_c + pep_c <=> dttp_c + pyr_c
TPI	flux	1.0	dhap_c <=> g3p_c

!!SBtab TableID='Pathway_009_stats' TableType='Quantity' TableName='Pathway_009_stats' SBtabVersion='1.0'
!ID	!QuantityType	!Unit	!Value
mdf	max-min driving force	kJ/mol	0.0
nr	number of reactions	dimensionless	11.0
sum_flux	sum of fluxes	dimensionless	11.0

