pathway,carboxylators,mdf,$\Sigma |v_i|$,n_reactions
0,GND,3.29 kilojoule / mole,33.0,17.0
1,ME1 + GND,2.93 kilojoule / mole,37.0,19.0
2,GLYCL,5.13 kilojoule / mole,49.0,20.0
3,GND,0.16 kilojoule / mole,35.0,18.0
4,GND,2.19 kilojoule / mole,37.0,19.0
5,GND,1.01 kilojoule / mole,37.0,19.0
6,GND,1.74 kilojoule / mole,39.0,20.0
7,GND,1.4 kilojoule / mole,41.0,21.0
8,ME1 + GND,1.35 kilojoule / mole,37.0,21.0
9,ME1 + GND,0.89 kilojoule / mole,41.0,21.0
10,ME1 + GND,0.89 kilojoule / mole,41.0,21.0
11,GND,0.7 kilojoule / mole,40.0,22.0
12,ME1 + GLYCL,3.12 kilojoule / mole,45.0,23.0
13,ME1 + GND,1.6 kilojoule / mole,44.0,23.0
14,GND,1.42 kilojoule / mole,42.0,23.0
15,GND,1.42 kilojoule / mole,48.0,23.0
16,GND,0.55 kilojoule / mole,45.0,23.0
17,GND,0.46 kilojoule / mole,45.0,23.0
18,GND,0.09 kilojoule / mole,47.0,23.0
19,GND,1.74 kilojoule / mole,47.0,24.0
20,ME1 + GND,1.6 kilojoule / mole,46.0,24.0
21,ME1,1.32 kilojoule / mole,63.0,24.0
22,GND,0.43 kilojoule / mole,47.0,24.0
23,ME1 + GND,1.53 kilojoule / mole,49.0,25.0
24,GND,0.95 kilojoule / mole,58.0,25.0
25,GND,0.9 kilojoule / mole,59.0,25.0
26,ME1 + GND,0.75 kilojoule / mole,46.666,25.0
27,GND,0.53 kilojoule / mole,49.0,25.0
28,GND + PPC,2.78 kilojoule / mole,51.0,26.0
29,GND,0.26 kilojoule / mole,44.0,25.0
30,GND + PPC,0.09 kilojoule / mole,46.334,25.0
31,GND,0.08 kilojoule / mole,44.0,25.0
32,GND,0.05 kilojoule / mole,46.0,25.0
33,ME1 + GLYCL,3.92 kilojoule / mole,49.334,27.0
34,GND,0.75 kilojoule / mole,45.334,26.0
35,ME1 + GND,0.75 kilojoule / mole,54.0,26.0
36,GND + PPC,0.75 kilojoule / mole,54.0,26.0
37,GND,0.75 kilojoule / mole,48.0,26.0
38,PPCK,3.12 kilojoule / mole,65.334,27.0
39,GND,1.31 kilojoule / mole,48.0,27.0
40,GLYCL + GLXCL,1.23 kilojoule / mole,46.0,27.0
41,GND,0.75 kilojoule / mole,50.0,27.0
42,GND,0.75 kilojoule / mole,50.0,27.0
43,ME1 + GND,0.45 kilojoule / mole,55.0,27.0
44,ME1 + GLYCL,2.87 kilojoule / mole,54.0,28.0
45,ME1 + GLYCL,2.87 kilojoule / mole,55.0,28.0
46,GND,0.16 kilojoule / mole,48.0,27.0
47,GND,0.9 kilojoule / mole,52.334,28.0
48,ME1 + GND,0.75 kilojoule / mole,58.0,28.0
49,GND,0.47 kilojoule / mole,58.0,28.0
