serial number,original source,direct source,species,strain,mutation,Strain Background,person,condition,temperature,medium,growth rate [h-1],absolute flux?,Biomass Model,fermentation $h^{comb}$ [kJ gCDW$^{-1}$ h$^{-1}$],import $h^{comb}$ [kJ gCDW$^{-1}$ h$^{-1}$],precursor $h^{comb}$ [kJ gCDW$^{-1}$ h$^{-1}$],$g^{diss}$ [kJ gCDW$^{-1}$ h$^{-1}$],biomass $h^{comb}$ [kJ gCDW$^{-1}$ h$^{-1}$],pts
0,Schuetz_2012,Schuetz_2012,E. coli,MG1655,wild-type,,Annik Perrenoud,shake flask,37,M9 + glucose,0.670+/-0.010,True,e_coli,7.0+/-0.4,-30.3+/-1.0,16.1+/-1.1,7.0+/-1.0,13.40+/-0.20,10.43+/-0.27
1,Schuetz_2012,Schuetz_2012,E. coli,MG1655,wild-type,,Eliane Fischer,bioreactor,37,M9 + glucose,0.86+/-0.05,True,e_coli,5.7+/-0.9,-31.8+/-0.9,19.2+/-1.1,7.6+/-1.5,17.2+/-1.0,10.93+/-0.19
2,Schuetz_2012,Schuetz_2012,E. coli,MG1655,wild-type,,Annik Perrenoud,shake flask,37,M9 + glucose,0.650+/-0.010,True,e_coli,5.6+/-0.6,-26.4+/-1.7,15.1+/-1.9,6.0+/-1.3,13.00+/-0.20,9.1+/-0.5
3,Schuetz_2012,Schuetz_2012,E. coli,MG1655,wild-type,,Annik Perrenoud,shake flask,37,M9 + glucose,0.610+/-0.028,True,e_coli,3.9+/-0.5,-24.1+/-1.3,14.3+/-1.5,5.9+/-1.1,12.2+/-0.6,8.3+/-0.4
4,Fischer_2003,Schuetz_2012,E. coli,MG1655,wild-type,F- lambda- rph-1,Eliane Fischer,shake flask,37,M9 + glucose,0.610+/-0.010,True,e_coli,3.9+/-0.4,-24.7+/-0.6,14.5+/-0.6,6.2+/-0.9,12.20+/-0.20,8.50+/-0.10
5,Fuhrer_2005,Schuetz_2012,E. coli,MG1655,wild-type,(b),Tobias Fuhrer,shake flask,30,M9 + glucose,0.480+/-0.010,True,e_coli,3.0+/-0.4,-18.9+/-1.1,15.0+/-1.1,4.7+/-0.8,9.60+/-0.20,6.51+/-0.35
6,Perrenoud_2005,Schuetz_2012,E. coli,FB8,wild-type,,Annik Perrenoud,shake flask,37,M9 + glucose,0.590+/-0.020,True,e_coli,5.43+/-0.23,-25.0+/-1.0,14.0+/-1.1,5.7+/-1.0,11.8+/-0.4,8.58+/-0.30
7,Schuetz_2012,Schuetz_2012,E. coli,LJ101,wild-type,,Annik Perrenoud,shake flask,37,M9 + glucose,0.580+/-0.020,True,e_coli,3.62+/-0.27,-21.8+/-1.7,13.4+/-2.0,5.1+/-1.4,11.6+/-0.4,7.5+/-0.6
8,Perrenoud_2005,Schuetz_2012,E. coli,MC4100,wild-type,,Annik Perrenoud,shake flask,37,M9 + glucose,0.870+/-0.019,True,e_coli,6.9+/-0.5,-32.4+/-1.0,19.1+/-1.0,7.4+/-0.8,17.4+/-0.4,11.13+/-0.24
9,Schuetz_2012,Schuetz_2012,E. coli,W3100,wild-type,,Annik Perrenoud,shake flask,37,M9 + glucose,0.600+/-0.020,True,e_coli,5.1+/-0.5,-25.0+/-1.5,13.9+/-1.7,6.1+/-1.1,12.0+/-0.4,8.6+/-0.5
10,Schuetz_2012,Schuetz_2012,E. coli,W3110,wild-type,,Annik Perrenoud,shake flask,37,M9 + glucose,0.71+/-0.04,True,e_coli,4.8+/-0.5,-27.0+/-1.2,16.3+/-1.5,6.4+/-1.2,14.2+/-0.7,9.3+/-0.4
11,Fischer_2003,Schuetz_2012,E. coli,W3110,wild-type,K12 strain (lambda- F- IN(rrnD-rrnE)1 rph-1),Eliane Fischer,shake flask,37,M9 + glucose,0.690+/-0.013,True,e_coli,4.9+/-0.4,-28.1+/-0.7,16.9+/-0.7,6.6+/-0.9,13.80+/-0.27,9.67+/-0.11
12,Perrenoud_2005,Schuetz_2012,E. coli,PP6,wild-type,,Annik Perrenoud,shake flask,37,M9 + glucose,0.710+/-0.019,True,e_coli,4.1+/-0.5,-28.1+/-1.0,16.8+/-1.1,7.1+/-0.9,14.2+/-0.4,9.65+/-0.27
13,Schuetz_2012,Schuetz_2012,E. coli,BW25113,wild-type,,Marcel Emmerling,shake flask,37,M9 + glucose,0.630+/-0.009,True,e_coli,3.95+/-0.14,-21.9+/-0.5,13.8+/-0.4,5.0+/-0.5,12.60+/-0.18,7.52+/-0.09
14,Schuetz_2012,Schuetz_2012,E. coli,BW25113,wild-type,,Annik Perrenoud,shake flask,37,M9 + glucose,0.680+/-0.010,True,e_coli,4.20+/-0.15,-24.1+/-0.6,14.9+/-0.5,5.7+/-0.5,13.60+/-0.19,8.29+/-0.09
15,Schuetz_2012,Schuetz_2012,E. coli,BW25113,wild-type,rrnB3 deltalacZ4787 hsdR514 delta(araBAD)567 delta(rhaBAD)568 rph-1,Robert Schütz,deep-well plates,37,M9 + glucose,0.55+/-0.04,True,e_coli,3.56+/-0.27,-20.5+/-1.1,12.6+/-1.1,4.5+/-0.8,11.0+/-0.8,7.04+/-0.33
16,Fischer_2003,Schuetz_2012,E. coli,JM101,wild-type,,Eliane Fischer,shake flask,37,M9 + glucose,0.550+/-0.008,True,e_coli,1.33+/-0.27,-17.9+/-0.5,12.3+/-0.4,4.6+/-0.6,11.00+/-0.16,6.14+/-0.08
17,Perrenoud_2005,Perrenoud_2005,E. coli,BW25113,wild-type,,Annik Perrenoud,shake flask,37,M9 + glucose,0.641+/-0.010,True,e_coli,3.91+/-0.19,-22.4+/-0.6,14.0+/-0.5,5.2+/-0.4,12.82+/-0.19,7.70+/-0.09
25,Perrenoud_2005,Perrenoud_2005,E. coli,MC4100,wild-type,,Annik Perrenoud,shake flask,37,M9 + glucose,0.91+/-0.06,True,e_coli,6.64+/-0.21,-33.7+/-0.8,20.1+/-0.9,8.0+/-1.0,18.2+/-1.3,11.60+/-0.10
27,Perrenoud_2005,Perrenoud_2005,E. coli,FB8,wild-type,,Annik Perrenoud,shake flask,37,M9 + glucose,0.880+/-0.029,True,e_coli,4.7+/-0.4,-30.9+/-1.5,19.5+/-1.6,7.6+/-1.1,17.6+/-0.6,10.6+/-0.4
29,Perrenoud_2005,Perrenoud_2005,E. coli,CA8000,wild-type,,Annik Perrenoud,shake flask,37,M9 + glucose,0.510+/-0.010,True,e_coli,6.2+/-0.4,-24.2+/-0.9,12.4+/-1.0,5.4+/-0.7,10.19+/-0.20,8.31+/-0.27
31,Perrenoud_2005,Perrenoud_2005,E. coli,RZ7350,wild-type,,Annik Perrenoud,shake flask,37,M9 + glucose,0.663+/-0.010,True,e_coli,4.2+/-0.4,-24.2+/-1.0,15.1+/-1.0,5.6+/-0.9,13.27+/-0.20,8.33+/-0.28
33,Perrenoud_2005,Perrenoud_2005,E. coli,PP6,wild-type,,Annik Perrenoud,shake flask,37,M9 + glucose,0.742+/-0.028,True,e_coli,4.1+/-0.5,-28.1+/-1.0,17.2+/-1.1,7.0+/-0.9,14.8+/-0.6,9.66+/-0.27
35,Nanchen_2006,Nanchen_2006,E. coli,MG1655,wild-type,,Annik Nanchen,chemostat,37,M9 + glucose,0.0435+/-0.0022,True,e_coli,,-2.66+/-0.35,1.3+/-0.4,0.92+/-0.32,0.87+/-0.04,0.91+/-0.12
36,Nanchen_2006,Nanchen_2006,E. coli,MG1655,wild-type,,Annik Nanchen,chemostat,37,M9 + glucose,0.046+/-0.007,True,e_coli,,-3.5+/-0.5,1.6+/-0.6,1.2+/-0.5,0.92+/-0.14,1.19+/-0.17
37,Nanchen_2006,Nanchen_2006,E. coli,MG1655,wild-type,,Annik Nanchen,chemostat,37,M9 + glucose,0.0556+/-0.0022,True,e_coli,,-3.3+/-0.5,1.8+/-0.6,1.1+/-0.5,1.11+/-0.04,1.15+/-0.18
38,Nanchen_2006,Nanchen_2006,E. coli,MG1655,wild-type,,Annik Nanchen,chemostat,37,M9 + glucose,0.085+/-0.009,True,e_coli,,-4.9+/-0.5,2.8+/-0.7,1.5+/-0.6,1.70+/-0.18,1.67+/-0.18
39,Nanchen_2006,Nanchen_2006,E. coli,MG1655,wild-type,,Annik Nanchen,chemostat,37,M9 + glucose,0.085+/-0.009,True,e_coli,,-4.9+/-0.5,2.8+/-0.7,1.5+/-0.6,1.70+/-0.18,1.67+/-0.18
40,Nanchen_2006,Nanchen_2006,E. coli,MG1655,wild-type,,Annik Nanchen,chemostat,37,M9 + glucose,0.092+/-0.008,True,e_coli,,-5.2+/-0.5,3.0+/-0.6,1.6+/-0.5,1.84+/-0.16,1.80+/-0.16
41,Nanchen_2006,Nanchen_2006,E. coli,MG1655,wild-type,,Annik Nanchen,chemostat,37,M9 + glucose,0.092+/-0.008,True,e_coli,,-5.2+/-0.5,3.0+/-0.6,1.7+/-0.5,1.84+/-0.16,1.80+/-0.16
42,Nanchen_2006,Nanchen_2006,E. coli,MG1655,wild-type,,Annik Nanchen,chemostat,37,M9 + glucose,0.1135+/-0.0032,True,e_coli,,-6.1+/-0.9,3.5+/-1.0,2.0+/-0.8,2.27+/-0.06,2.11+/-0.30
43,Nanchen_2006,Nanchen_2006,E. coli,MG1655,wild-type,,Annik Nanchen,chemostat,37,M9 + glucose,0.1135+/-0.0032,True,e_coli,,-6.2+/-0.9,3.5+/-1.0,2.0+/-0.7,2.27+/-0.06,2.12+/-0.30
44,Nanchen_2006,Nanchen_2006,E. coli,MG1655,wild-type,,Annik Nanchen,chemostat,37,M9 + glucose,0.184+/-0.010,True,e_coli,,-8.3+/-0.5,5.2+/-0.6,2.5+/-0.5,3.69+/-0.19,2.84+/-0.15
45,Nanchen_2006,Nanchen_2006,E. coli,MG1655,wild-type,,Annik Nanchen,chemostat,37,M9 + glucose,0.184+/-0.010,True,e_coli,,-8.3+/-0.5,5.2+/-0.6,2.5+/-0.5,3.69+/-0.19,2.84+/-0.15
46,Nanchen_2006,Nanchen_2006,E. coli,MG1655,wild-type,,Annik Nanchen,chemostat,37,M9 + glucose,0.284+/-0.009,True,e_coli,,-12.5+/-0.8,7.7+/-0.9,3.9+/-0.7,5.69+/-0.18,4.31+/-0.25
47,Nanchen_2006,Nanchen_2006,E. coli,MG1655,wild-type,,Annik Nanchen,chemostat,37,M9 + glucose,0.284+/-0.009,True,e_coli,,-12.5+/-0.8,7.7+/-0.9,3.9+/-0.7,5.69+/-0.18,4.31+/-0.25
48,Nanchen_2006,Nanchen_2006,E. coli,MG1655,wild-type,,Annik Nanchen,chemostat,37,M9 + glucose,0.314+/-0.009,True,e_coli,,-13.4+/-0.9,8.5+/-1.0,4.0+/-0.8,6.27+/-0.18,4.62+/-0.29
49,Nanchen_2006,Nanchen_2006,E. coli,MG1655,wild-type,,Annik Nanchen,chemostat,37,M9 + glucose,0.314+/-0.009,True,e_coli,,-13.4+/-0.9,8.5+/-1.0,4.0+/-0.8,6.27+/-0.18,4.62+/-0.29
50,Nanchen_2006,Nanchen_2006,E. coli,MG1655,wild-type,,Annik Nanchen,chemostat,37,M9 + glucose,0.397+/-0.013,True,e_coli,,-16.6+/-0.9,10.3+/-1.0,5.1+/-0.8,7.95+/-0.25,5.71+/-0.28
51,Nanchen_2006,Nanchen_2006,E. coli,MG1655,wild-type,,Annik Nanchen,chemostat,37,M9 + glucose,0.409+/-0.019,True,e_coli,,-17.0+/-1.0,10.6+/-1.2,5.2+/-0.9,8.2+/-0.4,5.84+/-0.33
54,Fuhrer_2005,Fuhrer_2005,E. coli,MG1655,wild-type,,Tobias Fuhrer,shake flask,37,M9 + glucose,0.414+/-0.010,True,e_coli,3.06+/-0.10,-21.9+/-0.5,17.46+/-0.26,5.15+/-0.25,8.28+/-0.20,7.52+/-0.06
120,Gerosa_2015,Gerosa_2015,E. coli,BW25113,wild-type,,Luca Gerosa,shake flask,37,M9 + glucose,0.650+/-0.010,True,e_coli,5.8+/-0.9,-28.1+/-0.6,20.7+/-0.9,6.9+/-0.4,13.00+/-0.20,9.65+/-0.04
