<?xml version="1.0" encoding="UTF-8" standalone="no"?>
<svg
   xmlns:dc="http://purl.org/dc/elements/1.1/"
   xmlns:cc="http://creativecommons.org/ns#"
   xmlns:rdf="http://www.w3.org/1999/02/22-rdf-syntax-ns#"
   xmlns:svg="http://www.w3.org/2000/svg"
   xmlns="http://www.w3.org/2000/svg"
   xmlns:sodipodi="http://sodipodi.sourceforge.net/DTD/sodipodi-0.dtd"
   xmlns:inkscape="http://www.inkscape.org/namespaces/inkscape"
   width="128"
   height="128"
   id="svg2"
   version="1.1"
   inkscape:version="1.0.1 (3bc2e813f5, 2020-09-07)"
   sodipodi:docname="favicon.svg"
   inkscape:export-filename="/home/eladn/git/equilibrator-api/docs/source/favicon.png"
   inkscape:export-xdpi="96"
   inkscape:export-ydpi="96">
  <defs
     id="defs4" />
  <sodipodi:namedview
     id="base"
     pagecolor="#ffffff"
     bordercolor="#666666"
     borderopacity="1.0"
     inkscape:pageopacity="0.0"
     inkscape:pageshadow="2"
     inkscape:zoom="2.6015625"
     inkscape:cx="-30.246103"
     inkscape:cy="22.831234"
     inkscape:document-units="px"
     inkscape:current-layer="g4150"
     showgrid="false"
     inkscape:window-width="1640"
     inkscape:window-height="899"
     inkscape:window-x="72"
     inkscape:window-y="27"
     inkscape:window-maximized="1"
     units="px"
     fit-margin-top="0"
     fit-margin-left="0"
     fit-margin-right="0"
     fit-margin-bottom="0"
     inkscape:snap-page="true"
     showguides="false"
     inkscape:guide-bbox="true"
     inkscape:document-rotation="0">
    <inkscape:grid
       type="xygrid"
       id="grid3757"
       empspacing="5"
       visible="true"
       enabled="true"
       snapvisiblegridlinesonly="true"
       originx="-13.957535"
       originy="-57.254035" />
    <sodipodi:guide
       position="105.72332,187.01776"
       orientation="0,1"
       id="guide832"
       inkscape:locked="false" />
  </sodipodi:namedview>
  <metadata
     id="metadata7">
    <rdf:RDF>
      <cc:Work
         rdf:about="">
        <dc:format>image/svg+xml</dc:format>
        <dc:type
           rdf:resource="http://purl.org/dc/dcmitype/StillImage" />
        <dc:title></dc:title>
      </cc:Work>
    </rdf:RDF>
  </metadata>
  <g
     inkscape:label="Layer 1"
     inkscape:groupmode="layer"
     id="layer1"
     transform="translate(22.545257,-738.3551)">
    <g
       transform="matrix(1.1462017,0,0,1.1462017,-69.937277,-89.919223)"
       id="g4150">
      <ellipse
         ry="17.333551"
         rx="17.858809"
         cy="755.97174"
         cx="64.239792"
         id="path3911"
         style="fill:#ffa349;fill-opacity:1;stroke:none;stroke-width:1.0001;stroke-linecap:butt;stroke-linejoin:miter;stroke-miterlimit:3.97728;stroke-dasharray:none;stroke-dashoffset:0;stroke-opacity:1" />
      <path
         d="m 64.153344,776.16529 -17.571647,-10.14499 0,-20.28999 17.571646,-10.14499 17.571646,10.14499 1e-6,20.28999 z"
         inkscape:randomized="0"
         inkscape:rounded="0"
         inkscape:flatsided="true"
         sodipodi:arg2="2.0943951"
         sodipodi:arg1="1.5707963"
         sodipodi:r2="17.571646"
         sodipodi:r1="20.289989"
         sodipodi:cy="755.87528"
         sodipodi:cx="64.153343"
         sodipodi:sides="6"
         id="path2985"
         style="fill:none;stroke:#000000;stroke-width:6.62577;stroke-linecap:square;stroke-linejoin:round;stroke-miterlimit:42.3909;stroke-dasharray:none;stroke-dashoffset:0;stroke-opacity:1"
         sodipodi:type="star" />
      <ellipse
         ry="18.448849"
         rx="19.007904"
         cy="767.80566"
         cx="130.13585"
         style="fill:#bd69ff;fill-opacity:1;stroke:none;stroke-width:1.06445;stroke-linecap:butt;stroke-linejoin:miter;stroke-miterlimit:3.97728;stroke-dasharray:none;stroke-dashoffset:0;stroke-opacity:1"
         id="path3925" />
      <path
         sodipodi:type="star"
         style="fill:none;stroke:#000000;stroke-width:6.62577;stroke-linecap:butt;stroke-linejoin:round;stroke-miterlimit:42.3909;stroke-dasharray:none;stroke-dashoffset:0;stroke-opacity:1"
         id="path3755"
         sodipodi:sides="6"
         sodipodi:cx="129.91792"
         sodipodi:cy="767.6165"
         sodipodi:r1="20.289989"
         sodipodi:r2="17.571646"
         sodipodi:arg1="1.5707963"
         sodipodi:arg2="2.0943951"
         inkscape:flatsided="true"
         inkscape:rounded="0"
         inkscape:randomized="0"
         d="m 129.91792,787.90651 -17.57164,-10.145 0,-20.28999 17.57164,-10.14499 17.57165,10.14499 0,20.28999 z" />
      <path
         sodipodi:nodetypes="cc"
         inkscape:connector-curvature="0"
         id="rect4200"
         d="m 97.32239,737.44689 v 83.72639"
         style="opacity:1;fill:#f9f9f9;fill-opacity:1;stroke:#000000;stroke-width:6.62577;stroke-linecap:round;stroke-linejoin:round;stroke-miterlimit:42.3909;stroke-dasharray:none;stroke-dashoffset:0;stroke-opacity:1" />
      <path
         sodipodi:nodetypes="cc"
         inkscape:connector-curvature="0"
         id="path3905"
         d="m 64.153344,735.58544 c 16.421508,-3.50736 51.807796,3.28765 65.764606,11.74103"
         style="fill:none;stroke:#000000;stroke-width:6.62577;stroke-linecap:butt;stroke-linejoin:miter;stroke-miterlimit:42.3909;stroke-dasharray:none;stroke-dashoffset:0;stroke-opacity:1" />
      <path
         sodipodi:nodetypes="cc"
         inkscape:connector-curvature="0"
         id="path842"
         d="M 51.688224,821.38931 H 143.04308"
         style="opacity:1;fill:#f9f9f9;fill-opacity:1;stroke:#000000;stroke-width:9.93867;stroke-linecap:round;stroke-linejoin:round;stroke-miterlimit:42.3909;stroke-dasharray:none;stroke-dashoffset:0;stroke-opacity:1" />
    </g>
  </g>
</svg>
