!!!SBtab Document='Pathway Model' SBtabVersion='1.0'							
							
!!SBtab TableName='Reaction' TableID='Reaction' TableType='Reaction'  							
!ID	!Name	!ReactionFormula	!Identifiers:kegg.reaction				
R_glucokinas_R00299	R_glucokinas_R00299	C_d_glucose + C_atp <=> C_glucose_6_phosphate + C_adp	R00299				
R_phosphohex_R00771	R_phosphohex_R00771	C_glucose_6_phosphate <=> C_d_fructose_6_phosphoric_acid	R00771				
R_6_phosphof_R04779	R_6_phosphof_R04779	C_atp + C_d_fructose_6_phosphoric_acid <=> C_adp + C_fructose_16_bisphosphate	R04779				
R_fructose_b_R01070	R_fructose_b_R01070	C_fructose_16_bisphosphate <=> C_glycerone_phosphate + C_d_glyceraldehyde_3_phosphate	R01070				
R_triose_pho_R01015	R_triose_pho_R01015	C_glycerone_phosphate <=> C_d_glyceraldehyde_3_phosphate	R01015				
R_glyceralde_R01061	R_glyceralde_R01061	C_orthophosphate + C_nad + C_d_glyceraldehyde_3_phosphate <=> C_nadh + C_3_phospho_d_glyceroyl_phosphate	R01061				
R_phosphogly_R01512	R_phosphogly_R01512	C_adp + C_3_phospho_d_glyceroyl_phosphate <=> C_atp + C_3_phospho_d_glycerate	R01512				
R_phosphogly_R01518	R_phosphogly_R01518	C_3_phospho_d_glycerate <=> C_2_phospho_d_glycerate	R01518				
R_phosphopyr_R00658	R_phosphopyr_R00658	C_2_phospho_d_glycerate <=> C_phosphoenolpyruvate + C_h2o	R00658				
R_pyruvate_k_R00200	R_pyruvate_k_R00200	C_adp + C_phosphoenolpyruvate <=> C_pyruvate + C_atp	R00200				
R_pyruvate_d_R00224	R_pyruvate_d_R00224	C_pyruvate <=> C_acetaldehyde + C_co2	R00224				
R_adh_R00754	R_adh_R00754	C_acetaldehyde + C_nadh <=> C_ethanol + C_nad	R00754				
							
!!SBtab TableName='Compound' TableID='Compound' TableType='Compound'							
!ID	!Name	!Identifiers:kegg.compound	!IsConstant				
C_d_glucose	D-Glucose	C00031	False				
C_atp	ATP	C00002	False				
C_glucose_6_phosphate	Glucose 6-phosphate	C00092	False				
C_adp	ADP	C00008	False				
C_d_fructose_6_phosphoric_acid	D-Fructose 6-phosphoric acid	C00085	False				
C_fructose_16_bisphosphate	Fructose-1,6-bisphosphate	C05378	False				
C_glycerone_phosphate	Glycerone phosphate	C00111	False				
C_d_glyceraldehyde_3_phosphate	D-Glyceraldehyde 3-phosphate	C00118	False				
C_orthophosphate	Orthophosphate	C00009	False				
C_nad	NAD+	C00003	False				
C_nadh	NADH	C00004	False				
C_3_phospho_d_glyceroyl_phosphate	3-Phospho-D-glyceroyl phosphate	C00236	False				
C_3_phospho_d_glycerate	3-Phospho-D-glycerate	C00197	False				
C_2_phospho_d_glycerate	2-Phospho-D-glycerate	C00631	False				
C_phosphoenolpyruvate	Phosphoenolpyruvate	C00074	False				
C_h2o	H2O	C00001	False				
C_pyruvate	Pyruvate	C00022	False				
C_acetaldehyde	Acetaldehyde	C00084	False				
C_co2	CO2	C00011	False				
C_ethanol	Ethanol	C00469	False				
							
!!SBtab TableName='Relative flux' TableID='RelativeFlux' TableType='Quantity' Unit='mM/s'							
!QuantityType	!Reaction	!Reaction:Identifiers:kegg.reaction	!Value				
flux	R_glucokinas_R00299	R00299	1				
flux	R_phosphohex_R00771	R00771	1				
flux	R_6_phosphof_R04779	R04779	1				
flux	R_fructose_b_R01070	R01070	1				
flux	R_triose_pho_R01015	R01015	1				
flux	R_glyceralde_R01061	R01061	2				
flux	R_phosphogly_R01512	R01512	2				
flux	R_phosphogly_R01518	R01518	2				
flux	R_phosphopyr_R00658	R00658	2				
flux	R_pyruvate_k_R00200	R00200	2				
flux	R_pyruvate_d_R00224	R00224	2				
flux	R_adh_R00754	R00754	2				
							
!!SBtab TableName='Concentration constraint' TableID='ConcentrationConstraint' TableType='Quantity' Unit='M'							
!QuantityType	!Compound	!Compound:Identifiers:kegg.compound	!Concentration:Min	!Concentration:Max			
concentration	C_d_glucose	C00031	1E-06	0.01			
concentration	C_atp	C00002	0.005	0.005			
concentration	C_glucose_6_phosphate	C00092	1E-06	0.01			
concentration	C_adp	C00008	0.0005	0.0005			
concentration	C_d_fructose_6_phosphoric_acid	C00085	1E-06	0.01			
concentration	C_fructose_16_bisphosphate	C05378	1E-06	0.01			
concentration	C_glycerone_phosphate	C00111	1E-06	0.01			
concentration	C_d_glyceraldehyde_3_phosphate	C00118	1E-06	0.01			
concentration	C_orthophosphate	C00009	0.01	0.01			
concentration	C_nad	C00003	0.001	0.001			
concentration	C_nadh	C00004	0.0001	0.0001			
concentration	C_3_phospho_d_glyceroyl_phosphate	C00236	1E-06	0.01			
concentration	C_3_phospho_d_glycerate	C00197	1E-06	0.01			
concentration	C_2_phospho_d_glycerate	C00631	1E-06	0.01			
concentration	C_phosphoenolpyruvate	C00074	1E-06	0.01			
concentration	C_h2o	C00001	1	1			
concentration	C_pyruvate	C00022	1E-06	0.01			
concentration	C_acetaldehyde	C00084	1E-06	0.01			
concentration	C_co2	C00011	1E-05	1E-05			
concentration	C_ethanol	C00469	1E-06	0.01			
							
!!SBtab TableName='Parameter' TableID='Parameter' TableType='Quantity' Document='Pathway Model' SBtabVersion='1.0' pH='7.00' IonicStrength='0.10' IonicStrengthUnit='M'							
!QuantityType	!Reaction	!Compound	!Value	!Unit	!Reaction:Identifiers:kegg.reaction	!Compound:Identifiers:kegg.compound	!ID
equilibrium constant	R_glucokinas_R00299		1061.24772470112	dimensionless	R00299		kEQ_hexokinase_R00299
equilibrium constant	R_phosphohex_R00771		0.360889245415876	dimensionless	R00771		kEQ_phosphohex_R00771
equilibrium constant	R_6_phosphof_R04779		190.14472323307	dimensionless	R04779		kEQ_6_phosphof_R04779
equilibrium constant	R_fructose_b_R01070		0.000745159162699	dimensionless	R01070		kEQ_fructose_b_R01070
equilibrium constant	R_triose_pho_R01015		0.109662570962434	dimensionless	R01015		kEQ_triose_pho_R01015
equilibrium constant	R_glyceralde_R01061		0.043290979452048	dimensionless	R01061		kEQ_glyceralde_R01061
equilibrium constant	R_phosphogly_R01512		1716.16163695823	dimensionless	R01512		kEQ_phosphogly_R01512
equilibrium constant	R_phosphogly_R01518		0.182159355264605	dimensionless	R01518		kEQ_phosphogly_R01518
equilibrium constant	R_phosphopyr_R00658		5.19572002201854	dimensionless	R00658		kEQ_phosphopyr_R00658
equilibrium constant	R_pyruvate_k_R00200		71137.9254008532	dimensionless	R00200		kEQ_pyruvate_k_R00200
equilibrium constant	R_pyruvate_d_R00224		1620.6623703988	dimensionless	R00224		kEQ_pyruvate_d_R00224
equilibrium constant	R_adh_R00754		6320.79405106526	dimensionless	R00754		kEQ_retinal_re_R00754
catalytic rate constant geometric mean	R_glucokinas_R00299		100	1/s	R00299		kC_hexokinase_R00299
catalytic rate constant geometric mean	R_phosphohex_R00771		100	1/s	R00771		kC_phosphohex_R00771
catalytic rate constant geometric mean	R_6_phosphof_R04779		100	1/s	R04779		kC_6_phosphof_R04779
catalytic rate constant geometric mean	R_fructose_b_R01070		100	1/s	R01070		kC_fructose_b_R01070
catalytic rate constant geometric mean	R_triose_pho_R01015		100	1/s	R01015		kC_triose_pho_R01015
catalytic rate constant geometric mean	R_glyceralde_R01061		100	1/s	R01061		kC_glyceralde_R01061
catalytic rate constant geometric mean	R_phosphogly_R01512		100	1/s	R01512		kC_phosphogly_R01512
catalytic rate constant geometric mean	R_phosphogly_R01518		100	1/s	R01518		kC_phosphogly_R01518
catalytic rate constant geometric mean	R_phosphopyr_R00658		100	1/s	R00658		kC_phosphopyr_R00658
catalytic rate constant geometric mean	R_pyruvate_k_R00200		100	1/s	R00200		kC_pyruvate_k_R00200
catalytic rate constant geometric mean	R_pyruvate_d_R00224		100	1/s	R00224		kC_pyruvate_d_R00224
catalytic rate constant geometric mean	R_adh_R00754		100	1/s	R00754		kC_retinal_re_R00754
substrate catalytic rate constant	R_glucokinas_R00299		100	1/s	R00299		kcrf_hexokinase_R00299
substrate catalytic rate constant	R_phosphohex_R00771		100	1/s	R00771		kcrf_phosphohex_R00771
substrate catalytic rate constant	R_6_phosphof_R04779		100	1/s	R04779		kcrf_6_phosphof_R04779
substrate catalytic rate constant	R_fructose_b_R01070		100	1/s	R01070		kcrf_fructose_b_R01070
substrate catalytic rate constant	R_triose_pho_R01015		100	1/s	R01015		kcrf_triose_pho_R01015
substrate catalytic rate constant	R_glyceralde_R01061		100	1/s	R01061		kcrf_glyceralde_R01061
substrate catalytic rate constant	R_phosphogly_R01512		100	1/s	R01512		kcrf_phosphogly_R01512
substrate catalytic rate constant	R_phosphogly_R01518		100	1/s	R01518		kcrf_phosphogly_R01518
substrate catalytic rate constant	R_phosphopyr_R00658		100	1/s	R00658		kcrf_phosphopyr_R00658
substrate catalytic rate constant	R_pyruvate_k_R00200		100	1/s	R00200		kcrf_pyruvate_k_R00200
substrate catalytic rate constant	R_pyruvate_d_R00224		100	1/s	R00224		kcrf_pyruvate_d_R00224
substrate catalytic rate constant	R_adh_R00754		100	1/s	R00754		kcrf_retinal_re_R00754
product catalytic rate constant	R_glucokinas_R00299		100	1/s	R00299		kcrr_hexokinase_R00299
product catalytic rate constant	R_phosphohex_R00771		100	1/s	R00771		kcrr_phosphohex_R00771
product catalytic rate constant	R_6_phosphof_R04779		100	1/s	R04779		kcrr_6_phosphof_R04779
product catalytic rate constant	R_fructose_b_R01070		100	1/s	R01070		kcrr_fructose_b_R01070
product catalytic rate constant	R_triose_pho_R01015		100	1/s	R01015		kcrr_triose_pho_R01015
product catalytic rate constant	R_glyceralde_R01061		100	1/s	R01061		kcrr_glyceralde_R01061
product catalytic rate constant	R_phosphogly_R01512		100	1/s	R01512		kcrr_phosphogly_R01512
product catalytic rate constant	R_phosphogly_R01518		100	1/s	R01518		kcrr_phosphogly_R01518
product catalytic rate constant	R_phosphopyr_R00658		100	1/s	R00658		kcrr_phosphopyr_R00658
product catalytic rate constant	R_pyruvate_k_R00200		100	1/s	R00200		kcrr_pyruvate_k_R00200
product catalytic rate constant	R_pyruvate_d_R00224		100	1/s	R00224		kcrr_pyruvate_d_R00224
product catalytic rate constant	R_adh_R00754		100	1/s	R00754		kcrr_retinal_re_R00754
Michaelis constant	R_glucokinas_R00299	C_d_glucose	1	mM	R00299	C00031	kM_hexokinase_R00299_C_d_glucose
Michaelis constant	R_glucokinas_R00299	C_atp	1	mM	R00299	C00002	kM_hexokinase_R00299_C_atp
Michaelis constant	R_glucokinas_R00299	C_glucose_6_phosphate	1	mM	R00299	C00092	kM_hexokinase_R00299_C_glucose_6_phosphate
Michaelis constant	R_glucokinas_R00299	C_adp	1	mM	R00299	C00008	kM_hexokinase_R00299_C_adp
Michaelis constant	R_phosphohex_R00771	C_glucose_6_phosphate	1	mM	R00771	C00092	kM_phosphohex_R00771_C_glucose_6_phosphate
Michaelis constant	R_phosphohex_R00771	C_d_fructose_6_phosphoric_acid	1	mM	R00771	C00085	kM_phosphohex_R00771_C_d_fructose_6_phosphoric_acid
Michaelis constant	R_6_phosphof_R04779	C_atp	1	mM	R04779	C00002	kM_6_phosphof_R04779_C_atp
Michaelis constant	R_6_phosphof_R04779	C_d_fructose_6_phosphoric_acid	1	mM	R04779	C00085	kM_6_phosphof_R04779_C_d_fructose_6_phosphoric_acid
Michaelis constant	R_6_phosphof_R04779	C_adp	1	mM	R04779	C00008	kM_6_phosphof_R04779_C_adp
Michaelis constant	R_6_phosphof_R04779	C_fructose_16_bisphosphate	1	mM	R04779	C05378	kM_6_phosphof_R04779_C_fructose_16_bisphosphate
Michaelis constant	R_fructose_b_R01070	C_fructose_16_bisphosphate	1	mM	R01070	C05378	kM_fructose_b_R01070_C_fructose_16_bisphosphate
Michaelis constant	R_fructose_b_R01070	C_glycerone_phosphate	1	mM	R01070	C00111	kM_fructose_b_R01070_C_glycerone_phosphate
Michaelis constant	R_fructose_b_R01070	C_d_glyceraldehyde_3_phosphate	1	mM	R01070	C00118	kM_fructose_b_R01070_C_d_glyceraldehyde_3_phosphate
Michaelis constant	R_triose_pho_R01015	C_glycerone_phosphate	1	mM	R01015	C00111	kM_triose_pho_R01015_C_glycerone_phosphate
Michaelis constant	R_triose_pho_R01015	C_d_glyceraldehyde_3_phosphate	1	mM	R01015	C00118	kM_triose_pho_R01015_C_d_glyceraldehyde_3_phosphate
Michaelis constant	R_glyceralde_R01061	C_orthophosphate	1	mM	R01061	C00009	kM_glyceralde_R01061_C_orthophosphate
Michaelis constant	R_glyceralde_R01061	C_nad	1	mM	R01061	C00003	kM_glyceralde_R01061_C_nad
Michaelis constant	R_glyceralde_R01061	C_d_glyceraldehyde_3_phosphate	1	mM	R01061	C00118	kM_glyceralde_R01061_C_d_glyceraldehyde_3_phosphate
Michaelis constant	R_glyceralde_R01061	C_nadh	1	mM	R01061	C00004	kM_glyceralde_R01061_C_nadh
Michaelis constant	R_glyceralde_R01061	C_3_phospho_d_glyceroyl_phosphate	1	mM	R01061	C00236	kM_glyceralde_R01061_C_3_phospho_d_glyceroyl_phosphate
Michaelis constant	R_phosphogly_R01512	C_adp	1	mM	R01512	C00008	kM_phosphogly_R01512_C_adp
Michaelis constant	R_phosphogly_R01512	C_3_phospho_d_glyceroyl_phosphate	1	mM	R01512	C00236	kM_phosphogly_R01512_C_3_phospho_d_glyceroyl_phosphate
Michaelis constant	R_phosphogly_R01512	C_atp	1	mM	R01512	C00002	kM_phosphogly_R01512_C_atp
Michaelis constant	R_phosphogly_R01512	C_3_phospho_d_glycerate	1	mM	R01512	C00197	kM_phosphogly_R01512_C_3_phospho_d_glycerate
Michaelis constant	R_phosphogly_R01518	C_3_phospho_d_glycerate	1	mM	R01518	C00197	kM_phosphogly_R01518_C_3_phospho_d_glycerate
Michaelis constant	R_phosphogly_R01518	C_2_phospho_d_glycerate	1	mM	R01518	C00631	kM_phosphogly_R01518_C_2_phospho_d_glycerate
Michaelis constant	R_phosphopyr_R00658	C_2_phospho_d_glycerate	1	mM	R00658	C00631	kM_phosphopyr_R00658_C_2_phospho_d_glycerate
Michaelis constant	R_phosphopyr_R00658	C_phosphoenolpyruvate	1	mM	R00658	C00074	kM_phosphopyr_R00658_C_phosphoenolpyruvate
Michaelis constant	R_phosphopyr_R00658	C_h2o	1	mM	R00658	C00001	kM_phosphopyr_R00658_C_h2o
Michaelis constant	R_pyruvate_k_R00200	C_adp	1	mM	R00200	C00008	kM_pyruvate_k_R00200_C_adp
Michaelis constant	R_pyruvate_k_R00200	C_phosphoenolpyruvate	1	mM	R00200	C00074	kM_pyruvate_k_R00200_C_phosphoenolpyruvate
Michaelis constant	R_pyruvate_k_R00200	C_pyruvate	1	mM	R00200	C00022	kM_pyruvate_k_R00200_C_pyruvate
Michaelis constant	R_pyruvate_k_R00200	C_atp	1	mM	R00200	C00002	kM_pyruvate_k_R00200_C_atp
Michaelis constant	R_pyruvate_d_R00224	C_pyruvate	1	mM	R00224	C00022	kM_pyruvate_d_R00224_C_pyruvate
Michaelis constant	R_pyruvate_d_R00224	C_acetaldehyde	1	mM	R00224	C00084	kM_pyruvate_d_R00224_C_acetaldehyde
Michaelis constant	R_pyruvate_d_R00224	C_co2	1	mM	R00224	C00011	kM_pyruvate_d_R00224_C_co2
Michaelis constant	R_adh_R00754	C_acetaldehyde	1	mM	R00754	C00084	kM_retinal_re_R00754_C_acetaldehyde
Michaelis constant	R_adh_R00754	C_nadh	1	mM	R00754	C00004	kM_retinal_re_R00754_C_nadh
Michaelis constant	R_adh_R00754	C_ethanol	1	mM	R00754	C00469	kM_retinal_re_R00754_C_ethanol
Michaelis constant	R_adh_R00754	C_nad	1	mM	R00754	C00003	kM_retinal_re_R00754_C_nad
protein molecular mass	R_glucokinas_R00299		10000	Da	R00299		
protein molecular mass	R_phosphohex_R00771		10000	Da	R00771		
protein molecular mass	R_6_phosphof_R04779		10000	Da	R04779		
protein molecular mass	R_fructose_b_R01070		10000	Da	R01070		
protein molecular mass	R_triose_pho_R01015		10000	Da	R01015		
protein molecular mass	R_glyceralde_R01061		10000	Da	R01061		
protein molecular mass	R_phosphogly_R01512		10000	Da	R01512		
protein molecular mass	R_phosphogly_R01518		10000	Da	R01518		
protein molecular mass	R_phosphopyr_R00658		10000	Da	R00658		
protein molecular mass	R_pyruvate_k_R00200		10000	Da	R00200		
protein molecular mass	R_pyruvate_d_R00224		10000	Da	R00224		
protein molecular mass	R_adh_R00754		10000	Da	R00754		
molecular mass		C_h2o	18	Da		C00001	
molecular mass		C_atp	507	Da		C00002	
molecular mass		C_nad	664.1	Da		C00003	
molecular mass		C_nadh	665.1	Da		C00004	
molecular mass		C_adp	427	Da		C00008	
molecular mass		C_orthophosphate	98	Da		C00009	
molecular mass		C_co2	44	Da		C00011	
molecular mass		C_pyruvate	88	Da		C00022	
molecular mass		C_d_glucose	180.1	Da		C00031	
molecular mass		C_phosphoenolpyruvate	168	Da		C00074	
molecular mass		C_acetaldehyde	44	Da		C00084	
molecular mass		C_d_fructose_6_phosphoric_acid	260	Da		C00085	
molecular mass		C_glucose_6_phosphate	260	Da		C00092	
molecular mass		C_glycerone_phosphate	170	Da		C00111	
molecular mass		C_d_glyceraldehyde_3_phosphate	170	Da		C00118	
molecular mass		C_3_phospho_d_glycerate	186	Da		C00197	
molecular mass		C_3_phospho_d_glyceroyl_phosphate	266	Da		C00236	
molecular mass		C_ethanol	46	Da		C00469	
molecular mass		C_2_phospho_d_glycerate	186	Da		C00631	
molecular mass		C_fructose_16_bisphosphate	340	Da		C05378	
