,,mean
dfg0,glc__D_e,-907.9892087852303
dfg0,gln__L_c,-517.9755289274719
dfg0,gln__L_e,-517.7904289728746
dfg0,glu__L_c,-680.347554509608
dfg0,glu__L_e,-688.3709707157326
dfg0,glx_c,-462.3489758151987
dfg0,h2o_c,-237.0010272292479
dfg0,h2o_e,-236.99529069346352
dfg0,h_c,-54.61216200101939
dfg0,h_e,-40.97045150346485
dfg0,icit_c,-1133.552823072022
dfg0,lac__D_c,-498.9320604231225
dfg0,lac__D_e,-507.216186630583
dfg0,mal__L_c,-824.0741965213537
dfg0,mal__L_e,-840.6669356143511
dfg0,nad_c,-2237.9862509077902
dfg0,nadh_c,-2205.9993205567894
dfg0,nadp_c,-3064.9770313012764
dfg0,nadph_c,-3032.693506442452
dfg0,nh4_c,-88.85991434371869
dfg0,13dpg_c,-2332.6586208782337
dfg0,nh4_e,-80.1593246374498
dfg0,o2_c,14.429440954048708
dfg0,2pg_c,-1481.1915431267312
dfg0,o2_e,14.429440954048708
dfg0,3pg_c,-1485.3951969815178
dfg0,oaa_c,-777.9459848757482
dfg0,pep_c,-1248.1106527585057
dfg0,6pgc_c,-1940.1221662666817
dfg0,pi_c,-1081.3913664710994
dfg0,6pgl_c,-1730.473680097222
dfg0,pi_e,-1098.3252964407866
dfg0,ac_c,-359.2281857629752
dfg0,pyr_c,-458.66083680757447
dfg0,pyr_e,-466.9500725372096
dfg0,q8_c,413.91476109542464
dfg0,q8h2_c,267.84582214751146
dfg0,r5p_c,-1580.6537052543692
dfg0,ru5p__D_c,-1576.4562257150662
dfg0,ac_e,-367.5212609177151
dfg0,acald_c,-137.73184889604164
dfg0,s7p_c,-1889.9987628241954
dfg0,acald_e,-137.7203758244728
dfg0,accoa_c,-3188.119632619541
dfg0,succ_c,-662.6882296596226
dfg0,succ_e,-679.3019574986987
dfg0,succoa_c,-3498.5361139652673
dfg0,acon_C_c,-895.2179215735925
dfg0,xu5p__D_c,-1579.7332070444538
dfg0,actp_c,-1211.379820718524
dfg0,adp_c,-1878.8596948335319
dfg0,akg_c,-774.8854598586379
dfg0,akg_e,-791.4699930547807
dfg0,amp_c,-1012.6705084696348
dfg0,atp_c,-2745.655071459888
dfg0,cit_c,-1141.4015007252826
dfg0,co2_c,-386.9261557228919
dfg0,co2_e,-386.9261557228919
dfg0,coa_c,-3048.7491816055594
dfg0,dhap_c,-1277.6518357304763
dfg0,e4p_c,-1422.461594000945
dfg0,etoh_c,-175.51153010179303
dfg0,etoh_e,-175.49432049443982
dfg0,f6p_c,-1740.612181159388
dfg0,fdp_c,-2574.4751087951167
dfg0,for_c,-339.49370755959126
dfg0,for_e,-347.7907471707455
dfg0,fru_e,-908.1169364024358
dfg0,fum_c,-583.6463782314815
dfg0,fum_e,-600.2372876429819
dfg0,g3p_c,-1272.0446662616944
dfg0,g6p_c,-1743.0122859228063
drg0,PFK,-21.679713010392106
drg0,PFL,-20.203321765998226
drg0,PGI,2.4001047634183124
drg0,PGK,19.531952729640125
drg0,PGL,-27.259620941231105
drg0,ACALD,-24.263833767958204
drg0,AKGt2r,2.942822698588202
drg0,PGM,-4.20365385478658
drg0,PIt2r,3.292219472132551
drg0,ALCD2x,15.154449555732754
drg0,ACALDt,-0.011473071568843807
drg0,ACKr,14.643741670807458
drg0,PPC,-41.91167763722149
drg0,ACONTa,9.182551922442173
drg0,ACONTb,-1.3338742691814787
drg0,ATPM,-32.207124616514875
drg0,PPCK,9.704553020706499
drg0,ACt2r,-5.348635342814646
drg0,PPS,-10.079916204568235
drg0,ADK1,0.6061902624589948
drg0,AKGDH,-29.8406978729613
drg0,ATPS4r,-22.359717373703234
drg0,PTAr,9.381996766557222
drg0,PYK,-22.733398674405407
drg0,PYRt2,-5.352474767919375
drg0,CO2t,0.0
drg0,RPE,-3.2769813293875814
drg0,CS,-41.69619960732439
drg0,RPI,4.1974795393030035
drg0,SUCCt2_2,-10.669693156032963
drg0,CYTBD,-70.86338776324999
drg0,D_LACt2,-5.357584290093996
drg0,ENO,-3.920136861022428
drg0,SUCCt3,-30.255438336630732
drg0,ETOHt2r,-13.658920104907736
drg0,SUCDi,-67.02708751977207
drg0,SUCOAS,-1.6946925448287402
drg0,TALA,-1.0303460744432869
drg0,THD2,-26.986826487285725
drg0,TKT1,-1.656516787066721
drg0,TKT2,-10.462046375683485
drg0,TPI,5.607169468781876
drg0,FBA,24.778606802946115
drg0,FBP,-10.527411606122769
drg0,FORt2,-5.3446708864003085
drg0,FORt,8.297039611154219
drg0,FRD7,67.02708751977207
drg0,FRUpts2,-43.04542880602094
drg0,FUM,-3.4267910606241685
drg0,FUMt2_2,-10.692511583608734
drg0,G6PDH2r,-9.790031316610111
drg0,GAPD,-1.8478197954586904
drg0,GLCpts,-45.5732611866448
drg0,GLNS,-17.97621191990811
drg0,GLNabc,-32.39222457111214
drg0,GLUDy,31.27457039430419
drg0,GLUN,-14.230912696606794
drg0,GLUSy,-45.505483090911184
drg0,GLUt2r,-5.618294291430061
drg0,GND,9.023309687548135
drg0,H2Ot,-0.005736535784393482
drg0,ICDHyr,4.024732349316309
drg0,ICL,8.515617597200674
drg0,LDH_D,17.645991965529447
drg0,MALS,-39.96590446394521
drg0,MALt2_2,-10.690681902111578
drg0,MDH,23.502979995586884
drg0,ME1,10.474134341888202
drg0,ME2,10.770728849711759
drg0,NADH16,-82.51857580523074
drg0,NADTRHD,-0.29659450782355634
drg0,NH4t,-8.700589706268886
drg0,O2t,0.0
drg0,PDH,-35.648839578298066
ln_kv,PFK_0,1.4916971789128417
ln_kv,PFK_1,2.790887548969458
ln_kv,PFL_0,0.13718752628176123
ln_kv,PFL_1,0.01238359104483333
ln_kv,PFL_2,0.6228348403806048
ln_kv,PFL_3,-0.24759952132768914
ln_kv,PGI,5.543758604251101
ln_kv,PGK,3.6582990676271936
ln_kv,PGL,1.2308202212438266
ln_kv,ACALD_0,-0.4039913896790033
ln_kv,ACALD_1,-0.3976317464922672
ln_kv,AKGt2r,1.8253306999336227
ln_kv,PGM_0,2.949009651361771
ln_kv,PGM_1,4.021714941615581
ln_kv,PIt2r_0,1.9207073117348883
ln_kv,PIt2r_1,1.2968832152118648
ln_kv,ALCD2x_0,1.890691071377132
ln_kv,ALCD2x_1,3.6744868254961314
ln_kv,ALCD2x_2,3.4066213582854643
ln_kv,ACKr_0,3.2521294927066897
ln_kv,ACKr_1,7.044706007419445
ln_kv,PPC,1.2096541002413228
ln_kv,ACONTa_0,3.4355309247778476
ln_kv,ACONTa_1,2.66068576276792
ln_kv,ACONTb_0,1.2997594346825394
ln_kv,ACONTb_1,1.7278520522888887
ln_kv,PPCK,2.0720939756604695
ln_kv,PPS,2.3789506534331712
ln_kv,ADK1,1.5278789405513067
ln_kv,AKGDH,2.056229612373204
ln_kv,ATPS4r_0,1.0588855029108026
ln_kv,ATPS4r_1,1.8287685027609153
ln_kv,PTAr_0,4.582755250065363
ln_kv,PTAr_1,4.138290635148794
ln_kv,PYK_0,2.78988679112705
ln_kv,PYK_1,1.5542804465388347
ln_kv,RPE_0,4.6034768729473825
ln_kv,RPE_1,3.665020228218797
ln_kv,CS,2.83562659020431
ln_kv,RPI_0,7.105832959776711
ln_kv,RPI_1,7.572697389052369
ln_kv,SUCCt2_2,1.586792863837331
ln_kv,CYTBD_0,0.12906842032919086
ln_kv,CYTBD_1,0.7817950505757602
ln_kv,D_LACt2_0,1.2170379435421514
ln_kv,D_LACt2_1,0.6071536825692725
ln_kv,ENO,2.6644138913677233
ln_kv,SUCDi,0.7138804788025851
ln_kv,SUCOAS,3.613018620493358
ln_kv,TALA_0,2.7399255549516557
ln_kv,TALA_1,2.6505610910610553
ln_kv,THD2,3.026149833003433
ln_kv,TKT1_0,3.0177318193034823
ln_kv,TKT1_1,1.5655324764634688
ln_kv,TKT2_0,4.900325657421683
ln_kv,TKT2_1,5.365679391516634
ln_kv,TPI,7.76756330529774
ln_kv,FBA_0,1.8609167125504422
ln_kv,FBA_1,1.6468054988646355
ln_kv,FBA_2,1.0480435766287894
ln_kv,FBP_0,-0.1307008712374833
ln_kv,FBP_1,0.9843123716626693
ln_kv,FORt2_0,1.410572535945633
ln_kv,FORt2_1,1.2647040918082764
ln_kv,FORt_0,1.0514910594903923
ln_kv,FORt_1,0.6696893239972463
ln_kv,FRD7,0.7561562468192661
ln_kv,FRUpts2,0.5519668810292219
ln_kv,FUM_0,6.534893695593682
ln_kv,FUM_1,5.255535675266024
ln_kv,FUM_2,6.444380134959554
ln_kv,FUMt2_2,1.167944252155651
ln_kv,G6PDH2r,3.3917852998847615
ln_kv,GAPD,2.9749500668106776
ln_kv,GLCpts_0,0.5283888025626956
ln_kv,GLCpts_1,0.6018075044389031
ln_kv,GLCpts_2,0.6322629372426138
ln_kv,GLNS_0,1.55062184365124
ln_kv,GLNS_1,1.1270037433667937
ln_kv,GLNabc,0.725507982583198
ln_kv,GLUDy,4.482233096477739
ln_kv,GLUN_0,2.27618089267788
ln_kv,GLUN_1,1.701216058244059
ln_kv,GLUSy,3.8150528851838974
ln_kv,GLUt2r,0.849694356787857
ln_kv,GND,1.2714060360566708
ln_kv,H2Ot,1.4541196334331592
ln_kv,ICDHyr,3.0899843714889643
ln_kv,ICL,1.0211849916530717
ln_kv,LDH_D_0,3.6958337088923106
ln_kv,LDH_D_1,4.451473071322927
ln_kv,MALS_0,1.435279181086564
ln_kv,MALS_1,0.5070340892274283
ln_kv,MALt2_2,0.2743337244191102
ln_kv,MDH,6.8810159284878925
ln_kv,ME1,2.4063758471570904
ln_kv,ME2,1.0035036151686285
ln_kv,NADH16,1.0713635402523833
ln_kv,NADTRHD,3.8554486200767153
ln_kv,NH4t,-0.011057646694866197
ln_kv,PDH,0.5827201301970614
ln_kcat_fw,PFK_0,4.476348920999101
ln_kcat_fw,PFK_1,5.350093980633403
ln_kcat_fw,PFL_0,2.088927226042756
ln_kcat_fw,PFL_1,1.6637081054241207
ln_kcat_fw,PFL_2,1.880273177245499
ln_kcat_fw,PFL_3,1.4336110767422952
ln_kcat_fw,PGI,4.877413493920854
ln_kcat_fw,PGK,2.0845397689779475
ln_kcat_fw,PGL,4.275192860228924
ln_kcat_fw,ACALD_0,1.6388503820581377
ln_kcat_fw,ACALD_1,1.300487761669416
ln_kcat_fw,AKGt2r,1.3201542092917293
ln_kcat_fw,PGM_0,2.7656403305449473
ln_kcat_fw,PGM_1,4.695287171487415
ln_kcat_fw,PIt2r_0,1.590678571869553
ln_kcat_fw,PIt2r_1,0.7772572461909153
ln_kcat_fw,ALCD2x_0,0.42155635199168273
ln_kcat_fw,ALCD2x_1,1.8884887046230574
ln_kcat_fw,ALCD2x_2,1.9840463935183834
ln_kcat_fw,ACKr_0,3.2544771590119694
ln_kcat_fw,ACKr_1,6.708602568226809
ln_kcat_fw,PPC,6.119544608948445
ln_kcat_fw,ACONTa_0,3.284631303175175
ln_kcat_fw,ACONTa_1,2.435600918495915
ln_kcat_fw,ACONTb_0,2.597219301748936
ln_kcat_fw,ACONTb_1,3.122603385088553
ln_kcat_fw,PPCK,2.9996385489391173
ln_kcat_fw,PPS,4.45956439485542
ln_kcat_fw,ADK1,0.9659842426987666
ln_kcat_fw,AKGDH,3.5857028293900157
ln_kcat_fw,ATPS4r_0,1.4497339630686668
ln_kcat_fw,ATPS4r_1,2.26826470214786
ln_kcat_fw,PTAr_0,3.3655592090937034
ln_kcat_fw,PTAr_1,2.978725856562164
ln_kcat_fw,PYK_0,4.994668820338148
ln_kcat_fw,PYK_1,3.0559461255351152
ln_kcat_fw,RPE_0,3.744102604388624
ln_kcat_fw,RPE_1,3.3295950132080687
ln_kcat_fw,CS,4.09425899162585
ln_kcat_fw,RPI_0,7.717211839845447
ln_kcat_fw,RPI_1,7.891923937393813
ln_kcat_fw,SUCCt2_2,3.203248203020877
ln_kcat_fw,CYTBD_0,8.135229553935773
ln_kcat_fw,CYTBD_1,9.582847915065202
ln_kcat_fw,D_LACt2_0,2.1094939191501396
ln_kcat_fw,D_LACt2_1,1.9012439752666666
ln_kcat_fw,ENO,2.575939889640601
ln_kcat_fw,SUCDi,6.7760108349484085
ln_kcat_fw,SUCOAS,2.981988984399436
ln_kcat_fw,TALA_0,2.5208745569915436
ln_kcat_fw,TALA_1,3.108061876332016
ln_kcat_fw,THD2,6.675939607247756
ln_kcat_fw,TKT1_0,3.041294279348044
ln_kcat_fw,TKT1_1,1.4617671554064984
ln_kcat_fw,TKT2_0,6.761604222243875
ln_kcat_fw,TKT2_1,7.163044692076028
ln_kcat_fw,TPI,7.418172760548487
ln_kcat_fw,FBA_0,0.6597028925684754
ln_kcat_fw,FBA_1,0.16416250275329958
ln_kcat_fw,FBA_2,1.18760562838375
ln_kcat_fw,FBP_0,1.9383536624969793
ln_kcat_fw,FBP_1,3.1410392904189166
ln_kcat_fw,FORt2_0,2.3338791097002556
ln_kcat_fw,FORt2_1,2.358455706159795
ln_kcat_fw,FORt_0,-0.12684374656303987
ln_kcat_fw,FORt_1,-0.42922284895226426
ln_kcat_fw,FRD7,-4.379939920292898
ln_kcat_fw,FRUpts2,4.3581767502488615
ln_kcat_fw,FUM_0,6.400013338639383
ln_kcat_fw,FUM_1,5.8482825987862554
ln_kcat_fw,FUM_2,7.239810874632269
ln_kcat_fw,FUMt2_2,3.1045611138567892
ln_kcat_fw,G6PDH2r,5.000655515357153
ln_kcat_fw,GAPD,2.6143958641084737
ln_kcat_fw,GLCpts_0,5.939678368639221
ln_kcat_fw,GLCpts_1,5.672895324822349
ln_kcat_fw,GLCpts_2,5.80476718313983
ln_kcat_fw,GLNS_0,2.429656821612525
ln_kcat_fw,GLNS_1,3.441032105388956
ln_kcat_fw,GLNabc,5.869212479673024
ln_kcat_fw,GLUDy,2.9459349428987025
ln_kcat_fw,GLUN_0,4.753719630330039
ln_kcat_fw,GLUN_1,4.321890850202578
ln_kcat_fw,GLUSy,6.284302189424011
ln_kcat_fw,GLUt2r,1.7612865620559148
ln_kcat_fw,GND,2.648089568421028
ln_kcat_fw,H2Ot,1.4552319124410147
ln_kcat_fw,ICDHyr,4.448576699352941
ln_kcat_fw,ICL,3.3078921534109753
ln_kcat_fw,LDH_D_0,1.8486130746596814
ln_kcat_fw,LDH_D_1,3.5544164771289957
ln_kcat_fw,MALS_0,4.659638271160929
ln_kcat_fw,MALS_1,3.485145498496081
ln_kcat_fw,MALt2_2,2.2558041542551166
ln_kcat_fw,MDH,5.3549729461835796
ln_kcat_fw,ME1,3.5899481691781716
ln_kcat_fw,ME2,2.797384126490215
ln_kcat_fw,NADH16,8.048746199322409
ln_kcat_fw,NADTRHD,5.232000505712449
ln_kcat_fw,NH4t,1.5982429249966037
ln_kcat_fw,PDH,3.505782436143349
ln_kcat_bw,PFK_0,-1.4929545631734413
ln_kcat_bw,PFK_1,0.2316811173055271
ln_kcat_bw,PFL_0,-1.8145521734792283
ln_kcat_bw,PFL_1,-1.6389409233345305
ln_kcat_bw,PFL_2,-0.6346034964842602
ln_kcat_bw,PFL_3,-1.9288101193976672
ln_kcat_bw,PGI,6.210103714581349
ln_kcat_bw,PGK,5.232058366276419
ln_kcat_bw,PGL,-1.8135524177412323
ln_kcat_bw,ACALD_0,-2.4468331614161514
ln_kcat_bw,ACALD_1,-2.0957512546539476
ln_kcat_bw,AKGt2r,2.3305071905755312
ln_kcat_bw,PGM_0,3.1323789721785946
ln_kcat_bw,PGM_1,3.3481427117437548
ln_kcat_bw,PIt2r_0,2.2507360516002226
ln_kcat_bw,PIt2r_1,1.816509184232812
ln_kcat_bw,ALCD2x_0,3.3598257907626135
ln_kcat_bw,ALCD2x_1,5.460484946369206
ln_kcat_bw,ALCD2x_2,4.8291963230525425
ln_kcat_bw,ACKr_0,3.249781826401403
ln_kcat_bw,ACKr_1,7.380809446612091
ln_kcat_bw,PPC,-3.7002364084657984
ln_kcat_bw,ACONTa_0,3.5864305463805266
ln_kcat_bw,ACONTa_1,2.885770607039923
ln_kcat_bw,ACONTb_0,0.0022995676161201573
ln_kcat_bw,ACONTb_1,0.3331007194892095
ln_kcat_bw,PPCK,1.1445494023818696
ln_kcat_bw,PPS,0.29833691201088186
ln_kcat_bw,ADK1,2.089773638403841
ln_kcat_bw,AKGDH,0.5267563953564149
ln_kcat_bw,ATPS4r_0,0.6680370427529567
ln_kcat_bw,ATPS4r_1,1.3892723033739571
ln_kcat_bw,PTAr_0,5.799951291037132
ln_kcat_bw,PTAr_1,5.2978554137354195
ln_kcat_bw,PYK_0,0.5851047619159715
ln_kcat_bw,PYK_1,0.052614767542536356
ln_kcat_bw,RPE_0,5.462851141506169
ln_kcat_bw,RPE_1,4.000445443229525
ln_kcat_bw,CS,1.5769941887827486
ln_kcat_bw,RPI_0,6.494454079707964
ln_kcat_bw,RPI_1,7.253470840710918
ln_kcat_bw,SUCCt2_2,-0.029662475346214023
ln_kcat_bw,CYTBD_0,-7.877092713277392
ln_kcat_bw,CYTBD_1,-8.019257813913669
ln_kcat_bw,D_LACt2_0,0.32458196793416505
ln_kcat_bw,D_LACt2_1,-0.6869366101281287
ln_kcat_bw,ENO,2.7528878930948437
ln_kcat_bw,SUCDi,-5.34824987734325
ln_kcat_bw,SUCOAS,4.244048256587291
ln_kcat_bw,TALA_0,2.958976552911736
ln_kcat_bw,TALA_1,2.1930603057901124
ln_kcat_bw,THD2,-0.6236399412408673
ln_kcat_bw,TKT1_0,2.9941693592589402
ln_kcat_bw,TKT1_1,1.6692977975204286
ln_kcat_bw,TKT2_0,3.0390470925994464
ln_kcat_bw,TKT2_1,3.5683140909571875
ln_kcat_bw,TPI,8.116953850046968
ln_kcat_bw,FBA_0,3.0621305325324215
ln_kcat_bw,FBA_1,3.129448494975975
ln_kcat_bw,FBA_2,0.9084815248738494
ln_kcat_bw,FBP_0,-2.1997554049719383
ln_kcat_bw,FBP_1,-1.172414547093581
ln_kcat_bw,FORt2_0,0.48726596219101026
ln_kcat_bw,FORt2_1,0.17095247745675834
ln_kcat_bw,FORt_0,2.2298258655438303
ln_kcat_bw,FORt_1,1.768601496946765
ln_kcat_bw,FRD7,5.8922524139314305
ln_kcat_bw,FRUpts2,-3.2542429881904296
ln_kcat_bw,FUM_0,6.669774052547979
ln_kcat_bw,FUM_1,4.662788751745808
ln_kcat_bw,FUM_2,5.648949395286849
ln_kcat_bw,FUMt2_2,-0.7686726095454901
ln_kcat_bw,G6PDH2r,1.782915084412366
ln_kcat_bw,GAPD,3.335504269512967
ln_kcat_bw,GLCpts_0,-4.882900763513817
ln_kcat_bw,GLCpts_1,-4.4692803159445305
ln_kcat_bw,GLCpts_2,-4.5402413086546005
ln_kcat_bw,GLNS_0,0.6715868656899602
ln_kcat_bw,GLNS_1,-1.1870246186553572
ln_kcat_bw,GLNabc,-4.418196514506633
ln_kcat_bw,GLUDy,6.018531250056753
ln_kcat_bw,GLUN_0,-0.20135784497426812
ln_kcat_bw,GLUN_1,-0.919458733714464
ln_kcat_bw,GLUSy,1.3458035809438798
ln_kcat_bw,GLUt2r,-0.06189784848021418
ln_kcat_bw,GND,-0.10527749630773542
ln_kcat_bw,H2Ot,1.4530073544253028
ln_kcat_bw,ICDHyr,1.7313920436249646
ln_kcat_bw,ICL,-1.2655221701048447
ln_kcat_bw,LDH_D_0,5.543054343124879
ln_kcat_bw,LDH_D_1,5.348529665516878
ln_kcat_bw,MALS_0,-1.7890799089877873
ln_kcat_bw,MALS_1,-2.4710773200412177
ln_kcat_bw,MALt2_2,-1.7071367054169002
ln_kcat_bw,MDH,8.407058910792216
ln_kcat_bw,ME1,1.2228035251360438
ln_kcat_bw,ME2,-0.7903768961529067
ln_kcat_bw,NADH16,-5.906019118817653
ln_kcat_bw,NADTRHD,2.478896734440923
ln_kcat_bw,NH4t,-1.6203582183863352
ln_kcat_bw,PDH,-2.340342175749228
ln_km,atp_c_PFK_0,-10.037097756841902
ln_km,f6p_c_PFK_0,-8.564177250281022
ln_km,adp_c_PFK_0,-7.968624751072509
ln_km,fdp_c_PFK_0,-8.194827703111086
ln_km,atp_c_PFK_1,-9.40042220357339
ln_km,f6p_c_PFK_1,-8.673544331697997
ln_km,adp_c_PFK_1,-7.429070226706368
ln_km,fdp_c_PFK_1,-7.356183134780978
ln_km,coa_c_PFL_0,-11.677782741325446
ln_km,pyr_c_PFL_0,-6.209053803320875
ln_km,accoa_c_PFL_0,-10.443668561364204
ln_km,for_c_PFL_0,-3.512047710121257
ln_km,coa_c_PFL_1,-11.079222482469563
ln_km,pyr_c_PFL_1,-6.1388863000327865
ln_km,accoa_c_PFL_1,-8.754208676278337
ln_km,for_c_PFL_1,-3.9319494622997535
ln_km,coa_c_PFL_2,-12.075858765228238
ln_km,pyr_c_PFL_2,-6.763624703087876
ln_km,accoa_c_PFL_2,-10.012419998089115
ln_km,for_c_PFL_2,-3.5073404712738583
ln_km,coa_c_PFL_3,-11.125254803372126
ln_km,pyr_c_PFL_3,-5.831970895738707
ln_km,accoa_c_PFL_3,-8.367575528401389
ln_km,for_c_PFL_3,-4.117471694166567
ln_km,g6p_c_PGI,-6.0725444250302045
ln_km,f6p_c_PGI,-5.670585309465858
ln_km,3pg_c_PGK,-7.5725499437199115
ln_km,atp_c_PGK,-7.893457854527042
ln_km,13dpg_c_PGK,-11.050361296084066
ln_km,adp_c_PGK,-8.84237892332967
ln_km,6pgl_c_PGL,-10.273133840670743
ln_km,6pgc_c_PGL,-5.790933420836979
ln_km,acald_c_ACALD_0,-5.136175617552656
ln_km,coa_c_ACALD_0,-9.775502946534631
ln_km,nad_c_ACALD_0,-11.071272724135644
ln_km,accoa_c_ACALD_0,-9.956949230069055
ln_km,nadh_c_ACALD_0,-10.702469320352812
ln_km,acald_c_ACALD_1,-6.245617098972684
ln_km,coa_c_ACALD_1,-9.972244385470837
ln_km,nad_c_ACALD_1,-10.23419714361977
ln_km,accoa_c_ACALD_1,-9.884649145291352
ln_km,nadh_c_ACALD_1,-10.554432217819729
ln_km,akg_e_AKGt2r,-8.060162912265055
ln_km,akg_c_AKGt2r,-8.191000375709311
ln_km,2pg_c_PGM_0,-9.615634946322487
ln_km,3pg_c_PGM_0,-7.618771046266856
ln_km,2pg_c_PGM_1,-8.50534952088289
ln_km,3pg_c_PGM_1,-8.222368722204507
ln_km,pi_e_PIt2r_0,-5.877391709539924
ln_km,pi_c_PIt2r_0,-6.494016445611001
ln_km,pi_e_PIt2r_1,-5.450189979113455
ln_km,pi_c_PIt2r_1,-5.687620256873298
ln_km,etoh_c_ALCD2x_0,-4.488967946464993
ln_km,nad_c_ALCD2x_0,-9.156240858750866
ln_km,acald_c_ALCD2x_0,-7.136602391871813
ln_km,nadh_c_ALCD2x_0,-9.447046107070799
ln_km,etoh_c_ALCD2x_1,-6.388089811942403
ln_km,nad_c_ALCD2x_1,-8.89849188657794
ln_km,acald_c_ALCD2x_1,-7.0044559643506785
ln_km,nadh_c_ALCD2x_1,-10.586838624921318
ln_km,etoh_c_ALCD2x_2,-5.085191155596228
ln_km,nad_c_ALCD2x_2,-9.08556478910195
ln_km,acald_c_ALCD2x_2,-7.428092402298303
ln_km,nadh_c_ALCD2x_2,-9.774222745363558
ln_km,ac_c_ACKr_0,-4.323190260293102
ln_km,atp_c_ACKr_0,-7.006983203732838
ln_km,actp_c_ACKr_0,-7.77483555561
ln_km,adp_c_ACKr_0,-9.238696137642055
ln_km,ac_c_ACKr_1,-4.387257010950826
ln_km,atp_c_ACKr_1,-8.027135418429937
ln_km,actp_c_ACKr_1,-8.823415485817078
ln_km,adp_c_ACKr_1,-8.59743296179401
ln_km,co2_c_PPC,-8.983170436040563
ln_km,pep_c_PPC,-8.80643018305172
ln_km,oaa_c_PPC,-7.344824834560368
ln_km,pi_c_PPC,-4.011723743038574
ln_km,cit_c_ACONTa_0,-5.924315764011196
ln_km,acon_C_c_ACONTa_0,-9.18339720761619
ln_km,cit_c_ACONTa_1,-6.727057708237396
ln_km,acon_C_c_ACONTa_1,-9.837768706503743
ln_km,acon_C_c_ACONTb_0,-5.426027900560508
ln_km,icit_c_ACONTb_0,-7.503687600241087
ln_km,acon_C_c_ACONTb_1,-5.604543816933196
ln_km,icit_c_ACONTb_1,-7.87678644808032
ln_km,atp_c_PPCK,-8.849909604203736
ln_km,oaa_c_PPCK,-8.799074529274414
ln_km,adp_c_PPCK,-8.611134041308505
ln_km,co2_c_PPCK,-5.705550272843288
ln_km,pep_c_PPCK,-8.950695257798488
ln_km,atp_c_PPS,-10.565809019096307
ln_km,pyr_c_PPS,-10.096140284943083
ln_km,amp_c_PPS,-8.245354334334479
ln_km,pep_c_PPS,-8.678884514997128
ln_km,pi_c_PPS,-3.990070420038977
ln_km,amp_c_ADK1,-10.474635369079115
ln_km,atp_c_ADK1,-9.569424884066402
ln_km,adp_c_ADK1,-9.577671992431247
ln_km,akg_c_AKGDH,-10.363737399830118
ln_km,coa_c_AKGDH,-11.89818474892045
ln_km,nad_c_AKGDH,-9.087179063755498
ln_km,co2_c_AKGDH,-5.969336091205654
ln_km,nadh_c_AKGDH,-8.792693759633375
ln_km,succoa_c_AKGDH,-8.07416221195207
ln_km,adp_c_ATPS4r_0,-8.916562674290677
ln_km,pi_c_ATPS4r_0,-6.530048762249567
ln_km,atp_c_ATPS4r_0,-7.5574849919517195
ln_km,adp_c_ATPS4r_1,-8.855412698352566
ln_km,pi_c_ATPS4r_1,-6.933287678616453
ln_km,atp_c_ATPS4r_1,-7.996869410838583
ln_km,accoa_c_PTAr_0,-9.69223584336356
ln_km,pi_c_PTAr_0,-6.873522117513243
ln_km,actp_c_PTAr_0,-7.064677773048856
ln_km,coa_c_PTAr_0,-10.70491104999865
ln_km,accoa_c_PTAr_1,-8.734744060990785
ln_km,pi_c_PTAr_1,-7.208031112720972
ln_km,actp_c_PTAr_1,-7.594736252730124
ln_km,coa_c_PTAr_1,-9.667132307922811
ln_km,adp_c_PYK_0,-7.898690542490531
ln_km,pep_c_PYK_0,-9.029949637035568
ln_km,atp_c_PYK_0,-6.828536733145813
ln_km,pyr_c_PYK_0,-5.693935127901149
ln_km,adp_c_PYK_1,-8.534616151069107
ln_km,pep_c_PYK_1,-9.484908865560891
ln_km,atp_c_PYK_1,-7.214793396199239
ln_km,pyr_c_PYK_1,-4.992330601521972
ln_km,ru5p__D_c_RPE_0,-8.97836762888205
ln_km,xu5p__D_c_RPE_0,-5.988846040284574
ln_km,ru5p__D_c_RPE_1,-8.56743535602982
ln_km,xu5p__D_c_RPE_1,-6.625811874528384
ln_km,accoa_c_CS,-11.118555026472048
ln_km,oaa_c_CS,-11.652596605205613
ln_km,cit_c_CS,-2.2191739569614857
ln_km,coa_c_CS,-6.899969148187865
ln_km,r5p_c_RPI_0,-5.525437562577679
ln_km,ru5p__D_c_RPI_0,-8.375926257539124
ln_km,r5p_c_RPI_1,-5.529763678933882
ln_km,ru5p__D_c_RPI_1,-7.795947710440759
ln_km,succ_e_SUCCt2_2,-7.52617812535285
ln_km,succ_c_SUCCt2_2,-6.621513038898582
ln_km,o2_c_CYTBD_0,-11.291172135506326
ln_km,q8h2_c_CYTBD_0,-11.353351860181016
ln_km,q8_c_CYTBD_0,-5.5313100658809375
ln_km,o2_c_CYTBD_1,-10.765550474136072
ln_km,q8h2_c_CYTBD_1,-11.063934650315355
ln_km,q8_c_CYTBD_1,-6.568865487095854
ln_km,lac__D_e_D_LACt2_0,-5.164161865566275
ln_km,lac__D_c_D_LACt2_0,-4.871468529309983
ln_km,lac__D_e_D_LACt2_1,-4.914017457501643
ln_km,lac__D_c_D_LACt2_1,-5.424592755424186
ln_km,2pg_c_ENO,-9.276684847442349
ln_km,pep_c_ENO,-7.579555988386129
ln_km,q8_c_SUCDi,-13.224195807315738
ln_km,succ_c_SUCDi,-9.651516202653266
ln_km,fum_c_SUCDi,-6.019296971353721
ln_km,q8h2_c_SUCDi,-2.9883956681795274
ln_km,atp_c_SUCOAS,-8.687607972936938
ln_km,coa_c_SUCOAS,-10.645086834197736
ln_km,succ_c_SUCOAS,-7.6808397981114895
ln_km,adp_c_SUCOAS,-8.683748804693305
ln_km,pi_c_SUCOAS,-6.339033449306047
ln_km,succoa_c_SUCOAS,-10.07151215550614
ln_km,g3p_c_TALA_0,-8.948007662366559
ln_km,s7p_c_TALA_0,-8.274943840419255
ln_km,e4p_c_TALA_0,-10.292186294455869
ln_km,f6p_c_TALA_0,-6.09310767837033
ln_km,g3p_c_TALA_1,-8.728666772145644
ln_km,s7p_c_TALA_1,-8.013350231917812
ln_km,e4p_c_TALA_1,-10.537399991054377
ln_km,f6p_c_TALA_1,-6.720063049511522
ln_km,nadh_c_THD2,-10.600647758759845
ln_km,nadp_c_THD2,-10.323172687275978
ln_km,nad_c_THD2,-7.532097512134468
ln_km,nadph_c_THD2,-10.226143118355449
ln_km,r5p_c_TKT1_0,-8.754927365136037
ln_km,xu5p__D_c_TKT1_0,-8.540113262280373
ln_km,g3p_c_TKT1_0,-7.797772729468365
ln_km,s7p_c_TKT1_0,-8.902015983768798
ln_km,r5p_c_TKT1_1,-8.144180899563361
ln_km,xu5p__D_c_TKT1_1,-8.0842385391146
ln_km,g3p_c_TKT1_1,-7.584262244814459
ln_km,s7p_c_TKT1_1,-7.794249717481277
ln_km,e4p_c_TKT2_0,-8.565222178966241
ln_km,xu5p__D_c_TKT2_0,-7.839901219815562
ln_km,f6p_c_TKT2_0,-7.834296225657775
ln_km,g3p_c_TKT2_0,-8.236331405236156
ln_km,e4p_c_TKT2_1,-8.83127404392267
ln_km,xu5p__D_c_TKT2_1,-8.14413796065016
ln_km,f6p_c_TKT2_1,-7.35573344705192
ln_km,g3p_c_TKT2_1,-9.157356261107191
ln_km,dhap_c_TPI,-6.693330001890573
ln_km,g3p_c_TPI,-8.168940262171441
ln_km,fdp_c_FBA_0,-9.194674385358608
ln_km,dhap_c_FBA_0,-8.619206776320098
ln_km,g3p_c_FBA_0,-7.781878901423499
ln_km,fdp_c_FBA_1,-10.061201726488672
ln_km,dhap_c_FBA_1,-8.822566569899873
ln_km,g3p_c_FBA_1,-7.8821880967151
ln_km,fdp_c_FBA_2,-8.350343137221232
ln_km,dhap_c_FBA_2,-9.75958952936161
ln_km,g3p_c_FBA_2,-8.47871664371852
ln_km,fdp_c_FBP_0,-10.032120293415723
ln_km,f6p_c_FBP_0,-5.127200265881475
ln_km,pi_c_FBP_0,-4.960628365122423
ln_km,fdp_c_FBP_1,-12.270015663769398
ln_km,f6p_c_FBP_1,-7.0440218903459915
ln_km,pi_c_FBP_1,-5.457046881055266
ln_km,for_e_FORt2_0,-5.837333102694037
ln_km,for_c_FORt2_0,-5.6113486218438995
ln_km,for_e_FORt2_1,-5.420838793192521
ln_km,for_c_FORt2_1,-5.535744393536166
ln_km,for_e_FORt_0,-3.100543215670715
ln_km,for_c_FORt_0,-3.9613635081787146
ln_km,for_e_FORt_1,-2.9523233931881085
ln_km,for_c_FORt_1,-3.971988951903949
ln_km,fum_c_FRD7,-5.043730157025379
ln_km,q8h2_c_FRD7,-3.1722953802173537
ln_km,q8_c_FRD7,-13.237995773112942
ln_km,succ_c_FRD7,-10.69811751263287
ln_km,fru_e_FRUpts2,-9.059151179214128
ln_km,pep_c_FRUpts2,-10.6630742429992
ln_km,f6p_c_FRUpts2,-5.282936414977568
ln_km,pyr_c_FRUpts2,-5.359220929056836
ln_km,fum_c_FUM_0,-8.50982020344832
ln_km,mal__L_c_FUM_0,-6.911192067000161
ln_km,fum_c_FUM_1,-8.109975037287555
ln_km,mal__L_c_FUM_1,-7.966601461788435
ln_km,fum_c_FUM_2,-7.569591562148416
ln_km,mal__L_c_FUM_2,-7.831585618954285
ln_km,fum_e_FUMt2_2,-8.732733535526348
ln_km,fum_c_FUMt2_2,-8.459542788568271
ln_km,g6p_c_G6PDH2r,-9.17487187137019
ln_km,nadp_c_G6PDH2r,-12.011194867615155
ln_km,6pgl_c_G6PDH2r,-9.527508465293446
ln_km,nadph_c_G6PDH2r,-11.079844980983916
ln_km,g3p_c_GAPD,-7.662723295826218
ln_km,nad_c_GAPD,-8.801339219271282
ln_km,pi_c_GAPD,-6.001251320823754
ln_km,13dpg_c_GAPD,-10.152854042304087
ln_km,nadh_c_GAPD,-10.874789600386434
ln_km,glc__D_e_GLCpts_0,-5.994710321289418
ln_km,pep_c_GLCpts_0,-10.984292552203431
ln_km,g6p_c_GLCpts_0,-4.832610662968901
ln_km,pyr_c_GLCpts_0,-5.2962212221062055
ln_km,glc__D_e_GLCpts_1,-5.831610141865493
ln_km,pep_c_GLCpts_1,-10.976135910573452
ln_km,g6p_c_GLCpts_1,-4.320611429631801
ln_km,pyr_c_GLCpts_1,-4.956560143003186
ln_km,glc__D_e_GLCpts_2,-6.2535507415727025
ln_km,pep_c_GLCpts_2,-10.533882812924363
ln_km,g6p_c_GLCpts_2,-4.341771871700808
ln_km,pyr_c_GLCpts_2,-5.117920054019895
ln_km,atp_c_GLNS_0,-9.89921436591438
ln_km,glu__L_c_GLNS_0,-6.94929908992839
ln_km,nh4_c_GLNS_0,-8.496586199826261
ln_km,adp_c_GLNS_0,-9.1735624405635
ln_km,gln__L_c_GLNS_0,-5.210710847068098
ln_km,pi_c_GLNS_0,-5.7479424553338365
ln_km,atp_c_GLNS_1,-8.086434104330245
ln_km,glu__L_c_GLNS_1,-6.010459589893948
ln_km,nh4_c_GLNS_1,-8.546035821088216
ln_km,adp_c_GLNS_1,-9.587149278791667
ln_km,gln__L_c_GLNS_1,-5.5148371421125635
ln_km,pi_c_GLNS_1,-5.198045949826222
ln_km,atp_c_GLNabc,-11.045278353011572
ln_km,gln__L_e_GLNabc,-8.128842476790417
ln_km,adp_c_GLNabc,-6.122261161851577
ln_km,gln__L_c_GLNabc,-6.317901058890561
ln_km,pi_c_GLNabc,-4.460061350650437
ln_km,glu__L_c_GLUDy,-4.79091691028022
ln_km,nadp_c_GLUDy,-9.702331136935795
ln_km,akg_c_GLUDy,-7.32561221001107
ln_km,nadph_c_GLUDy,-10.299788919102328
ln_km,nh4_c_GLUDy,-5.923144321318416
ln_km,gln__L_c_GLUN_0,-5.542058946420957
ln_km,glu__L_c_GLUN_0,-2.333814650894814
ln_km,nh4_c_GLUN_0,-2.6447488724640325
ln_km,gln__L_c_GLUN_1,-5.012441603037053
ln_km,glu__L_c_GLUN_1,-2.240855321714508
ln_km,nh4_c_GLUN_1,-2.4943629668731715
ln_km,akg_c_GLUSy,-10.808848865236978
ln_km,gln__L_c_GLUSy,-8.305217100343523
ln_km,nadph_c_GLUSy,-11.871057879641503
ln_km,glu__L_c_GLUSy,-4.2481705354355785
ln_km,nadp_c_GLUSy,-9.780814774090713
ln_km,glu__L_e_GLUt2r,-6.199555153515108
ln_km,glu__L_c_GLUt2r,-5.844034144888294
ln_km,6pgc_c_GND,-9.530611010501268
ln_km,nadp_c_GND,-10.13738955664922
ln_km,co2_c_GND,-4.9930098861277
ln_km,nadph_c_GND,-12.90329547260844
ln_km,ru5p__D_c_GND,-8.024190779998206
ln_km,icit_c_ICDHyr,-11.09310113046929
ln_km,nadp_c_ICDHyr,-11.15369307845181
ln_km,akg_c_ICDHyr,-7.928717039764352
ln_km,co2_c_ICDHyr,-6.779897158884784
ln_km,nadph_c_ICDHyr,-11.81610636540001
ln_km,icit_c_ICL,-8.683980126000012
ln_km,glx_c_ICL,-8.727289169832838
ln_km,succ_c_ICL,-7.832357038698381
ln_km,lac__D_c_LDH_D_0,-5.01822816877857
ln_km,nad_c_LDH_D_0,-9.11246361110378
ln_km,nadh_c_LDH_D_0,-10.723059623290192
ln_km,pyr_c_LDH_D_0,-6.556089520270438
ln_km,lac__D_c_LDH_D_1,-3.7206076105018306
ln_km,nad_c_LDH_D_1,-8.895751335624663
ln_km,nadh_c_LDH_D_1,-10.661169993343687
ln_km,pyr_c_LDH_D_1,-7.003974396538316
ln_km,accoa_c_MALS_0,-11.221570828380601
ln_km,glx_c_MALS_0,-11.156880484539704
ln_km,coa_c_MALS_0,-8.439112041166872
ln_km,mal__L_c_MALS_0,-4.889771295876432
ln_km,accoa_c_MALS_1,-11.57765661668034
ln_km,glx_c_MALS_1,-10.853567777212664
ln_km,coa_c_MALS_1,-8.56375300043924
ln_km,mal__L_c_MALS_1,-4.325408055965393
ln_km,mal__L_e_MALt2_2,-6.3120890500799405
ln_km,mal__L_c_MALt2_2,-6.129314967370541
ln_km,mal__L_c_MDH,-6.391204499965333
ln_km,nad_c_MDH,-8.92827879527486
ln_km,nadh_c_MDH,-10.710802271759775
ln_km,oaa_c_MDH,-10.670761605998564
ln_km,mal__L_c_ME1,-6.817313465485067
ln_km,nad_c_ME1,-9.398725757343069
ln_km,co2_c_ME1,-6.870042499596288
ln_km,nadh_c_ME1,-9.914250523485375
ln_km,pyr_c_ME1,-5.8606313059288935
ln_km,mal__L_c_ME2,-7.622093004173647
ln_km,nadp_c_ME2,-11.266205455416852
ln_km,co2_c_ME2,-7.3359639565918595
ln_km,nadph_c_ME2,-11.959614279887763
ln_km,pyr_c_ME2,-7.357237409807968
ln_km,nadh_c_NADH16,-13.019849899585658
ln_km,q8_c_NADH16,-13.639222822269137
ln_km,nad_c_NADH16,-5.905140283789949
ln_km,q8h2_c_NADH16,-2.7090090672899683
ln_km,nad_c_NADTRHD,-7.76476735729117
ln_km,nadph_c_NADTRHD,-9.779291554484926
ln_km,nadh_c_NADTRHD,-9.591497398504414
ln_km,nadp_c_NADTRHD,-10.59064958262921
ln_km,nh4_e_NH4t,-9.14262851718521
ln_km,nh4_c_NH4t,-8.98724799288006
ln_km,coa_c_PDH,-11.581831194238921
ln_km,nad_c_PDH,-10.379184362411669
ln_km,pyr_c_PDH,-8.23353758729851
ln_km,accoa_c_PDH,-8.753074788863204
ln_km,co2_c_PDH,-4.498777259085644
ln_km,nadh_c_PDH,-8.964644213060298
