R.FileName	data.type	library	experinet	strain	pulse.type	temp	time	rep	run.type	biomass.dilution	conditions	filt.spectro.flag	filt.prec.min	filt.noise.min	filt.signal.rep.per.run.cutoff
EO-2_1	DIA	EO-4-1,4a,4b,4c DDA	Exp_1	Y680	exchange	30C	45	1	main batch	0.757575757575758	Y680 exchange 30C 45	FALSE	3	NA	3
EO-3	DIA	EO-4-1,4a,4b,4c DDA	Exp_1	Y680	exchange	30C	45	2	main batch	0.774193548387095	Y680 exchange 30C 45	FALSE	3	NA	3
EO-5_1	DIA	EO-4-1,4a,4b,4c DDA	Exp_2	Y679	spike-in	30C	45	1	main batch	0.793103448275863	Y679 spike-in 30C 45	FALSE	3	NA	3
EO-6	DIA	EO-4-1,4a,4b,4c DDA	Exp_2	Y679	spike-in	30C	45	2	main batch	0.741935483870969	Y679 spike-in 30C 45	FALSE	3	NA	3
EO-8	DIA	EO-4-1,4a,4b,4c DDA	Exp_3	Y807	exchange	30C	45	1	main batch	0.777777777777775	Y807 exchange 30C 45	FALSE	3	NA	3
EO-9	DIA	EO-4-1,4a,4b,4c DDA	Exp_3	Y807	exchange	30C	45	2	main batch	0.81818181818182	Y807 exchange 30C 45	FALSE	3	NA	3
EO-11	DIA	EO-4-1,4a,4b,4c DDA	Exp_4	Y808	exchange	30C	45	1	main batch	0.771428571428569	Y808 exchange 30C 45	FALSE	3	NA	3
EO-12	DIA	EO-4-1,4a,4b,4c DDA	Exp_4	Y808	exchange	30C	45	2	main batch	0.8	Y808 exchange 30C 45	FALSE	3	NA	3
EO-13	DIA	EO-4-1,4a,4b,4c DDA	Exp_5	Y679	spike-in timecourse	30C	10	1	main batch	0.933671850206288	Y679 spike-in timecourse 30C 10	FALSE	3	NA	3
EO-14	DIA	EO-4-1,4a,4b,4c DDA	Exp_5	Y679	spike-in timecourse	30C	60	1	main batch	0.669397042093286	Y679 spike-in timecourse 30C 60	FALSE	3	NA	3
EO-15	DIA	EO-4-1,4a,4b,4c DDA	Exp_5	Y679	spike-in timecourse	30C	150	1	main batch	0.402903314160504	Y679 spike-in timecourse 30C 150	FALSE	3	NA	3
EO-16	DIA	EO-4-1,4a,4b,4c DDA	Exp_5	Y679	spike-in timecourse	30C	10	2	main batch	0.933099713284485	Y679 spike-in timecourse 30C 10	FALSE	3	NA	3
EO-17	DIA	EO-4-1,4a,4b,4c DDA	Exp_5	Y679	spike-in timecourse	30C	60	2	main batch	0.68052973977695	Y679 spike-in timecourse 30C 60	FALSE	3	NA	3
EO-18	DIA	EO-4-1,4a,4b,4c DDA	Exp_5	Y679	spike-in timecourse	30C	150	2	main batch	0.40674906263019	Y679 spike-in timecourse 30C 150	FALSE	3	NA	3
EO-19	DIA	EO-4-1,4a,4b,4c DDA	Exp_6	Y679	spike-in timecourse	37C	10	1	main batch	0.953690807799439	Y679 spike-in timecourse 37C 10	FALSE	3	NA	3
EO-20	DIA	EO-4-1,4a,4b,4c DDA	Exp_6	Y679	spike-in timecourse	37C	60	1	main batch	0.711428571428571	Y679 spike-in timecourse 37C 60	FALSE	3	NA	3
EO-21	DIA	EO-4-1,4a,4b,4c DDA	Exp_6	Y679	spike-in timecourse	37C	150	1	main batch	0.430254476908577	Y679 spike-in timecourse 37C 150	FALSE	3	NA	3
EO-22	DIA	EO-4-1,4a,4b,4c DDA	Exp_6	Y679	spike-in timecourse	37C	10	2	main batch	0.943890734588413	Y679 spike-in timecourse 37C 10	FALSE	3	NA	3
EO-23	DIA	EO-4-1,4a,4b,4c DDA	Exp_6	Y679	spike-in timecourse	37C	60	2	main batch	0.693894165535957	Y679 spike-in timecourse 37C 60	FALSE	3	NA	3
EO-24	DIA	EO-4-1,4a,4b,4c DDA	Exp_6	Y679	spike-in timecourse	37C	150	2	main batch	0.419661907106516	Y679 spike-in timecourse 37C 150	FALSE	3	NA	3