{
    "eml": "test@test.com",
    "v": "9",
    "session": "1234",
    "id": "123444",
    "time": "1703518610953",
    "userUnitff1005": [
        "°",
        "°"
    ],
    "userUnitff1006": [
        "°",
        "°"
    ],
    "userUnitff1001": [
        "km/h",
        "km/h"
    ],
    "userUnitff1007": "",
    "userUnitff122e": "s",
    "userShortNameff122e": "0-100kph",
    "userFullNameff122e": "0-100kph Time",
    "userUnitff1278": "s",
    "userShortNameff1278": "0-100mph",
    "userFullNameff1278": "0-100mph Time",
    "userUnitff124f": "s",
    "userShortNameff124f": "0-200kph",
    "userFullNameff124f": "0-200kph Time",
    "userUnitff1264": "s",
    "userShortNameff1264": "100-0mph",
    "userFullNameff1264": "100-0kph Time",
    "userUnitff1280": "s",
    "userShortNameff1280": "100-200kph",
    "userFullNameff1280": "100-200kph Time",
    "userUnitff1275": "s",
    "userShortNameff1275": "80-120kph",
    "userFullNameff1275": "80-120kph Time",
    "userUnit47": "%",
    "userShortName47": "A THR2",
    "userFullName47": "Absolute Throttle Position B",
    "userUnitff1223": "g",
    "userShortNameff1223": "Accel",
    "userFullNameff1223": "Acceleration Sensor(Total)",
    "userUnitff1220": "g",
    "userShortNameff1220": "Accel(x)",
    "userFullNameff1220": "Acceleration Sensor(X axis)",
    "userUnitff1221": "g",
    "userShortNameff1221": "Accel(y)",
    "userFullNameff1221": "Acceleration Sensor(Y axis)",
    "userUnitff1222": "g",
    "userShortNameff1222": "Accel(z)",
    "userFullNameff1222": "Acceleration Sensor(Z axis)",
    "userUnitff124d": ":1",
    "userShortNameff124d": "AFR(c)",
    "userFullNameff124d": "Air Fuel Ratio(Commanded)",
    "userUnitff1249": ":1",
    "userShortNameff1249": "AFR(m)",
    "userFullNameff1249": "Air Fuel Ratio(Measured)",
    "userUnit46": [
        "°C",
        "°C",
        "°C"
    ],
    "userShortName46": [
        "Air temp",
        "Air temp",
        "Air temp"
    ],
    "userFullName46": [
        "Ambient air temp",
        "ECU(7EA): Ambient air temp",
        "ECU(7EE): Ambient air temp"
    ],
    "userUnitff129a": "%",
    "userShortNameff129a": "BATLVL",
    "userFullNameff129a": "Android device Battery Level",
    "userUnitff1272": "km/h",
    "userShortNameff1272": "Trip Speed",
    "userFullNameff1272": "Average trip speed(whilst stopped or moving)",
    "userUnitff1270": "mb",
    "userShortNameff1270": "Baro",
    "userFullNameff1270": "Barometer (on Android device)",
    "userUnit33": [
        "psi",
        "psi"
    ],
    "userShortName33": [
        "Baro",
        "Baro"
    ],
    "userFullName33": [
        "Barometric pressure (from vehicle)",
        "ECU(7EA): Barometric pressure (from vehicle)"
    ],
    "userUnit3c": "°C",
    "userShortName3c": "Cat B1S1",
    "userFullName3c": "Catalyst Temperature (Bank 1,Sensor 1)",
    "userUnit3e": "°C",
    "userShortName3e": "Cat B1S2",
    "userFullName3e": "Catalyst Temperature (Bank 1,Sensor 2)",
    "userUnit44": "",
    "userShortName44": "COMEQR",
    "userFullName44": "Commanded Equivalence Ratio(lambda)",
    "userUnitff126d": "$/km",
    "userShortNameff126d": "Cost",
    "userFullNameff126d": "Cost per mile/km (Instant)",
    "userUnitff126e": "$/km",
    "userShortNameff126e": "Tr.Cost",
    "userFullNameff126e": "Cost per mile/km (Trip)",
    "userUnitff1258": "g/km",
    "userShortNameff1258": "Av.CO₂",
    "userFullNameff1258": "CO₂ in g/km (Average)",
    "userUnitff126a": "km",
    "userShortNameff126a": "Dist Empt.",
    "userFullNameff126a": "Distance to empty (Estimated)",
    "userUnit31": [
        "km",
        "km",
        "km"
    ],
    "userShortName31": [
        "MIL Off",
        "MIL Off",
        "MIL Off"
    ],
    "userFullName31": [
        "Distance travelled since codes cleared",
        "ECU(7EA): Distance travelled since codes cleared",
        "ECU(7EE): Distance travelled since codes cleared"
    ],
    "userUnit21": [
        "km",
        "km",
        "km"
    ],
    "userShortName21": [
        "MIL On",
        "MIL On",
        "MIL On"
    ],
    "userFullName21": [
        "Distance travelled with MIL/CEL lit",
        "ECU(7EA): Distance travelled with MIL/CEL lit",
        "ECU(7EE): Distance travelled with MIL/CEL lit"
    ],
    "userUnit7a": "psi",
    "userShortName7a": "DPFB1DP",
    "userFullName7a": "DPF Bank 1 Delta Pressure",
    "userUnitff12b1": "psi",
    "userShortNameff12b1": "DPFB1OP",
    "userFullNameff12b1": "DPF Bank 1 Outlet Pressure",
    "userUnit49": "%",
    "userShortName49": "PedalD",
    "userFullName49": "ECU(7EA): Accelerator PedalPosition D",
    "userUnit4a": "%",
    "userShortName4a": "PedalE",
    "userFullName4a": "ECU(7EA): Accelerator PedalPosition E",
    "userUnit05": [
        "°C",
        "°C",
        "°C"
    ],
    "userShortName05": [
        "Coolant",
        "Coolant",
        "Coolant"
    ],
    "userFullName05": [
        "ECU(7EA): Engine Coolant Temperature",
        "ECU(7EE): Engine Coolant Temperature",
        "Engine Coolant Temperature"
    ],
    "userUnit04": [
        "%",
        "%",
        "%"
    ],
    "userShortName04": [
        "Load",
        "Load",
        "Load"
    ],
    "userFullName04": [
        "ECU(7EA): Engine Load",
        "ECU(7EE): Engine Load",
        "Engine Load"
    ],
    "userUnit0c": [
        "rpm",
        "rpm",
        "rpm"
    ],
    "userShortName0c": [
        "Revs",
        "Revs",
        "Revs"
    ],
    "userFullName0c": [
        "ECU(7EA): Engine RPM",
        "ECU(7EE): Engine RPM",
        "Engine RPM"
    ],
    "userUnit5b": [
        "%",
        "%"
    ],
    "userShortName5b": [
        "HBATT",
        "EV BAT"
    ],
    "userFullName5b": [
        "ECU(7EA): Hybrid Battery Charge (%)",
        "ECU(7EA): Hybrid/EV Battery Remaining Charge"
    ],
    "userUnit9a": [
        "V",
        "V"
    ],
    "userShortName9a": [
        "HyBattV",
        "HyBattV"
    ],
    "userFullName9a": [
        "ECU(7EA): Hybrid/EV System Battery Voltage",
        "ECU(7EE): Hybrid/EV System Battery Voltage"
    ],
    "userUnit0f": [
        "°C",
        "°C",
        "°C"
    ],
    "userShortName0f": [
        "Intake",
        "Intake",
        "Intake"
    ],
    "userFullName0f": [
        "ECU(7EA): Intake Air Temperature",
        "ECU(7EE): Intake Air Temperature",
        "Intake Air Temperature"
    ],
    "userUnit87": [
        "psi",
        "psi"
    ],
    "userShortName87": [
        "MAP-A",
        "MAP-A"
    ],
    "userFullName87": [
        "ECU(7EA): Intake Manfold Abs Pressure A",
        "Intake Manfold Abs Pressure A"
    ],
    "userUnit1f": [
        "s",
        "s",
        "s"
    ],
    "userShortName1f": [
        "RunTime",
        "RunTime",
        "RunTime"
    ],
    "userFullName1f": [
        "ECU(7EA): Run time since engine start",
        "ECU(7EE): Run time since engine start",
        "Run time since engine start"
    ],
    "userUnit0d": [
        "km/h",
        "km/h",
        "km/h"
    ],
    "userShortName0d": [
        "Speed",
        "Speed",
        "Speed"
    ],
    "userFullName0d": [
        "ECU(7EA): Speed (OBD)",
        "ECU(7EE): Speed (OBD)",
        "Speed (OBD)"
    ],
    "userUnit11": [
        "%",
        "%",
        "%"
    ],
    "userShortName11": [
        "Throttle",
        "Throttle",
        "Throttle"
    ],
    "userFullName11": [
        "ECU(7EA): Throttle Position(Manifold)",
        "ECU(7EE): Throttle Position(Manifold)",
        "Throttle Position(Manifold)"
    ],
    "userUnit42": [
        "V",
        "V",
        "V"
    ],
    "userShortName42": [
        "Volts(CM)",
        "Volts(CM)",
        "Volts(CM)"
    ],
    "userFullName42": [
        "ECU(7EA): Voltage (Control Module)",
        "ECU(7EE): Voltage (Control Module)",
        "Voltage (Control Module)"
    ],
    "userUnitff1273": "kW",
    "userShortNameff1273": "Power",
    "userFullNameff1273": "Engine kW (At the wheels)",
    "userUnit43": "%",
    "userShortName43": "Abs Load",
    "userFullName43": "Engine Load(Absolute)",
    "userUnit5c": "°C",
    "userShortName5c": "Oil Temp",
    "userFullName5c": "Engine Oil Temperature",
    "userUnitff125c": "cost",
    "userShortNameff125c": "Fuel Cost",
    "userFullNameff125c": "Fuel cost (trip)",
    "userUnitff125d": "l/hr",
    "userShortNameff125d": "Fuel Flow",
    "userFullNameff125d": "Fuel flow rate/hour",
    "userUnitff125a": "cc/min",
    "userShortNameff125a": "Fuel Flow",
    "userFullNameff125a": "Fuel flow rate/minute",
    "userUnitff126b": "%",
    "userShortNameff126b": "Fuel Rem",
    "userFullNameff126b": "Fuel Remaining (Calculated from vehicle profile)",
    "userUnit07": "%",
    "userShortName07": "LTFT1",
    "userFullName07": "Fuel Trim Bank 1 Long Term",
    "userUnit06": "%",
    "userShortName06": "STFT1",
    "userFullName06": "Fuel Trim Bank 1 Short Term",
    "userUnitff1271": "l",
    "userShortNameff1271": "Fuel Used",
    "userFullNameff1271": "Fuel used (trip)",
    "userUnitff1239": "m",
    "userShortNameff1239": "GPS Acc",
    "userFullNameff1239": "GPS Accuracy",
    "userUnitff1010": "m",
    "userShortNameff1010": "GPS Height",
    "userFullNameff1010": "GPS Altitude",
    "userUnitff123b": "°",
    "userShortNameff123b": "GPS Brng",
    "userFullNameff123b": "GPS Bearing",
    "userShortNameff1006": "GPSLat",
    "userFullNameff1006": "GPS Latitude",
    "userShortNameff1005": "GPSLon",
    "userFullNameff1005": "GPS Longitude",
    "userUnitff123a": "",
    "userShortNameff123a": "GPS Sat",
    "userFullNameff123a": "GPS Satellites",
    "userUnitff1237": "km/h",
    "userShortNameff1237": "Spd Diff",
    "userFullNameff1237": "GPS vs OBD Speed difference",
    "userUnitff1226": "hp",
    "userShortNameff1226": "HP",
    "userFullNameff1226": "Horsepower (At the wheels)",
    "userUnitff12a1": "psi",
    "userShortNameff12a1": "MAP-B",
    "userFullNameff12a1": "Intake Manfold Abs Pressure B",
    "userUnitff1203": "kpl",
    "userShortNameff1203": "KPL",
    "userFullNameff1203": "Kilometers Per Litre(Instant)",
    "userUnitff5202": "kpl",
    "userShortNameff5202": "KPL(avg)",
    "userFullNameff5202": "Kilometers Per Litre(Long Term Average)",
    "userUnitff5203": "l/100km",
    "userShortNameff5203": "LPK(avg)",
    "userFullNameff5203": "Litres Per 100 Kilometer(Long Term Average)",
    "userUnit10": "g/s",
    "userShortName10": "MAF",
    "userFullName10": "Mass Air Flow Rate",
    "userUnitff1201": "mpg",
    "userShortNameff1201": "MPG",
    "userFullNameff1201": "Miles Per Gallon(Instant)",
    "userUnitff5201": "mpg",
    "userShortNameff5201": "MPG(avg)",
    "userFullNameff5201": "Miles Per Gallon(Long Term Average)",
    "userUnit34": "mA",
    "userShortName34": "O2S1C",
    "userFullName34": "O2 Sensor1 Wide Range Current",
    "userUnitff1240": "λ",
    "userShortNameff1240": "O2B1S1Eq",
    "userFullNameff1240": "O2 Bank 1 Sensor 1 Wide Range Equivalence Ratio",
    "userUnit35": "mA",
    "userShortName35": "O2B1S2C",
    "userFullName35": "O2 Bank 1 Sensor 2 Wide Range Current",
    "userUnitff1241": "λ",
    "userShortNameff1241": "O2B1S2Eq",
    "userFullNameff1241": "O2 Bank 1 Sensor 2 Wide Range Equivalence Ratio",
    "userUnitff1296": "%",
    "userShortNameff1296": "%City",
    "userFullNameff1296": "Percentage of City driving",
    "userUnitff1297": "%",
    "userShortNameff1297": "%Hgwy",
    "userFullNameff1297": "Percentage of Highway driving",
    "userUnitff1298": "%",
    "userShortNameff1298": "%Idle",
    "userFullNameff1298": "Percentage of Idle driving",
    "userUnit45": "%",
    "userShortName45": "R THR",
    "userFullName45": "Relative Throttle Position",
    "userShortNameff1001": "GPS Spd",
    "userFullNameff1001": "Speed (GPS)",
    "userUnit0e": "°",
    "userShortName0e": "Timing Adv",
    "userFullName0e": "Timing Advance",
    "userUnitff1225": "Nm",
    "userShortNameff1225": "Torque",
    "userFullNameff1225": "Torque",
    "userUnitff1206": "kpl",
    "userShortNameff1206": "Trip KPL",
    "userFullNameff1206": "Trip average KPL",
    "userUnitff1208": "l/100km",
    "userShortNameff1208": "Trip LPK",
    "userFullNameff1208": "Trip average Litres/100 KM",
    "userUnitff1204": "km",
    "userShortNameff1204": "Trip",
    "userFullNameff1204": "Trip Distance",
    "userUnitff120c": "km",
    "userShortNameff120c": "Odo",
    "userFullNameff120c": "Trip distance (stored in vehicle profile)",
    "userUnitff1266": "s",
    "userShortNameff1266": "TripTime",
    "userFullNameff1266": "Trip Time(Since journey start)",
    "userUnitff1268": "s",
    "userShortNameff1268": "Moving",
    "userFullNameff1268": "Trip time(whilst moving)",
    "userUnitff1267": "s",
    "userShortNameff1267": "Stopped",
    "userFullNameff1267": "Trip time(whilst stationary)",
    "userUnitff1202": "psi",
    "userShortNameff1202": "Boost",
    "userFullNameff1202": "Turbo Boost & Vacuum Gauge",
    "userUnitff1238": "V",
    "userShortNameff1238": "Volts(Ad)",
    "userFullNameff1238": "Voltage (OBD Adapter)"
}