{
    "plug": "DeepStack-Face",
    "host": "localhost",
    "tfjsBuild": "cpu",
    "port": 8080,
    "hostPort": 58083,
    "key": "DeepStack-Face",
    "mode": "client",
    "type": "detector",
    "deepStack": {
        "host": "HOSTNAME OR IP",
        "port": 5000,
        "isSSL": false,
        "apiKey": "api key as defined in DeepStack"
    },
    "persons": [
        "Array of Names images begin with"
    ]
}