{
  "project_info": {
    "project_number": "690652231087",
    "firebase_url": "https://push-notification-afc5a.firebaseio.com",
    "project_id": "push-notification-afc5a",
    "storage_bucket": "push-notification-afc5a.appspot.com"
  },
  "client": [
    {
      "client_info": {
        "mobilesdk_app_id": "1:690652231087:android:3443a197e07618a9",
        "android_client_info": {
          "package_name": "com.pushnotificationfirebase"
        }
      },
      "oauth_client": [
        {
          "client_id": "690652231087-ehadd6rtola4buouletkk75nfpignla4.apps.googleusercontent.com",
          "client_type": 3
        }
      ],
      "api_key": [
        {
          "current_key": "AIzaSyCT0Yzo3abYdzVx4fOm9hpw39RS3PYHnkg"
        }
      ],
      "services": {
        "appinvite_service": {
          "other_platform_oauth_client": [
            {
              "client_id": "690652231087-ehadd6rtola4buouletkk75nfpignla4.apps.googleusercontent.com",
              "client_type": 3
            }
          ]
        }
      }
    }
  ],
  "configuration_version": "1"
}