{
    "version": 1,
    "author": "Eivind Vold Aunebakk",
    "editor": "wokwi",
    "parts": [
        {
            "type": "wokwi-led-ring",
            "id": "ring1",
            "top": -364.81,
            "left": -331.36,
            "attrs": {
                "pixels": "150"
            }
        },
        {
            "type": "wokwi-arduino-nano",
            "id": "nano",
            "top": 72.29,
            "left": -208.8,
            "rotate": 90,
            "attrs": {}
        },
        {
            "type": "wokwi-analog-joystick",
            "id": "joystick1",
            "top": 211.22,
            "left": 354.17,
            "attrs": {
                "bounce": "0"
            }
        },
        {
            "type": "wokwi-lcd2004",
            "id": "lcd2",
            "top": 178.31,
            "left": -7.16,
            "attrs": {
                "pins": "i2c"
            }
        },
        {
            "type": "wokwi-buzzer",
            "id": "bz1",
            "top": 105.61,
            "left": -50.46,
            "rotate": 90,
            "attrs": {
                "volume": "0.1"
            }
        },
        {
            "type": "wokwi-stepper-motor",
            "id": "stepper1",
            "top": -214.42,
            "left": -89.47,
            "attrs": {
                "size": "17",
                "arrow": "orange"
            }
        },
        {
            "type": "wokwi-a4988",
            "id": "drv1",
            "top": -40.64,
            "left": -38.08,
            "rotate": 270,
            "attrs": {}
        },
        {
            "type": "wokwi-stepper-motor",
            "id": "stepper2",
            "top": -215.28,
            "left": 82.11,
            "attrs": {
                "size": "17",
                "arrow": "orange"
            }
        },
        {
            "type": "wokwi-a4988",
            "id": "drv2",
            "top": -41.5,
            "left": 133.5,
            "rotate": 270,
            "attrs": {}
        },
        {
            "type": "wokwi-stepper-motor",
            "id": "stepper3",
            "top": -215.28,
            "left": 253.97,
            "attrs": {
                "size": "17",
                "arrow": "orange"
            }
        },
        {
            "type": "wokwi-a4988",
            "id": "drv3",
            "top": -41.5,
            "left": 305.36,
            "rotate": 270,
            "attrs": {}
        },
        {
            "type": "wokwi-max7219-matrix",
            "id": "matrix2",
            "top": 67.01,
            "left": 50.93,
            "attrs": {
                "chain": "4"
            }
        }
    ],
    "connections": [
        [
            "nano:A0",
            "joystick1:HORZ",
            "violet",
            [
                "h-37.1",
                "v299.67",
                "h593.67"
            ]
        ],
        [
            "nano:A1",
            "joystick1:VERT",
            "green",
            [
                "h-31.36",
                "v283.66",
                "h578.33"
            ]
        ],
        [
            "nano:A4",
            "lcd2:SDA",
            "green",
            [
                "h-25.8",
                "v144.33"
            ]
        ],
        [
            "bz1:1",
            "nano:GND.2",
            "black",
            [
                "h-5.26",
                "v-7.6"
            ]
        ],
        [
            "stepper1:A-",
            "drv1:2B",
            "orange",
            [
                "v0"
            ]
        ],
        [
            "stepper1:A+",
            "drv1:2A",
            "gold",
            [
                "v0"
            ]
        ],
        [
            "stepper1:B+",
            "drv1:1A",
            "green",
            [
                "v0"
            ]
        ],
        [
            "stepper1:B-",
            "drv1:1B",
            "blue",
            [
                "v0"
            ]
        ],
        [
            "drv1:RESET",
            "drv1:SLEEP",
            "red",
            [
                "v11.84",
                "h6.48"
            ]
        ],
        [
            "nano:12",
            "drv1:STEP",
            "green",
            [
                "h0"
            ]
        ],
        [
            "drv1:DIR",
            "drv1:SLEEP",
            "red",
            [
                "v11.3",
                "h-13.25"
            ]
        ],
        [
            "stepper2:A-",
            "drv2:2B",
            "orange",
            [
                "v0"
            ]
        ],
        [
            "stepper2:A+",
            "drv2:2A",
            "gold",
            [
                "v0"
            ]
        ],
        [
            "stepper2:B+",
            "drv2:1A",
            "green",
            [
                "v0"
            ]
        ],
        [
            "stepper2:B-",
            "drv2:1B",
            "blue",
            [
                "v0"
            ]
        ],
        [
            "drv2:RESET",
            "drv2:SLEEP",
            "red",
            [
                "v11.84",
                "h6.48"
            ]
        ],
        [
            "drv2:DIR",
            "drv2:SLEEP",
            "red",
            [
                "v11.3",
                "h-13.25"
            ]
        ],
        [
            "stepper3:A-",
            "drv3:2B",
            "orange",
            [
                "v0"
            ]
        ],
        [
            "stepper3:A+",
            "drv3:2A",
            "gold",
            [
                "v0"
            ]
        ],
        [
            "stepper3:B+",
            "drv3:1A",
            "green",
            [
                "v0"
            ]
        ],
        [
            "stepper3:B-",
            "drv3:1B",
            "blue",
            [
                "v0"
            ]
        ],
        [
            "drv3:RESET",
            "drv3:SLEEP",
            "red",
            [
                "v11.84",
                "h6.48"
            ]
        ],
        [
            "drv3:DIR",
            "drv3:SLEEP",
            "red",
            [
                "v11.3",
                "h-13.25"
            ]
        ],
        [
            "drv2:STEP",
            "nano:11",
            "green",
            [
                "v0"
            ]
        ],
        [
            "drv3:STEP",
            "nano:10",
            "green",
            [
                "v0"
            ]
        ],
        [
            "bz1:2",
            "nano:2",
            "red",
            [
                "h-10.23",
                "v-21.2"
            ]
        ],
        [
            "nano:A5",
            "lcd2:SCL",
            "gray",
            [
                "h-20.7",
                "v119.27"
            ]
        ],
        [
            "joystick1:VCC",
            "lcd2:VCC",
            "red",
            [
                "v32.3",
                "h-400.43",
                "v-144.4"
            ]
        ],
        [
            "joystick1:GND",
            "lcd2:GND",
            "black",
            [
                "v55.42",
                "h-443.95",
                "v-172.23"
            ]
        ],
        [
            "nano:VIN",
            "lcd2:VCC",
            "red",
            [
                "h-8.74",
                "v19.61"
            ]
        ],
        [
            "nano:GND.1",
            "lcd2:GND",
            "black",
            [
                "h-14.75",
                "v46.49"
            ]
        ],
        [
            "nano:3",
            "joystick1:SEL",
            "blue",
            [
                "h9.45",
                "v247.98",
                "h499.15"
            ]
        ],
        [
            "matrix2:V+",
            "drv3:DIR",
            "red",
            [
                "h0.27",
                "v-62.87"
            ]
        ],
        [
            "matrix2:GND",
            "drv3:GND.1",
            "black",
            [
                "h10.48",
                "v-134.79",
                "h-35.46"
            ]
        ],
        [
            "matrix2:CLK",
            "nano:9",
            "green",
            [
                "h6.72",
                "v21.76",
                "h-350.29",
                "v-60.17"
            ]
        ],
        [
            "matrix2:CS",
            "nano:8",
            "green",
            [
                "h11.02",
                "v35.66",
                "h-358.88",
                "v-68.23"
            ]
        ],
        [
            "matrix2:DIN",
            "nano:7",
            "green",
            [
                "h15.32",
                "v49.55",
                "h-367.48",
                "v-65.01"
            ]
        ],
        [
            "ring1:GND",
            "lcd2:GND",
            "black",
            [
                "v9.6",
                "h-145.93",
                "v-407.37"
            ]
        ],
        [
            "lcd2:VCC",
            "ring1:VCC",
            "red",
            [
                "h-9.96",
                "v388.9",
                "h143.34"
            ]
        ],
        [
            "ring1:DIN",
            "nano:4",
            "gray",
            [
                "v19.56",
                "h-226.36",
                "v-494.49"
            ]
        ]
    ]
}