<mxfile host="app.diagrams.net" modified="2022-07-11T19:21:11.343Z" agent="5.0 (X11)" etag="Y66Xa42s5Au1VLzYfrqa" version="20.0.4" type="gitlab">
  <diagram id="r2Fo8B8DSdR7UAfPcoPz" name="Page-1">
    <mxGraphModel dx="1296" dy="712" grid="1" gridSize="10" guides="1" tooltips="1" connect="1" arrows="1" fold="1" page="1" pageScale="1" pageWidth="827" pageHeight="1169" math="0" shadow="0">
      <root>
        <mxCell id="0" />
        <mxCell id="1" parent="0" />
        <mxCell id="GHthexjrBqthD828b0tp-22" value="" style="rounded=1;whiteSpace=wrap;html=1;fillColor=none;dashed=1;strokeColor=#4D4D4D;" vertex="1" parent="1">
          <mxGeometry x="60" y="260" width="510" height="690" as="geometry" />
        </mxCell>
        <mxCell id="TNCnfPg23lUK1E3KsNpg-1" value="&lt;div style=&quot;font-size: 16px;&quot;&gt;&lt;font style=&quot;font-size: 16px;&quot;&gt;LDAP &lt;br&gt;&lt;/font&gt;&lt;/div&gt;&lt;div style=&quot;font-size: 16px;&quot;&gt;&lt;font style=&quot;font-size: 16px;&quot;&gt;(user base)&lt;/font&gt;&lt;/div&gt;" style="rounded=1;whiteSpace=wrap;html=1;" parent="1" vertex="1">
          <mxGeometry x="295" y="80" width="150" height="90" as="geometry" />
        </mxCell>
        <mxCell id="-2W1rZYL4sQz05mr2min-20" value="" style="edgeStyle=orthogonalEdgeStyle;rounded=0;orthogonalLoop=1;jettySize=auto;html=1;" parent="1" source="-2W1rZYL4sQz05mr2min-4" edge="1">
          <mxGeometry relative="1" as="geometry">
            <mxPoint x="445" y="130" as="targetPoint" />
            <Array as="points">
              <mxPoint x="820" y="130" />
              <mxPoint x="445" y="130" />
            </Array>
          </mxGeometry>
        </mxCell>
        <mxCell id="GHthexjrBqthD828b0tp-13" value="&lt;div&gt;read/auth&lt;/div&gt;" style="edgeLabel;html=1;align=center;verticalAlign=middle;resizable=0;points=[];" vertex="1" connectable="0" parent="-2W1rZYL4sQz05mr2min-20">
          <mxGeometry x="-0.2477" y="-2" relative="1" as="geometry">
            <mxPoint as="offset" />
          </mxGeometry>
        </mxCell>
        <mxCell id="-2W1rZYL4sQz05mr2min-4" value="&lt;font style=&quot;font-size: 16px;&quot;&gt;Matrix Server&lt;br&gt;(Synapse)&lt;/font&gt;" style="rounded=1;whiteSpace=wrap;html=1;fillColor=none;" parent="1" vertex="1">
          <mxGeometry x="660" y="260" width="390" height="370" as="geometry" />
        </mxCell>
        <mxCell id="-2W1rZYL4sQz05mr2min-12" value="" style="edgeStyle=orthogonalEdgeStyle;rounded=0;orthogonalLoop=1;jettySize=auto;html=1;" parent="1" source="-2W1rZYL4sQz05mr2min-7" target="TNCnfPg23lUK1E3KsNpg-1" edge="1">
          <mxGeometry relative="1" as="geometry" />
        </mxCell>
        <mxCell id="GHthexjrBqthD828b0tp-17" value="&lt;div&gt;read/auth&lt;/div&gt;" style="edgeLabel;html=1;align=center;verticalAlign=middle;resizable=0;points=[];" vertex="1" connectable="0" parent="-2W1rZYL4sQz05mr2min-12">
          <mxGeometry x="-0.5433" y="1" relative="1" as="geometry">
            <mxPoint as="offset" />
          </mxGeometry>
        </mxCell>
        <mxCell id="-2W1rZYL4sQz05mr2min-7" value="User_LDAP&lt;br&gt;&lt;div&gt;(read user information and authenticate)&lt;/div&gt;" style="rounded=0;whiteSpace=wrap;html=1;" parent="1" vertex="1">
          <mxGeometry x="390" y="280" width="140" height="70" as="geometry" />
        </mxCell>
        <mxCell id="-2W1rZYL4sQz05mr2min-11" value="" style="edgeStyle=orthogonalEdgeStyle;rounded=0;orthogonalLoop=1;jettySize=auto;html=1;" parent="1" source="-2W1rZYL4sQz05mr2min-8" target="TNCnfPg23lUK1E3KsNpg-1" edge="1">
          <mxGeometry relative="1" as="geometry">
            <Array as="points">
              <mxPoint x="265" y="225" />
              <mxPoint x="370" y="225" />
            </Array>
          </mxGeometry>
        </mxCell>
        <mxCell id="GHthexjrBqthD828b0tp-15" value="&lt;div&gt;write&lt;/div&gt;" style="edgeLabel;html=1;align=center;verticalAlign=middle;resizable=0;points=[];" vertex="1" connectable="0" parent="-2W1rZYL4sQz05mr2min-11">
          <mxGeometry x="-0.5984" relative="1" as="geometry">
            <mxPoint as="offset" />
          </mxGeometry>
        </mxCell>
        <mxCell id="-2W1rZYL4sQz05mr2min-8" value="&lt;div&gt;User_LDAP_Extended&lt;/div&gt;&lt;div&gt;(app to write to LDAP on user change in nextcloud)&lt;br&gt;&lt;/div&gt;" style="rounded=0;whiteSpace=wrap;html=1;" parent="1" vertex="1">
          <mxGeometry x="190" y="280" width="150" height="70" as="geometry" />
        </mxCell>
        <mxCell id="-2W1rZYL4sQz05mr2min-13" value="&lt;font style=&quot;font-size: 16px;&quot;&gt;Element&lt;br&gt;(Matrix UI)&lt;br&gt;&lt;/font&gt;" style="rounded=1;whiteSpace=wrap;html=1;" parent="1" vertex="1">
          <mxGeometry x="795" y="740" width="120" height="60" as="geometry" />
        </mxCell>
        <mxCell id="-2W1rZYL4sQz05mr2min-14" value="" style="whiteSpace=wrap;html=1;rounded=0;fillColor=none;" parent="1" vertex="1">
          <mxGeometry x="290" y="440" width="250" height="410" as="geometry" />
        </mxCell>
        <mxCell id="-2W1rZYL4sQz05mr2min-27" value="Calendar" style="rounded=0;whiteSpace=wrap;html=1;" parent="1" vertex="1">
          <mxGeometry x="120" y="770" width="120" height="60" as="geometry" />
        </mxCell>
        <mxCell id="-2W1rZYL4sQz05mr2min-28" value="Circles" style="rounded=0;whiteSpace=wrap;html=1;" parent="1" vertex="1">
          <mxGeometry x="120" y="680" width="120" height="60" as="geometry" />
        </mxCell>
        <mxCell id="SF9GMAlk_LbaVHWtjT9D-3" value="MatrixClient" style="whiteSpace=wrap;html=1;rounded=0;fillColor=#d5e8d4;strokeColor=#82b366;" parent="1" vertex="1">
          <mxGeometry x="410" y="510" width="120" height="35" as="geometry" />
        </mxCell>
        <mxCell id="GHthexjrBqthD828b0tp-1" value="&lt;div&gt;Files&lt;/div&gt;" style="rounded=0;whiteSpace=wrap;html=1;" vertex="1" parent="1">
          <mxGeometry x="120" y="860" width="120" height="60" as="geometry" />
        </mxCell>
        <mxCell id="GHthexjrBqthD828b0tp-4" value="&lt;div&gt;Hooks&lt;/div&gt;&lt;div&gt;(matrix bridge reacts to events in apps)&lt;br&gt;&lt;/div&gt;" style="whiteSpace=wrap;html=1;rounded=0;fillColor=#d5e8d4;strokeColor=#82b366;" vertex="1" parent="1">
          <mxGeometry x="310" y="770" width="120" height="60" as="geometry" />
        </mxCell>
        <mxCell id="GHthexjrBqthD828b0tp-7" value="" style="endArrow=classic;html=1;rounded=0;exitX=1;exitY=0.75;exitDx=0;exitDy=0;entryX=0;entryY=0.25;entryDx=0;entryDy=0;" edge="1" parent="1" source="-2W1rZYL4sQz05mr2min-28" target="GHthexjrBqthD828b0tp-4">
          <mxGeometry width="50" height="50" relative="1" as="geometry">
            <mxPoint x="280" y="730" as="sourcePoint" />
            <mxPoint x="330" y="680" as="targetPoint" />
          </mxGeometry>
        </mxCell>
        <mxCell id="GHthexjrBqthD828b0tp-8" value="" style="endArrow=classic;html=1;rounded=0;exitX=1;exitY=0.5;exitDx=0;exitDy=0;entryX=0;entryY=0.5;entryDx=0;entryDy=0;" edge="1" parent="1" source="-2W1rZYL4sQz05mr2min-27" target="GHthexjrBqthD828b0tp-4">
          <mxGeometry width="50" height="50" relative="1" as="geometry">
            <mxPoint x="270" y="852.5" as="sourcePoint" />
            <mxPoint x="340" y="927.5" as="targetPoint" />
          </mxGeometry>
        </mxCell>
        <mxCell id="GHthexjrBqthD828b0tp-9" value="" style="endArrow=classic;html=1;rounded=0;exitX=1;exitY=0.5;exitDx=0;exitDy=0;entryX=0;entryY=0.75;entryDx=0;entryDy=0;" edge="1" parent="1" source="GHthexjrBqthD828b0tp-1" target="GHthexjrBqthD828b0tp-4">
          <mxGeometry width="50" height="50" relative="1" as="geometry">
            <mxPoint x="295" y="852.5" as="sourcePoint" />
            <mxPoint x="365" y="927.5" as="targetPoint" />
          </mxGeometry>
        </mxCell>
        <mxCell id="GHthexjrBqthD828b0tp-12" value="Application Service&lt;br&gt;(room changes are sent to nextcloud)" style="whiteSpace=wrap;html=1;rounded=0;fillColor=#d5e8d4;strokeColor=#82b366;" vertex="1" parent="1">
          <mxGeometry x="675" y="340" width="120" height="60" as="geometry" />
        </mxCell>
        <mxCell id="GHthexjrBqthD828b0tp-23" value="&lt;font style=&quot;font-size: 20px;&quot;&gt;Nextcloud&lt;/font&gt;" style="text;html=1;align=center;verticalAlign=middle;resizable=0;points=[];autosize=1;strokeColor=none;fillColor=none;" vertex="1" parent="1">
          <mxGeometry x="90" y="420" width="110" height="40" as="geometry" />
        </mxCell>
        <mxCell id="GHthexjrBqthD828b0tp-24" value="embed in iframe&lt;br&gt;auth via postMessage" style="whiteSpace=wrap;html=1;rounded=0;fillColor=#d5e8d4;strokeColor=#82b366;" vertex="1" parent="1">
          <mxGeometry x="400" y="620" width="130" height="50" as="geometry" />
        </mxCell>
        <mxCell id="GHthexjrBqthD828b0tp-26" value="" style="endArrow=classic;html=1;rounded=0;fontSize=20;exitX=1;exitY=0.5;exitDx=0;exitDy=0;entryX=0;entryY=0.5;entryDx=0;entryDy=0;" edge="1" parent="1" source="GHthexjrBqthD828b0tp-24" target="-2W1rZYL4sQz05mr2min-13">
          <mxGeometry width="50" height="50" relative="1" as="geometry">
            <mxPoint x="600" y="580" as="sourcePoint" />
            <mxPoint x="650" y="530" as="targetPoint" />
          </mxGeometry>
        </mxCell>
        <mxCell id="GHthexjrBqthD828b0tp-27" value="" style="endArrow=classic;html=1;rounded=0;fontSize=16;entryX=1;entryY=0;entryDx=0;entryDy=0;exitX=0;exitY=0.5;exitDx=0;exitDy=0;" edge="1" parent="1" source="GHthexjrBqthD828b0tp-12" target="GHthexjrBqthD828b0tp-29">
          <mxGeometry width="50" height="50" relative="1" as="geometry">
            <mxPoint x="600" y="580" as="sourcePoint" />
            <mxPoint x="650" y="530" as="targetPoint" />
          </mxGeometry>
        </mxCell>
        <mxCell id="GHthexjrBqthD828b0tp-28" value="" style="endArrow=classic;html=1;rounded=0;fontSize=16;exitX=0.5;exitY=0;exitDx=0;exitDy=0;entryX=0.5;entryY=1;entryDx=0;entryDy=0;" edge="1" parent="1" source="-2W1rZYL4sQz05mr2min-13" target="-2W1rZYL4sQz05mr2min-4">
          <mxGeometry width="50" height="50" relative="1" as="geometry">
            <mxPoint x="600" y="580" as="sourcePoint" />
            <mxPoint x="650" y="530" as="targetPoint" />
          </mxGeometry>
        </mxCell>
        <mxCell id="GHthexjrBqthD828b0tp-29" value="&lt;div&gt;MatrixListener&lt;/div&gt;&amp;nbsp;API" style="whiteSpace=wrap;html=1;rounded=0;fillColor=#d5e8d4;strokeColor=#82b366;" vertex="1" parent="1">
          <mxGeometry x="410" y="460" width="120" height="40" as="geometry" />
        </mxCell>
        <mxCell id="GHthexjrBqthD828b0tp-30" value="" style="endArrow=classic;html=1;rounded=0;fontSize=16;entryX=0;entryY=0.5;entryDx=0;entryDy=0;exitX=1;exitY=0.5;exitDx=0;exitDy=0;" edge="1" parent="1" source="SF9GMAlk_LbaVHWtjT9D-3" target="GHthexjrBqthD828b0tp-31">
          <mxGeometry width="50" height="50" relative="1" as="geometry">
            <mxPoint x="775" y="600" as="sourcePoint" />
            <mxPoint x="630" y="650" as="targetPoint" />
          </mxGeometry>
        </mxCell>
        <mxCell id="GHthexjrBqthD828b0tp-31" value="Client-Server API" style="whiteSpace=wrap;html=1;rounded=0;fillColor=#d5e8d4;strokeColor=#82b366;" vertex="1" parent="1">
          <mxGeometry x="675" y="485" width="120" height="60" as="geometry" />
        </mxCell>
        <mxCell id="GHthexjrBqthD828b0tp-32" value="&lt;font style=&quot;font-size: 16px;&quot;&gt;MatrixBridge&lt;/font&gt;" style="text;html=1;align=center;verticalAlign=middle;resizable=0;points=[];autosize=1;strokeColor=none;fillColor=none;" vertex="1" parent="1">
          <mxGeometry x="360" y="580" width="110" height="30" as="geometry" />
        </mxCell>
        <mxCell id="GHthexjrBqthD828b0tp-33" value="" style="endArrow=classic;html=1;rounded=0;exitX=0;exitY=0.5;exitDx=0;exitDy=0;entryX=1;entryY=0.5;entryDx=0;entryDy=0;" edge="1" parent="1" source="GHthexjrBqthD828b0tp-34" target="-2W1rZYL4sQz05mr2min-28">
          <mxGeometry width="50" height="50" relative="1" as="geometry">
            <mxPoint x="200" y="570" as="sourcePoint" />
            <mxPoint x="270" y="650" as="targetPoint" />
          </mxGeometry>
        </mxCell>
        <mxCell id="GHthexjrBqthD828b0tp-34" value="Direct circle manipulation; each circle haves its own room (and vice-versa)" style="whiteSpace=wrap;html=1;rounded=0;fillColor=#d5e8d4;strokeColor=#82b366;" vertex="1" parent="1">
          <mxGeometry x="310" y="690" width="120" height="60" as="geometry" />
        </mxCell>
      </root>
    </mxGraphModel>
  </diagram>
</mxfile>
