{
  "events": [{
    "age": 101,
    "content": {
      "ban": 50,
      "events": {
        "m.room.avatar": 50,
        "m.room.canonical_alias": 50,
        "m.room.encryption": 100,
        "m.room.history_visibility": 100,
        "m.room.name": 50,
        "m.room.power_levels": 100,
        "m.room.server_acl": 100,
        "m.room.tombstone": 100
      },
      "events_default": 0,
      "historical": 100,
      "invite": 0,
      "kick": 50,
      "redact": 50,
      "state_default": 50,
      "users": {
        "@rosanak:synapse.localhost": 100,
        "@vinicius:synapse.localhost": 100
      },
      "users_default": 0
    },
    "event_id": "$aoYcf6zdMqHrp6c-4mk1kUg9xYyhhGerPJYDKqyMbTA",
    "origin_server_ts": 1636591953875,
    "prev_content": {
      "ban": 50,
      "events": {
        "m.room.avatar": 50,
        "m.room.canonical_alias": 50,
        "m.room.encryption": 100,
        "m.room.history_visibility": 100,
        "m.room.name": 50,
        "m.room.power_levels": 100,
        "m.room.server_acl": 100,
        "m.room.tombstone": 100
      },
      "events_default": 0,
      "historical": 100,
      "invite": 0,
      "kick": 50,
      "redact": 50,
      "state_default": 50,
      "users": {
        "@rosanak:synapse.localhost": 100,
        "@vinicius:synapse.localhost": 50
      },
      "users_default": 0
    },
    "replaces_state": "$H60C1-U7DVInn1DZ9Ce67Qs7sIDbxDI4qMunrgDd7qk",
    "room_id": "!zxlVoBWlInbdOHMAgk:synapse.localhost",
    "sender": "@rosanak:synapse.localhost",
    "state_key": "",
    "type": "m.room.power_levels",
    "unsigned": {
      "age": 101,
      "prev_content": {
        "ban": 50,
        "events": {
          "m.room.avatar": 50,
          "m.room.canonical_alias": 50,
          "m.room.encryption": 100,
          "m.room.history_visibility": 100,
          "m.room.name": 50,
          "m.room.power_levels": 100,
          "m.room.server_acl": 100,
          "m.room.tombstone": 100
        },
        "events_default": 0,
        "historical": 100,
        "invite": 0,
        "kick": 50,
        "redact": 50,
        "state_default": 50,
        "users": {
          "@rosanak:synapse.localhost": 100,
          "@vinicius:synapse.localhost": 50
        },
        "users_default": 0
      },
      "prev_sender": "@rosanak:synapse.localhost",
      "replaces_state": "$H60C1-U7DVInn1DZ9Ce67Qs7sIDbxDI4qMunrgDd7qk"
    },
    "user_id": "@rosanak:synapse.localhost"
  }]
}