{
  "data": {
    "__schema": {
      "directives": [
        {
          "args": [
            {
              "defaultValue": null,
              "description": "Included when true.",
              "name": "if",
              "type": {
                "kind": "NON_NULL",
                "name": null,
                "ofType": {
                  "kind": "SCALAR",
                  "name": "Boolean",
                  "ofType": null
                }
              }
            }
          ],
          "description": "Directs the executor to include this field or fragment only when the `if` argument is true.",
          "locations": [
            "FIELD",
            "FRAGMENT_SPREAD",
            "INLINE_FRAGMENT"
          ],
          "name": "include"
        },
        {
          "args": [
            {
              "defaultValue": null,
              "description": "Skipped when true.",
              "name": "if",
              "type": {
                "kind": "NON_NULL",
                "name": null,
                "ofType": {
                  "kind": "SCALAR",
                  "name": "Boolean",
                  "ofType": null
                }
              }
            }
          ],
          "description": "Directs the executor to skip this field or fragment when the `if` argument is true.",
          "locations": [
            "FIELD",
            "FRAGMENT_SPREAD",
            "INLINE_FRAGMENT"
          ],
          "name": "skip"
        }
      ],
      "mutationType": {
        "name": "Mutation"
      },
      "queryType": {
        "name": "Query"
      },
      "subscriptionType": null,
      "types": [
        {
          "description": null,
          "enumValues": null,
          "fields": [
            {
              "args": [],
              "deprecationReason": null,
              "description": null,
              "isDeprecated": false,
              "name": "upfs",
              "type": {
                "kind": "LIST",
                "name": null,
                "ofType": {
                  "kind": "OBJECT",
                  "name": "Upf",
                  "ofType": null
                }
              }
            }
          ],
          "inputFields": null,
          "interfaces": [],
          "kind": "OBJECT",
          "name": "Query",
          "possibleTypes": null
        },
        {
          "description": null,
          "enumValues": null,
          "fields": [
            {
              "args": [],
              "deprecationReason": null,
              "description": "",
              "isDeprecated": false,
              "name": "id",
              "type": {
                "kind": "NON_NULL",
                "name": null,
                "ofType": {
                  "kind": "SCALAR",
                  "name": "ID",
                  "ofType": null
                }
              }
            },
            {
              "args": [],
              "deprecationReason": null,
              "description": "",
              "isDeprecated": false,
              "name": "mobileKey",
              "type": {
                "kind": "SCALAR",
                "name": "String",
                "ofType": null
              }
            },
            {
              "args": [],
              "deprecationReason": null,
              "description": "",
              "isDeprecated": false,
              "name": "mobileModelId",
              "type": {
                "kind": "SCALAR",
                "name": "Int",
                "ofType": null
              }
            },
            {
              "args": [],
              "deprecationReason": null,
              "description": "",
              "isDeprecated": false,
              "name": "nomeComunidade",
              "type": {
                "kind": "SCALAR",
                "name": "String",
                "ofType": null
              }
            },
            {
              "args": [],
              "deprecationReason": null,
              "description": "",
              "isDeprecated": false,
              "name": "nomeUsuario",
              "type": {
                "kind": "SCALAR",
                "name": "String",
                "ofType": null
              }
            },
            {
              "args": [],
              "deprecationReason": null,
              "description": "",
              "isDeprecated": false,
              "name": "dataNascimentoUsuario",
              "type": {
                "kind": "SCALAR",
                "name": "Date",
                "ofType": null
              }
            },
            {
              "args": [],
              "deprecationReason": null,
              "description": "",
              "isDeprecated": false,
              "name": "generoUsuario",
              "type": {
                "kind": "SCALAR",
                "name": "String",
                "ofType": null
              }
            },
            {
              "args": [],
              "deprecationReason": null,
              "description": "",
              "isDeprecated": false,
              "name": "unidadeArea",
              "type": {
                "kind": "SCALAR",
                "name": "String",
                "ofType": null
              }
            },
            {
              "args": [],
              "deprecationReason": null,
              "description": "",
              "isDeprecated": false,
              "name": "unidadeValor",
              "type": {
                "kind": "SCALAR",
                "name": "String",
                "ofType": null
              }
            },
            {
              "args": [],
              "deprecationReason": null,
              "description": "",
              "isDeprecated": false,
              "name": "cooperativa",
              "type": {
                "kind": "SCALAR",
                "name": "String",
                "ofType": null
              }
            }
          ],
          "inputFields": null,
          "interfaces": [],
          "kind": "OBJECT",
          "name": "Upf",
          "possibleTypes": null
        },
        {
          "description": "The `ID` scalar type represents a unique identifier, often used to refetch an object or as key for a cache. The ID type appears in a JSON response as a String; however, it is not intended to be human-readable. When expected as an input type, any string (such as `\"4\"`) or integer (such as `4`) input value will be accepted as an ID.",
          "enumValues": null,
          "fields": null,
          "inputFields": null,
          "interfaces": null,
          "kind": "SCALAR",
          "name": "ID",
          "possibleTypes": null
        },
        {
          "description": "The `String` scalar type represents textual data, represented as UTF-8 character sequences. The String type is most often used by GraphQL to represent free-form human-readable text.",
          "enumValues": null,
          "fields": null,
          "inputFields": null,
          "interfaces": null,
          "kind": "SCALAR",
          "name": "String",
          "possibleTypes": null
        },
        {
          "description": "The `Int` scalar type represents non-fractional signed whole numeric values. Int can represent values between -(2^31 - 1) and 2^31 - 1 since represented in JSON as double-precision floating point numbers specifiedby [IEEE 754](http://en.wikipedia.org/wiki/IEEE_floating_point).",
          "enumValues": null,
          "fields": null,
          "inputFields": null,
          "interfaces": null,
          "kind": "SCALAR",
          "name": "Int",
          "possibleTypes": null
        },
        {
          "description": "The `Date` scalar type represents a Date\nvalue as specified by\n[iso8601](https://en.wikipedia.org/wiki/ISO_8601).",
          "enumValues": null,
          "fields": null,
          "inputFields": null,
          "interfaces": null,
          "kind": "SCALAR",
          "name": "Date",
          "possibleTypes": null
        },
        {
          "description": null,
          "enumValues": null,
          "fields": [
            {
              "args": [
                {
                  "defaultValue": null,
                  "description": null,
                  "name": "upfData",
                  "type": {
                    "kind": "NON_NULL",
                    "name": null,
                    "ofType": {
                      "kind": "INPUT_OBJECT",
                      "name": "UpfInput",
                      "ofType": null
                    }
                  }
                }
              ],
              "deprecationReason": null,
              "description": null,
              "isDeprecated": false,
              "name": "createUpf",
              "type": {
                "kind": "OBJECT",
                "name": "UpfMutation",
                "ofType": null
              }
            }
          ],
          "inputFields": null,
          "interfaces": [],
          "kind": "OBJECT",
          "name": "Mutation",
          "possibleTypes": null
        },
        {
          "description": null,
          "enumValues": null,
          "fields": [
            {
              "args": [],
              "deprecationReason": null,
              "description": null,
              "isDeprecated": false,
              "name": "mobileKey",
              "type": {
                "kind": "SCALAR",
                "name": "String",
                "ofType": null
              }
            },
            {
              "args": [],
              "deprecationReason": null,
              "description": null,
              "isDeprecated": false,
              "name": "success",
              "type": {
                "kind": "SCALAR",
                "name": "Boolean",
                "ofType": null
              }
            },
            {
              "args": [],
              "deprecationReason": null,
              "description": null,
              "isDeprecated": false,
              "name": "errors",
              "type": {
                "kind": "LIST",
                "name": null,
                "ofType": {
                  "kind": "SCALAR",
                  "name": "String",
                  "ofType": null
                }
              }
            }
          ],
          "inputFields": null,
          "interfaces": [],
          "kind": "OBJECT",
          "name": "UpfMutation",
          "possibleTypes": null
        },
        {
          "description": "The `Boolean` scalar type represents `true` or `false`.",
          "enumValues": null,
          "fields": null,
          "inputFields": null,
          "interfaces": null,
          "kind": "SCALAR",
          "name": "Boolean",
          "possibleTypes": null
        },
        {
          "description": null,
          "enumValues": null,
          "fields": null,
          "inputFields": [
            {
              "defaultValue": null,
              "description": null,
              "name": "id",
              "type": {
                "kind": "SCALAR",
                "name": "Int",
                "ofType": null
              }
            },
            {
              "defaultValue": null,
              "description": null,
              "name": "safra",
              "type": {
                "kind": "INPUT_OBJECT",
                "name": "SafraInput",
                "ofType": null
              }
            },
            {
              "defaultValue": null,
              "description": null,
              "name": "nomeComunidade",
              "type": {
                "kind": "SCALAR",
                "name": "String",
                "ofType": null
              }
            },
            {
              "defaultValue": null,
              "description": null,
              "name": "nomeUsuario",
              "type": {
                "kind": "SCALAR",
                "name": "String",
                "ofType": null
              }
            },
            {
              "defaultValue": null,
              "description": null,
              "name": "dataNascimentoUsuario",
              "type": {
                "kind": "SCALAR",
                "name": "Date",
                "ofType": null
              }
            },
            {
              "defaultValue": null,
              "description": null,
              "name": "generoUsuario",
              "type": {
                "kind": "SCALAR",
                "name": "String",
                "ofType": null
              }
            },
            {
              "defaultValue": null,
              "description": null,
              "name": "unidadeArea",
              "type": {
                "kind": "SCALAR",
                "name": "String",
                "ofType": null
              }
            },
            {
              "defaultValue": null,
              "description": null,
              "name": "unidadeValor",
              "type": {
                "kind": "SCALAR",
                "name": "String",
                "ofType": null
              }
            },
            {
              "defaultValue": null,
              "description": null,
              "name": "cooperativa",
              "type": {
                "kind": "SCALAR",
                "name": "String",
                "ofType": null
              }
            },
            {
              "defaultValue": null,
              "description": null,
              "name": "mobileKey",
              "type": {
                "kind": "SCALAR",
                "name": "String",
                "ofType": null
              }
            }
          ],
          "interfaces": null,
          "kind": "INPUT_OBJECT",
          "name": "UpfInput",
          "possibleTypes": null
        },
        {
          "description": null,
          "enumValues": null,
          "fields": null,
          "inputFields": [
            {
              "defaultValue": null,
              "description": null,
              "name": "id",
              "type": {
                "kind": "SCALAR",
                "name": "Int",
                "ofType": null
              }
            },
            {
              "defaultValue": null,
              "description": null,
              "name": "nome",
              "type": {
                "kind": "SCALAR",
                "name": "String",
                "ofType": null
              }
            },
            {
              "defaultValue": null,
              "description": null,
              "name": "dataInicio",
              "type": {
                "kind": "SCALAR",
                "name": "Date",
                "ofType": null
              }
            },
            {
              "defaultValue": null,
              "description": null,
              "name": "dataFinal",
              "type": {
                "kind": "SCALAR",
                "name": "Date",
                "ofType": null
              }
            },
            {
              "defaultValue": null,
              "description": null,
              "name": "ativa",
              "type": {
                "kind": "SCALAR",
                "name": "Boolean",
                "ofType": null
              }
            },
            {
              "defaultValue": null,
              "description": null,
              "name": "remuneracaoDesejadaPorDia",
              "type": {
                "kind": "SCALAR",
                "name": "Float",
                "ofType": null
              }
            },
            {
              "defaultValue": null,
              "description": null,
              "name": "castanhalTamanho",
              "type": {
                "kind": "SCALAR",
                "name": "Float",
                "ofType": null
              }
            },
            {
              "defaultValue": null,
              "description": null,
              "name": "castanhalNumeroCastanheiras",
              "type": {
                "kind": "SCALAR",
                "name": "Int",
                "ofType": null
              }
            },
            {
              "defaultValue": null,
              "description": null,
              "name": "castanhalNumeroFamilias",
              "type": {
                "kind": "SCALAR",
                "name": "Int",
                "ofType": null
              }
            },
            {
              "defaultValue": null,
              "description": null,
              "name": "upfId",
              "type": {
                "kind": "SCALAR",
                "name": "Int",
                "ofType": null
              }
            },
            {
              "defaultValue": null,
              "description": null,
              "name": "municipioId",
              "type": {
                "kind": "SCALAR",
                "name": "Int",
                "ofType": null
              }
            },
            {
              "defaultValue": null,
              "description": null,
              "name": "ufId",
              "type": {
                "kind": "SCALAR",
                "name": "Int",
                "ofType": null
              }
            },
            {
              "defaultValue": null,
              "description": null,
              "name": "simulacao",
              "type": {
                "kind": "SCALAR",
                "name": "Boolean",
                "ofType": null
              }
            },
            {
              "defaultValue": null,
              "description": null,
              "name": "localizacaoLat",
              "type": {
                "kind": "SCALAR",
                "name": "Float",
                "ofType": null
              }
            },
            {
              "defaultValue": null,
              "description": null,
              "name": "localizacaoLong",
              "type": {
                "kind": "SCALAR",
                "name": "Float",
                "ofType": null
              }
            },
            {
              "defaultValue": null,
              "description": null,
              "name": "despesaList",
              "type": {
                "kind": "LIST",
                "name": null,
                "ofType": {
                  "kind": "INPUT_OBJECT",
                  "name": "DespesaInput",
                  "ofType": null
                }
              }
            },
            {
              "defaultValue": null,
              "description": null,
              "name": "vendaList",
              "type": {
                "kind": "LIST",
                "name": null,
                "ofType": {
                  "kind": "INPUT_OBJECT",
                  "name": "VendaInput",
                  "ofType": null
                }
              }
            },
            {
              "defaultValue": null,
              "description": null,
              "name": "producaoList",
              "type": {
                "kind": "LIST",
                "name": null,
                "ofType": {
                  "kind": "INPUT_OBJECT",
                  "name": "ProducaoInput",
                  "ofType": null
                }
              }
            },
            {
              "defaultValue": null,
              "description": null,
              "name": "trabalhoUpfList",
              "type": {
                "kind": "LIST",
                "name": null,
                "ofType": {
                  "kind": "INPUT_OBJECT",
                  "name": "TrabalhoUpfInput",
                  "ofType": null
                }
              }
            },
            {
              "defaultValue": null,
              "description": null,
              "name": "upfIntegranteList",
              "type": {
                "kind": "LIST",
                "name": null,
                "ofType": {
                  "kind": "INPUT_OBJECT",
                  "name": "UpfIntegranteInput",
                  "ofType": null
                }
              }
            },
            {
              "defaultValue": null,
              "description": null,
              "name": "trabalhoUpfIntegranteList",
              "type": {
                "kind": "LIST",
                "name": null,
                "ofType": {
                  "kind": "INPUT_OBJECT",
                  "name": "TrabalhoUpfIntegranteInput",
                  "ofType": null
                }
              }
            },
            {
              "defaultValue": null,
              "description": null,
              "name": "equipamentoList",
              "type": {
                "kind": "LIST",
                "name": null,
                "ofType": {
                  "kind": "INPUT_OBJECT",
                  "name": "EquipamentoInput",
                  "ofType": null
                }
              }
            }
          ],
          "interfaces": null,
          "kind": "INPUT_OBJECT",
          "name": "SafraInput",
          "possibleTypes": null
        },
        {
          "description": "The `Float` scalar type represents signed double-precision fractional values as specified by [IEEE 754](http://en.wikipedia.org/wiki/IEEE_floating_point). ",
          "enumValues": null,
          "fields": null,
          "inputFields": null,
          "interfaces": null,
          "kind": "SCALAR",
          "name": "Float",
          "possibleTypes": null
        },
        {
          "description": null,
          "enumValues": null,
          "fields": null,
          "inputFields": [
            {
              "defaultValue": null,
              "description": null,
              "name": "id",
              "type": {
                "kind": "SCALAR",
                "name": "Int",
                "ofType": null
              }
            },
            {
              "defaultValue": null,
              "description": null,
              "name": "tipo",
              "type": {
                "kind": "SCALAR",
                "name": "String",
                "ofType": null
              }
            },
            {
              "defaultValue": null,
              "description": null,
              "name": "valor",
              "type": {
                "kind": "SCALAR",
                "name": "Float",
                "ofType": null
              }
            },
            {
              "defaultValue": null,
              "description": null,
              "name": "data",
              "type": {
                "kind": "SCALAR",
                "name": "Date",
                "ofType": null
              }
            },
            {
              "defaultValue": null,
              "description": null,
              "name": "observacoes",
              "type": {
                "kind": "SCALAR",
                "name": "String",
                "ofType": null
              }
            },
            {
              "defaultValue": null,
              "description": null,
              "name": "aviamento",
              "type": {
                "kind": "SCALAR",
                "name": "Boolean",
                "ofType": null
              }
            },
            {
              "defaultValue": null,
              "description": null,
              "name": "diariaDias",
              "type": {
                "kind": "SCALAR",
                "name": "Float",
                "ofType": null
              }
            },
            {
              "defaultValue": null,
              "description": null,
              "name": "diariaQuantidadeDiaristas",
              "type": {
                "kind": "SCALAR",
                "name": "Int",
                "ofType": null
              }
            },
            {
              "defaultValue": null,
              "description": null,
              "name": "diariaValorDiaria",
              "type": {
                "kind": "SCALAR",
                "name": "Float",
                "ofType": null
              }
            },
            {
              "defaultValue": null,
              "description": null,
              "name": "safraId",
              "type": {
                "kind": "SCALAR",
                "name": "Int",
                "ofType": null
              }
            }
          ],
          "interfaces": null,
          "kind": "INPUT_OBJECT",
          "name": "DespesaInput",
          "possibleTypes": null
        },
        {
          "description": null,
          "enumValues": null,
          "fields": null,
          "inputFields": [
            {
              "defaultValue": null,
              "description": null,
              "name": "id",
              "type": {
                "kind": "SCALAR",
                "name": "Int",
                "ofType": null
              }
            },
            {
              "defaultValue": null,
              "description": null,
              "name": "quantidade",
              "type": {
                "kind": "SCALAR",
                "name": "Int",
                "ofType": null
              }
            },
            {
              "defaultValue": null,
              "description": null,
              "name": "valorUnitario",
              "type": {
                "kind": "SCALAR",
                "name": "Float",
                "ofType": null
              }
            },
            {
              "defaultValue": null,
              "description": null,
              "name": "data",
              "type": {
                "kind": "SCALAR",
                "name": "Date",
                "ofType": null
              }
            },
            {
              "defaultValue": null,
              "description": null,
              "name": "observacoes",
              "type": {
                "kind": "SCALAR",
                "name": "String",
                "ofType": null
              }
            },
            {
              "defaultValue": null,
              "description": null,
              "name": "safraId",
              "type": {
                "kind": "SCALAR",
                "name": "Int",
                "ofType": null
              }
            },
            {
              "defaultValue": null,
              "description": null,
              "name": "compradorId",
              "type": {
                "kind": "SCALAR",
                "name": "Int",
                "ofType": null
              }
            },
            {
              "defaultValue": null,
              "description": null,
              "name": "comprador",
              "type": {
                "kind": "SCALAR",
                "name": "String",
                "ofType": null
              }
            },
            {
              "defaultValue": null,
              "description": null,
              "name": "quitacaoAviamento",
              "type": {
                "kind": "SCALAR",
                "name": "Boolean",
                "ofType": null
              }
            }
          ],
          "interfaces": null,
          "kind": "INPUT_OBJECT",
          "name": "VendaInput",
          "possibleTypes": null
        },
        {
          "description": null,
          "enumValues": null,
          "fields": null,
          "inputFields": [
            {
              "defaultValue": null,
              "description": null,
              "name": "id",
              "type": {
                "kind": "SCALAR",
                "name": "Int",
                "ofType": null
              }
            },
            {
              "defaultValue": null,
              "description": null,
              "name": "data",
              "type": {
                "kind": "SCALAR",
                "name": "Date",
                "ofType": null
              }
            },
            {
              "defaultValue": null,
              "description": null,
              "name": "quantidade",
              "type": {
                "kind": "SCALAR",
                "name": "Int",
                "ofType": null
              }
            },
            {
              "defaultValue": null,
              "description": null,
              "name": "safraId",
              "type": {
                "kind": "SCALAR",
                "name": "Int",
                "ofType": null
              }
            },
            {
              "defaultValue": null,
              "description": null,
              "name": "observacoes",
              "type": {
                "kind": "SCALAR",
                "name": "String",
                "ofType": null
              }
            }
          ],
          "interfaces": null,
          "kind": "INPUT_OBJECT",
          "name": "ProducaoInput",
          "possibleTypes": null
        },
        {
          "description": null,
          "enumValues": null,
          "fields": null,
          "inputFields": [
            {
              "defaultValue": null,
              "description": null,
              "name": "id",
              "type": {
                "kind": "SCALAR",
                "name": "Int",
                "ofType": null
              }
            },
            {
              "defaultValue": null,
              "description": null,
              "name": "data",
              "type": {
                "kind": "SCALAR",
                "name": "Date",
                "ofType": null
              }
            },
            {
              "defaultValue": null,
              "description": null,
              "name": "dias",
              "type": {
                "kind": "SCALAR",
                "name": "Float",
                "ofType": null
              }
            },
            {
              "defaultValue": null,
              "description": null,
              "name": "remuneracaoDesejada",
              "type": {
                "kind": "SCALAR",
                "name": "Float",
                "ofType": null
              }
            },
            {
              "defaultValue": null,
              "description": null,
              "name": "observacoes",
              "type": {
                "kind": "SCALAR",
                "name": "String",
                "ofType": null
              }
            },
            {
              "defaultValue": null,
              "description": null,
              "name": "safraId",
              "type": {
                "kind": "SCALAR",
                "name": "Int",
                "ofType": null
              }
            }
          ],
          "interfaces": null,
          "kind": "INPUT_OBJECT",
          "name": "TrabalhoUpfInput",
          "possibleTypes": null
        },
        {
          "description": null,
          "enumValues": null,
          "fields": null,
          "inputFields": [
            {
              "defaultValue": null,
              "description": null,
              "name": "id",
              "type": {
                "kind": "SCALAR",
                "name": "Int",
                "ofType": null
              }
            },
            {
              "defaultValue": null,
              "description": null,
              "name": "nome",
              "type": {
                "kind": "SCALAR",
                "name": "String",
                "ofType": null
              }
            },
            {
              "defaultValue": null,
              "description": null,
              "name": "dataNascimento",
              "type": {
                "kind": "SCALAR",
                "name": "Date",
                "ofType": null
              }
            },
            {
              "defaultValue": null,
              "description": null,
              "name": "safraId",
              "type": {
                "kind": "SCALAR",
                "name": "Int",
                "ofType": null
              }
            },
            {
              "defaultValue": null,
              "description": null,
              "name": "mainIntegrante",
              "type": {
                "kind": "SCALAR",
                "name": "Boolean",
                "ofType": null
              }
            },
            {
              "defaultValue": null,
              "description": null,
              "name": "parentesco",
              "type": {
                "kind": "SCALAR",
                "name": "String",
                "ofType": null
              }
            },
            {
              "defaultValue": null,
              "description": null,
              "name": "genero",
              "type": {
                "kind": "SCALAR",
                "name": "String",
                "ofType": null
              }
            }
          ],
          "interfaces": null,
          "kind": "INPUT_OBJECT",
          "name": "UpfIntegranteInput",
          "possibleTypes": null
        },
        {
          "description": null,
          "enumValues": null,
          "fields": null,
          "inputFields": [
            {
              "defaultValue": null,
              "description": null,
              "name": "id",
              "type": {
                "kind": "SCALAR",
                "name": "Int",
                "ofType": null
              }
            },
            {
              "defaultValue": null,
              "description": null,
              "name": "trabalhoUpfId",
              "type": {
                "kind": "SCALAR",
                "name": "Int",
                "ofType": null
              }
            },
            {
              "defaultValue": null,
              "description": null,
              "name": "upfIntegranteId",
              "type": {
                "kind": "SCALAR",
                "name": "Int",
                "ofType": null
              }
            }
          ],
          "interfaces": null,
          "kind": "INPUT_OBJECT",
          "name": "TrabalhoUpfIntegranteInput",
          "possibleTypes": null
        },
        {
          "description": null,
          "enumValues": null,
          "fields": null,
          "inputFields": [
            {
              "defaultValue": null,
              "description": null,
              "name": "id",
              "type": {
                "kind": "SCALAR",
                "name": "Int",
                "ofType": null
              }
            },
            {
              "defaultValue": null,
              "description": null,
              "name": "tipo",
              "type": {
                "kind": "SCALAR",
                "name": "String",
                "ofType": null
              }
            },
            {
              "defaultValue": null,
              "description": null,
              "name": "marcaEModelo",
              "type": {
                "kind": "SCALAR",
                "name": "String",
                "ofType": null
              }
            },
            {
              "defaultValue": null,
              "description": null,
              "name": "anoFabricacao",
              "type": {
                "kind": "SCALAR",
                "name": "Int",
                "ofType": null
              }
            },
            {
              "defaultValue": null,
              "description": null,
              "name": "anoCompra",
              "type": {
                "kind": "SCALAR",
                "name": "Int",
                "ofType": null
              }
            },
            {
              "defaultValue": null,
              "description": null,
              "name": "quantidade",
              "type": {
                "kind": "SCALAR",
                "name": "Int",
                "ofType": null
              }
            },
            {
              "defaultValue": null,
              "description": null,
              "name": "valorCompra",
              "type": {
                "kind": "SCALAR",
                "name": "Float",
                "ofType": null
              }
            },
            {
              "defaultValue": null,
              "description": null,
              "name": "durabilidadeEstimadaAnos",
              "type": {
                "kind": "SCALAR",
                "name": "Int",
                "ofType": null
              }
            },
            {
              "defaultValue": null,
              "description": null,
              "name": "usado",
              "type": {
                "kind": "SCALAR",
                "name": "Boolean",
                "ofType": null
              }
            },
            {
              "defaultValue": null,
              "description": null,
              "name": "safraId",
              "type": {
                "kind": "SCALAR",
                "name": "Int",
                "ofType": null
              }
            }
          ],
          "interfaces": null,
          "kind": "INPUT_OBJECT",
          "name": "EquipamentoInput",
          "possibleTypes": null
        },
        {
          "description": "A GraphQL Schema defines the capabilities of a GraphQL server. It exposes all available types and directives on the server, as well as the entry points for query, mutation and subscription operations.",
          "enumValues": null,
          "fields": [
            {
              "args": [],
              "deprecationReason": null,
              "description": "A list of all types supported by this server.",
              "isDeprecated": false,
              "name": "types",
              "type": {
                "kind": "NON_NULL",
                "name": null,
                "ofType": {
                  "kind": "LIST",
                  "name": null,
                  "ofType": {
                    "kind": "NON_NULL",
                    "name": null,
                    "ofType": {
                      "kind": "OBJECT",
                      "name": "__Type",
                      "ofType": null
                    }
                  }
                }
              }
            },
            {
              "args": [],
              "deprecationReason": null,
              "description": "The type that query operations will be rooted at.",
              "isDeprecated": false,
              "name": "queryType",
              "type": {
                "kind": "NON_NULL",
                "name": null,
                "ofType": {
                  "kind": "OBJECT",
                  "name": "__Type",
                  "ofType": null
                }
              }
            },
            {
              "args": [],
              "deprecationReason": null,
              "description": "If this server supports mutation, the type that mutation operations will be rooted at.",
              "isDeprecated": false,
              "name": "mutationType",
              "type": {
                "kind": "OBJECT",
                "name": "__Type",
                "ofType": null
              }
            },
            {
              "args": [],
              "deprecationReason": null,
              "description": "If this server support subscription, the type that subscription operations will be rooted at.",
              "isDeprecated": false,
              "name": "subscriptionType",
              "type": {
                "kind": "OBJECT",
                "name": "__Type",
                "ofType": null
              }
            },
            {
              "args": [],
              "deprecationReason": null,
              "description": "A list of all directives supported by this server.",
              "isDeprecated": false,
              "name": "directives",
              "type": {
                "kind": "NON_NULL",
                "name": null,
                "ofType": {
                  "kind": "LIST",
                  "name": null,
                  "ofType": {
                    "kind": "NON_NULL",
                    "name": null,
                    "ofType": {
                      "kind": "OBJECT",
                      "name": "__Directive",
                      "ofType": null
                    }
                  }
                }
              }
            }
          ],
          "inputFields": null,
          "interfaces": [],
          "kind": "OBJECT",
          "name": "__Schema",
          "possibleTypes": null
        },
        {
          "description": "The fundamental unit of any GraphQL Schema is the type. There are many kinds of types in GraphQL as represented by the `__TypeKind` enum.\n\nDepending on the kind of a type, certain fields describe information about that type. Scalar types provide no information beyond a name and description, while Enum types provide their values. Object and Interface types provide the fields they describe. Abstract types, Union and Interface, provide the Object types possible at runtime. List and NonNull types compose other types.",
          "enumValues": null,
          "fields": [
            {
              "args": [],
              "deprecationReason": null,
              "description": null,
              "isDeprecated": false,
              "name": "kind",
              "type": {
                "kind": "NON_NULL",
                "name": null,
                "ofType": {
                  "kind": "ENUM",
                  "name": "__TypeKind",
                  "ofType": null
                }
              }
            },
            {
              "args": [],
              "deprecationReason": null,
              "description": null,
              "isDeprecated": false,
              "name": "name",
              "type": {
                "kind": "SCALAR",
                "name": "String",
                "ofType": null
              }
            },
            {
              "args": [],
              "deprecationReason": null,
              "description": null,
              "isDeprecated": false,
              "name": "description",
              "type": {
                "kind": "SCALAR",
                "name": "String",
                "ofType": null
              }
            },
            {
              "args": [
                {
                  "defaultValue": "false",
                  "description": null,
                  "name": "includeDeprecated",
                  "type": {
                    "kind": "SCALAR",
                    "name": "Boolean",
                    "ofType": null
                  }
                }
              ],
              "deprecationReason": null,
              "description": null,
              "isDeprecated": false,
              "name": "fields",
              "type": {
                "kind": "LIST",
                "name": null,
                "ofType": {
                  "kind": "NON_NULL",
                  "name": null,
                  "ofType": {
                    "kind": "OBJECT",
                    "name": "__Field",
                    "ofType": null
                  }
                }
              }
            },
            {
              "args": [],
              "deprecationReason": null,
              "description": null,
              "isDeprecated": false,
              "name": "interfaces",
              "type": {
                "kind": "LIST",
                "name": null,
                "ofType": {
                  "kind": "NON_NULL",
                  "name": null,
                  "ofType": {
                    "kind": "OBJECT",
                    "name": "__Type",
                    "ofType": null
                  }
                }
              }
            },
            {
              "args": [],
              "deprecationReason": null,
              "description": null,
              "isDeprecated": false,
              "name": "possibleTypes",
              "type": {
                "kind": "LIST",
                "name": null,
                "ofType": {
                  "kind": "NON_NULL",
                  "name": null,
                  "ofType": {
                    "kind": "OBJECT",
                    "name": "__Type",
                    "ofType": null
                  }
                }
              }
            },
            {
              "args": [
                {
                  "defaultValue": "false",
                  "description": null,
                  "name": "includeDeprecated",
                  "type": {
                    "kind": "SCALAR",
                    "name": "Boolean",
                    "ofType": null
                  }
                }
              ],
              "deprecationReason": null,
              "description": null,
              "isDeprecated": false,
              "name": "enumValues",
              "type": {
                "kind": "LIST",
                "name": null,
                "ofType": {
                  "kind": "NON_NULL",
                  "name": null,
                  "ofType": {
                    "kind": "OBJECT",
                    "name": "__EnumValue",
                    "ofType": null
                  }
                }
              }
            },
            {
              "args": [],
              "deprecationReason": null,
              "description": null,
              "isDeprecated": false,
              "name": "inputFields",
              "type": {
                "kind": "LIST",
                "name": null,
                "ofType": {
                  "kind": "NON_NULL",
                  "name": null,
                  "ofType": {
                    "kind": "OBJECT",
                    "name": "__InputValue",
                    "ofType": null
                  }
                }
              }
            },
            {
              "args": [],
              "deprecationReason": null,
              "description": null,
              "isDeprecated": false,
              "name": "ofType",
              "type": {
                "kind": "OBJECT",
                "name": "__Type",
                "ofType": null
              }
            }
          ],
          "inputFields": null,
          "interfaces": [],
          "kind": "OBJECT",
          "name": "__Type",
          "possibleTypes": null
        },
        {
          "description": "An enum describing what kind of type a given `__Type` is",
          "enumValues": [
            {
              "deprecationReason": null,
              "description": "Indicates this type is a scalar.",
              "isDeprecated": false,
              "name": "SCALAR"
            },
            {
              "deprecationReason": null,
              "description": "Indicates this type is an object. `fields` and `interfaces` are valid fields.",
              "isDeprecated": false,
              "name": "OBJECT"
            },
            {
              "deprecationReason": null,
              "description": "Indicates this type is an interface. `fields` and `possibleTypes` are valid fields.",
              "isDeprecated": false,
              "name": "INTERFACE"
            },
            {
              "deprecationReason": null,
              "description": "Indicates this type is a union. `possibleTypes` is a valid field.",
              "isDeprecated": false,
              "name": "UNION"
            },
            {
              "deprecationReason": null,
              "description": "Indicates this type is an enum. `enumValues` is a valid field.",
              "isDeprecated": false,
              "name": "ENUM"
            },
            {
              "deprecationReason": null,
              "description": "Indicates this type is an input object. `inputFields` is a valid field.",
              "isDeprecated": false,
              "name": "INPUT_OBJECT"
            },
            {
              "deprecationReason": null,
              "description": "Indicates this type is a list. `ofType` is a valid field.",
              "isDeprecated": false,
              "name": "LIST"
            },
            {
              "deprecationReason": null,
              "description": "Indicates this type is a non-null. `ofType` is a valid field.",
              "isDeprecated": false,
              "name": "NON_NULL"
            }
          ],
          "fields": null,
          "inputFields": null,
          "interfaces": null,
          "kind": "ENUM",
          "name": "__TypeKind",
          "possibleTypes": null
        },
        {
          "description": "Object and Interface types are described by a list of Fields, each of which has a name, potentially a list of arguments, and a return type.",
          "enumValues": null,
          "fields": [
            {
              "args": [],
              "deprecationReason": null,
              "description": null,
              "isDeprecated": false,
              "name": "name",
              "type": {
                "kind": "NON_NULL",
                "name": null,
                "ofType": {
                  "kind": "SCALAR",
                  "name": "String",
                  "ofType": null
                }
              }
            },
            {
              "args": [],
              "deprecationReason": null,
              "description": null,
              "isDeprecated": false,
              "name": "description",
              "type": {
                "kind": "SCALAR",
                "name": "String",
                "ofType": null
              }
            },
            {
              "args": [],
              "deprecationReason": null,
              "description": null,
              "isDeprecated": false,
              "name": "args",
              "type": {
                "kind": "NON_NULL",
                "name": null,
                "ofType": {
                  "kind": "LIST",
                  "name": null,
                  "ofType": {
                    "kind": "NON_NULL",
                    "name": null,
                    "ofType": {
                      "kind": "OBJECT",
                      "name": "__InputValue",
                      "ofType": null
                    }
                  }
                }
              }
            },
            {
              "args": [],
              "deprecationReason": null,
              "description": null,
              "isDeprecated": false,
              "name": "type",
              "type": {
                "kind": "NON_NULL",
                "name": null,
                "ofType": {
                  "kind": "OBJECT",
                  "name": "__Type",
                  "ofType": null
                }
              }
            },
            {
              "args": [],
              "deprecationReason": null,
              "description": null,
              "isDeprecated": false,
              "name": "isDeprecated",
              "type": {
                "kind": "NON_NULL",
                "name": null,
                "ofType": {
                  "kind": "SCALAR",
                  "name": "Boolean",
                  "ofType": null
                }
              }
            },
            {
              "args": [],
              "deprecationReason": null,
              "description": null,
              "isDeprecated": false,
              "name": "deprecationReason",
              "type": {
                "kind": "SCALAR",
                "name": "String",
                "ofType": null
              }
            }
          ],
          "inputFields": null,
          "interfaces": [],
          "kind": "OBJECT",
          "name": "__Field",
          "possibleTypes": null
        },
        {
          "description": "Arguments provided to Fields or Directives and the input fields of an InputObject are represented as Input Values which describe their type and optionally a default value.",
          "enumValues": null,
          "fields": [
            {
              "args": [],
              "deprecationReason": null,
              "description": null,
              "isDeprecated": false,
              "name": "name",
              "type": {
                "kind": "NON_NULL",
                "name": null,
                "ofType": {
                  "kind": "SCALAR",
                  "name": "String",
                  "ofType": null
                }
              }
            },
            {
              "args": [],
              "deprecationReason": null,
              "description": null,
              "isDeprecated": false,
              "name": "description",
              "type": {
                "kind": "SCALAR",
                "name": "String",
                "ofType": null
              }
            },
            {
              "args": [],
              "deprecationReason": null,
              "description": null,
              "isDeprecated": false,
              "name": "type",
              "type": {
                "kind": "NON_NULL",
                "name": null,
                "ofType": {
                  "kind": "OBJECT",
                  "name": "__Type",
                  "ofType": null
                }
              }
            },
            {
              "args": [],
              "deprecationReason": null,
              "description": null,
              "isDeprecated": false,
              "name": "defaultValue",
              "type": {
                "kind": "SCALAR",
                "name": "String",
                "ofType": null
              }
            }
          ],
          "inputFields": null,
          "interfaces": [],
          "kind": "OBJECT",
          "name": "__InputValue",
          "possibleTypes": null
        },
        {
          "description": "One possible value for a given Enum. Enum values are unique values, not a placeholder for a string or numeric value. However an Enum value is returned in a JSON response as a string.",
          "enumValues": null,
          "fields": [
            {
              "args": [],
              "deprecationReason": null,
              "description": null,
              "isDeprecated": false,
              "name": "name",
              "type": {
                "kind": "NON_NULL",
                "name": null,
                "ofType": {
                  "kind": "SCALAR",
                  "name": "String",
                  "ofType": null
                }
              }
            },
            {
              "args": [],
              "deprecationReason": null,
              "description": null,
              "isDeprecated": false,
              "name": "description",
              "type": {
                "kind": "SCALAR",
                "name": "String",
                "ofType": null
              }
            },
            {
              "args": [],
              "deprecationReason": null,
              "description": null,
              "isDeprecated": false,
              "name": "isDeprecated",
              "type": {
                "kind": "NON_NULL",
                "name": null,
                "ofType": {
                  "kind": "SCALAR",
                  "name": "Boolean",
                  "ofType": null
                }
              }
            },
            {
              "args": [],
              "deprecationReason": null,
              "description": null,
              "isDeprecated": false,
              "name": "deprecationReason",
              "type": {
                "kind": "SCALAR",
                "name": "String",
                "ofType": null
              }
            }
          ],
          "inputFields": null,
          "interfaces": [],
          "kind": "OBJECT",
          "name": "__EnumValue",
          "possibleTypes": null
        },
        {
          "description": "A Directive provides a way to describe alternate runtime execution and type validation behavior in a GraphQL document.\n\nIn some cases, you need to provide options to alter GraphQL's execution behavior in ways field arguments will not suffice, such as conditionally including or skipping a field. Directives provide this by describing additional information to the executor.",
          "enumValues": null,
          "fields": [
            {
              "args": [],
              "deprecationReason": null,
              "description": null,
              "isDeprecated": false,
              "name": "name",
              "type": {
                "kind": "NON_NULL",
                "name": null,
                "ofType": {
                  "kind": "SCALAR",
                  "name": "String",
                  "ofType": null
                }
              }
            },
            {
              "args": [],
              "deprecationReason": null,
              "description": null,
              "isDeprecated": false,
              "name": "description",
              "type": {
                "kind": "SCALAR",
                "name": "String",
                "ofType": null
              }
            },
            {
              "args": [],
              "deprecationReason": null,
              "description": null,
              "isDeprecated": false,
              "name": "locations",
              "type": {
                "kind": "NON_NULL",
                "name": null,
                "ofType": {
                  "kind": "LIST",
                  "name": null,
                  "ofType": {
                    "kind": "NON_NULL",
                    "name": null,
                    "ofType": {
                      "kind": "ENUM",
                      "name": "__DirectiveLocation",
                      "ofType": null
                    }
                  }
                }
              }
            },
            {
              "args": [],
              "deprecationReason": null,
              "description": null,
              "isDeprecated": false,
              "name": "args",
              "type": {
                "kind": "NON_NULL",
                "name": null,
                "ofType": {
                  "kind": "LIST",
                  "name": null,
                  "ofType": {
                    "kind": "NON_NULL",
                    "name": null,
                    "ofType": {
                      "kind": "OBJECT",
                      "name": "__InputValue",
                      "ofType": null
                    }
                  }
                }
              }
            },
            {
              "args": [],
              "deprecationReason": "Use `locations`.",
              "description": null,
              "isDeprecated": true,
              "name": "onOperation",
              "type": {
                "kind": "NON_NULL",
                "name": null,
                "ofType": {
                  "kind": "SCALAR",
                  "name": "Boolean",
                  "ofType": null
                }
              }
            },
            {
              "args": [],
              "deprecationReason": "Use `locations`.",
              "description": null,
              "isDeprecated": true,
              "name": "onFragment",
              "type": {
                "kind": "NON_NULL",
                "name": null,
                "ofType": {
                  "kind": "SCALAR",
                  "name": "Boolean",
                  "ofType": null
                }
              }
            },
            {
              "args": [],
              "deprecationReason": "Use `locations`.",
              "description": null,
              "isDeprecated": true,
              "name": "onField",
              "type": {
                "kind": "NON_NULL",
                "name": null,
                "ofType": {
                  "kind": "SCALAR",
                  "name": "Boolean",
                  "ofType": null
                }
              }
            }
          ],
          "inputFields": null,
          "interfaces": [],
          "kind": "OBJECT",
          "name": "__Directive",
          "possibleTypes": null
        },
        {
          "description": "A Directive can be adjacent to many parts of the GraphQL language, a __DirectiveLocation describes one such possible adjacencies.",
          "enumValues": [
            {
              "deprecationReason": null,
              "description": "Location adjacent to a query operation.",
              "isDeprecated": false,
              "name": "QUERY"
            },
            {
              "deprecationReason": null,
              "description": "Location adjacent to a mutation operation.",
              "isDeprecated": false,
              "name": "MUTATION"
            },
            {
              "deprecationReason": null,
              "description": "Location adjacent to a subscription operation.",
              "isDeprecated": false,
              "name": "SUBSCRIPTION"
            },
            {
              "deprecationReason": null,
              "description": "Location adjacent to a field.",
              "isDeprecated": false,
              "name": "FIELD"
            },
            {
              "deprecationReason": null,
              "description": "Location adjacent to a fragment definition.",
              "isDeprecated": false,
              "name": "FRAGMENT_DEFINITION"
            },
            {
              "deprecationReason": null,
              "description": "Location adjacent to a fragment spread.",
              "isDeprecated": false,
              "name": "FRAGMENT_SPREAD"
            },
            {
              "deprecationReason": null,
              "description": "Location adjacent to an inline fragment.",
              "isDeprecated": false,
              "name": "INLINE_FRAGMENT"
            },
            {
              "deprecationReason": null,
              "description": "Location adjacent to a schema definition.",
              "isDeprecated": false,
              "name": "SCHEMA"
            },
            {
              "deprecationReason": null,
              "description": "Location adjacent to a scalar definition.",
              "isDeprecated": false,
              "name": "SCALAR"
            },
            {
              "deprecationReason": null,
              "description": "Location adjacent to an object definition.",
              "isDeprecated": false,
              "name": "OBJECT"
            },
            {
              "deprecationReason": null,
              "description": "Location adjacent to a field definition.",
              "isDeprecated": false,
              "name": "FIELD_DEFINITION"
            },
            {
              "deprecationReason": null,
              "description": "Location adjacent to an argument definition.",
              "isDeprecated": false,
              "name": "ARGUMENT_DEFINITION"
            },
            {
              "deprecationReason": null,
              "description": "Location adjacent to an interface definition.",
              "isDeprecated": false,
              "name": "INTERFACE"
            },
            {
              "deprecationReason": null,
              "description": "Location adjacent to a union definition.",
              "isDeprecated": false,
              "name": "UNION"
            },
            {
              "deprecationReason": null,
              "description": "Location adjacent to an enum definition.",
              "isDeprecated": false,
              "name": "ENUM"
            },
            {
              "deprecationReason": null,
              "description": "Location adjacent to an enum value definition.",
              "isDeprecated": false,
              "name": "ENUM_VALUE"
            },
            {
              "deprecationReason": null,
              "description": "Location adjacent to an input object definition.",
              "isDeprecated": false,
              "name": "INPUT_OBJECT"
            },
            {
              "deprecationReason": null,
              "description": "Location adjacent to an input object field definition.",
              "isDeprecated": false,
              "name": "INPUT_FIELD_DEFINITION"
            }
          ],
          "fields": null,
          "inputFields": null,
          "interfaces": null,
          "kind": "ENUM",
          "name": "__DirectiveLocation",
          "possibleTypes": null
        }
      ]
    }
  }
}