{
  "formatVersion": 1,
  "database": {
    "version": 3,
    "identityHash": "7ab5c55f56148a28029e01b6c776425d",
    "entities": [
      {
        "tableName": "categoria_despesa",
        "createSql": "CREATE TABLE IF NOT EXISTS `${TABLE_NAME}` (`id` INTEGER PRIMARY KEY AUTOINCREMENT NOT NULL, `nome` TEXT NOT NULL)",
        "fields": [
          {
            "fieldPath": "id",
            "columnName": "id",
            "affinity": "INTEGER",
            "notNull": true
          },
          {
            "fieldPath": "nome",
            "columnName": "nome",
            "affinity": "TEXT",
            "notNull": true
          }
        ],
        "primaryKey": {
          "columnNames": [
            "id"
          ],
          "autoGenerate": true
        },
        "indices": [],
        "foreignKeys": []
      },
      {
        "tableName": "trabalho_upf",
        "createSql": "CREATE TABLE IF NOT EXISTS `${TABLE_NAME}` (`id` INTEGER PRIMARY KEY AUTOINCREMENT NOT NULL, `data` INTEGER NOT NULL, `dias` INTEGER, `remuneracao_desejada` INTEGER, `observacoes` TEXT, `safra_id` INTEGER NOT NULL, FOREIGN KEY(`safra_id`) REFERENCES `safra`(`id`) ON UPDATE NO ACTION ON DELETE CASCADE )",
        "fields": [
          {
            "fieldPath": "id",
            "columnName": "id",
            "affinity": "INTEGER",
            "notNull": true
          },
          {
            "fieldPath": "data",
            "columnName": "data",
            "affinity": "INTEGER",
            "notNull": true
          },
          {
            "fieldPath": "dias",
            "columnName": "dias",
            "affinity": "INTEGER",
            "notNull": false
          },
          {
            "fieldPath": "remuneracaoDesejada",
            "columnName": "remuneracao_desejada",
            "affinity": "INTEGER",
            "notNull": false
          },
          {
            "fieldPath": "observacoes",
            "columnName": "observacoes",
            "affinity": "TEXT",
            "notNull": false
          },
          {
            "fieldPath": "safraId",
            "columnName": "safra_id",
            "affinity": "INTEGER",
            "notNull": true
          }
        ],
        "primaryKey": {
          "columnNames": [
            "id"
          ],
          "autoGenerate": true
        },
        "indices": [
          {
            "name": "index_trabalho_upf_safra_id",
            "unique": false,
            "columnNames": [
              "safra_id"
            ],
            "createSql": "CREATE  INDEX `index_trabalho_upf_safra_id` ON `${TABLE_NAME}` (`safra_id`)"
          }
        ],
        "foreignKeys": [
          {
            "table": "safra",
            "onDelete": "CASCADE",
            "onUpdate": "NO ACTION",
            "columns": [
              "safra_id"
            ],
            "referencedColumns": [
              "id"
            ]
          }
        ]
      },
      {
        "tableName": "trabalho_upf_integrante",
        "createSql": "CREATE TABLE IF NOT EXISTS `${TABLE_NAME}` (`trabalho_upf_id` INTEGER NOT NULL, `upf_integrante_id` INTEGER NOT NULL, PRIMARY KEY(`trabalho_upf_id`, `upf_integrante_id`), FOREIGN KEY(`trabalho_upf_id`) REFERENCES `trabalho_upf`(`id`) ON UPDATE NO ACTION ON DELETE NO ACTION , FOREIGN KEY(`upf_integrante_id`) REFERENCES `upf_integrante`(`id`) ON UPDATE NO ACTION ON DELETE NO ACTION )",
        "fields": [
          {
            "fieldPath": "trabalhoUpfId",
            "columnName": "trabalho_upf_id",
            "affinity": "INTEGER",
            "notNull": true
          },
          {
            "fieldPath": "upfIntegranteId",
            "columnName": "upf_integrante_id",
            "affinity": "INTEGER",
            "notNull": true
          }
        ],
        "primaryKey": {
          "columnNames": [
            "trabalho_upf_id",
            "upf_integrante_id"
          ],
          "autoGenerate": false
        },
        "indices": [
          {
            "name": "index_trabalho_upf_integrante_trabalho_upf_id",
            "unique": false,
            "columnNames": [
              "trabalho_upf_id"
            ],
            "createSql": "CREATE  INDEX `index_trabalho_upf_integrante_trabalho_upf_id` ON `${TABLE_NAME}` (`trabalho_upf_id`)"
          },
          {
            "name": "index_trabalho_upf_integrante_upf_integrante_id",
            "unique": false,
            "columnNames": [
              "upf_integrante_id"
            ],
            "createSql": "CREATE  INDEX `index_trabalho_upf_integrante_upf_integrante_id` ON `${TABLE_NAME}` (`upf_integrante_id`)"
          }
        ],
        "foreignKeys": [
          {
            "table": "trabalho_upf",
            "onDelete": "NO ACTION",
            "onUpdate": "NO ACTION",
            "columns": [
              "trabalho_upf_id"
            ],
            "referencedColumns": [
              "id"
            ]
          },
          {
            "table": "upf_integrante",
            "onDelete": "NO ACTION",
            "onUpdate": "NO ACTION",
            "columns": [
              "upf_integrante_id"
            ],
            "referencedColumns": [
              "id"
            ]
          }
        ]
      },
      {
        "tableName": "equipamento",
        "createSql": "CREATE TABLE IF NOT EXISTS `${TABLE_NAME}` (`id` INTEGER PRIMARY KEY AUTOINCREMENT NOT NULL, `tipo_str` TEXT, `marca_e_modelo` TEXT NOT NULL, `ano_fabricacao` INTEGER NOT NULL, `ano_compra` INTEGER, `quantidade` INTEGER NOT NULL, `valorCompra` INTEGER NOT NULL, `durabilidade_estimada_anos` INTEGER NOT NULL, `usado` INTEGER NOT NULL, `safra_id` INTEGER NOT NULL, `tipo_equipamento_id` INTEGER, FOREIGN KEY(`safra_id`) REFERENCES `safra`(`id`) ON UPDATE NO ACTION ON DELETE CASCADE , FOREIGN KEY(`tipo_equipamento_id`) REFERENCES `tipo_equipamento`(`id`) ON UPDATE NO ACTION ON DELETE NO ACTION )",
        "fields": [
          {
            "fieldPath": "id",
            "columnName": "id",
            "affinity": "INTEGER",
            "notNull": true
          },
          {
            "fieldPath": "tipo",
            "columnName": "tipo_str",
            "affinity": "TEXT",
            "notNull": false
          },
          {
            "fieldPath": "marcaEModelo",
            "columnName": "marca_e_modelo",
            "affinity": "TEXT",
            "notNull": true
          },
          {
            "fieldPath": "anoFabricacao",
            "columnName": "ano_fabricacao",
            "affinity": "INTEGER",
            "notNull": true
          },
          {
            "fieldPath": "anoCompra",
            "columnName": "ano_compra",
            "affinity": "INTEGER",
            "notNull": false
          },
          {
            "fieldPath": "quantidade",
            "columnName": "quantidade",
            "affinity": "INTEGER",
            "notNull": true
          },
          {
            "fieldPath": "valorCompra",
            "columnName": "valorCompra",
            "affinity": "INTEGER",
            "notNull": true
          },
          {
            "fieldPath": "durabilidadeEstimadaAnos",
            "columnName": "durabilidade_estimada_anos",
            "affinity": "INTEGER",
            "notNull": true
          },
          {
            "fieldPath": "usado",
            "columnName": "usado",
            "affinity": "INTEGER",
            "notNull": true
          },
          {
            "fieldPath": "safraId",
            "columnName": "safra_id",
            "affinity": "INTEGER",
            "notNull": true
          },
          {
            "fieldPath": "tipoEquipamentoId",
            "columnName": "tipo_equipamento_id",
            "affinity": "INTEGER",
            "notNull": false
          }
        ],
        "primaryKey": {
          "columnNames": [
            "id"
          ],
          "autoGenerate": true
        },
        "indices": [
          {
            "name": "index_equipamento_safra_id",
            "unique": false,
            "columnNames": [
              "safra_id"
            ],
            "createSql": "CREATE  INDEX `index_equipamento_safra_id` ON `${TABLE_NAME}` (`safra_id`)"
          },
          {
            "name": "index_equipamento_tipo_equipamento_id",
            "unique": false,
            "columnNames": [
              "tipo_equipamento_id"
            ],
            "createSql": "CREATE  INDEX `index_equipamento_tipo_equipamento_id` ON `${TABLE_NAME}` (`tipo_equipamento_id`)"
          }
        ],
        "foreignKeys": [
          {
            "table": "safra",
            "onDelete": "CASCADE",
            "onUpdate": "NO ACTION",
            "columns": [
              "safra_id"
            ],
            "referencedColumns": [
              "id"
            ]
          },
          {
            "table": "tipo_equipamento",
            "onDelete": "NO ACTION",
            "onUpdate": "NO ACTION",
            "columns": [
              "tipo_equipamento_id"
            ],
            "referencedColumns": [
              "id"
            ]
          }
        ]
      },
      {
        "tableName": "despesa",
        "createSql": "CREATE TABLE IF NOT EXISTS `${TABLE_NAME}` (`id` INTEGER PRIMARY KEY AUTOINCREMENT NOT NULL, `tipo` TEXT NOT NULL, `valor` INTEGER NOT NULL, `data` INTEGER NOT NULL, `observacoes` TEXT, `aviamento` INTEGER, `diaria_dias` INTEGER, `diaria_quantidade_diaristas` INTEGER, `diaria_valor_diaria` INTEGER, `safra_id` INTEGER NOT NULL, `categoria_despesa_id` INTEGER, FOREIGN KEY(`safra_id`) REFERENCES `safra`(`id`) ON UPDATE NO ACTION ON DELETE CASCADE , FOREIGN KEY(`categoria_despesa_id`) REFERENCES `categoria_despesa`(`id`) ON UPDATE NO ACTION ON DELETE NO ACTION )",
        "fields": [
          {
            "fieldPath": "id",
            "columnName": "id",
            "affinity": "INTEGER",
            "notNull": true
          },
          {
            "fieldPath": "tipo",
            "columnName": "tipo",
            "affinity": "TEXT",
            "notNull": true
          },
          {
            "fieldPath": "valor",
            "columnName": "valor",
            "affinity": "INTEGER",
            "notNull": true
          },
          {
            "fieldPath": "data",
            "columnName": "data",
            "affinity": "INTEGER",
            "notNull": true
          },
          {
            "fieldPath": "observacoes",
            "columnName": "observacoes",
            "affinity": "TEXT",
            "notNull": false
          },
          {
            "fieldPath": "aviamento",
            "columnName": "aviamento",
            "affinity": "INTEGER",
            "notNull": false
          },
          {
            "fieldPath": "diariaDias",
            "columnName": "diaria_dias",
            "affinity": "INTEGER",
            "notNull": false
          },
          {
            "fieldPath": "diariaQuantidadeDiaristas",
            "columnName": "diaria_quantidade_diaristas",
            "affinity": "INTEGER",
            "notNull": false
          },
          {
            "fieldPath": "diariaValorDiaria",
            "columnName": "diaria_valor_diaria",
            "affinity": "INTEGER",
            "notNull": false
          },
          {
            "fieldPath": "safraId",
            "columnName": "safra_id",
            "affinity": "INTEGER",
            "notNull": true
          },
          {
            "fieldPath": "categoriaDespesaId",
            "columnName": "categoria_despesa_id",
            "affinity": "INTEGER",
            "notNull": false
          }
        ],
        "primaryKey": {
          "columnNames": [
            "id"
          ],
          "autoGenerate": true
        },
        "indices": [
          {
            "name": "index_despesa_safra_id",
            "unique": false,
            "columnNames": [
              "safra_id"
            ],
            "createSql": "CREATE  INDEX `index_despesa_safra_id` ON `${TABLE_NAME}` (`safra_id`)"
          },
          {
            "name": "index_despesa_categoria_despesa_id",
            "unique": false,
            "columnNames": [
              "categoria_despesa_id"
            ],
            "createSql": "CREATE  INDEX `index_despesa_categoria_despesa_id` ON `${TABLE_NAME}` (`categoria_despesa_id`)"
          }
        ],
        "foreignKeys": [
          {
            "table": "safra",
            "onDelete": "CASCADE",
            "onUpdate": "NO ACTION",
            "columns": [
              "safra_id"
            ],
            "referencedColumns": [
              "id"
            ]
          },
          {
            "table": "categoria_despesa",
            "onDelete": "NO ACTION",
            "onUpdate": "NO ACTION",
            "columns": [
              "categoria_despesa_id"
            ],
            "referencedColumns": [
              "id"
            ]
          }
        ]
      },
      {
        "tableName": "upf_integrante",
        "createSql": "CREATE TABLE IF NOT EXISTS `${TABLE_NAME}` (`id` INTEGER PRIMARY KEY AUTOINCREMENT NOT NULL, `nome` TEXT NOT NULL, `data_nascimento` INTEGER NOT NULL, `safra_id` INTEGER NOT NULL, `main_integrante` INTEGER NOT NULL, `parentesco` TEXT, `genero` TEXT, FOREIGN KEY(`safra_id`) REFERENCES `safra`(`id`) ON UPDATE NO ACTION ON DELETE CASCADE )",
        "fields": [
          {
            "fieldPath": "id",
            "columnName": "id",
            "affinity": "INTEGER",
            "notNull": true
          },
          {
            "fieldPath": "nome",
            "columnName": "nome",
            "affinity": "TEXT",
            "notNull": true
          },
          {
            "fieldPath": "dataNascimento",
            "columnName": "data_nascimento",
            "affinity": "INTEGER",
            "notNull": true
          },
          {
            "fieldPath": "safraId",
            "columnName": "safra_id",
            "affinity": "INTEGER",
            "notNull": true
          },
          {
            "fieldPath": "mainIntegrante",
            "columnName": "main_integrante",
            "affinity": "INTEGER",
            "notNull": true
          },
          {
            "fieldPath": "parentesco",
            "columnName": "parentesco",
            "affinity": "TEXT",
            "notNull": false
          },
          {
            "fieldPath": "genero",
            "columnName": "genero",
            "affinity": "TEXT",
            "notNull": false
          }
        ],
        "primaryKey": {
          "columnNames": [
            "id"
          ],
          "autoGenerate": true
        },
        "indices": [
          {
            "name": "index_upf_integrante_safra_id",
            "unique": false,
            "columnNames": [
              "safra_id"
            ],
            "createSql": "CREATE  INDEX `index_upf_integrante_safra_id` ON `${TABLE_NAME}` (`safra_id`)"
          }
        ],
        "foreignKeys": [
          {
            "table": "safra",
            "onDelete": "CASCADE",
            "onUpdate": "NO ACTION",
            "columns": [
              "safra_id"
            ],
            "referencedColumns": [
              "id"
            ]
          }
        ]
      },
      {
        "tableName": "municipio",
        "createSql": "CREATE TABLE IF NOT EXISTS `${TABLE_NAME}` (`id` INTEGER PRIMARY KEY AUTOINCREMENT NOT NULL, `nome` TEXT NOT NULL, `uf_id` INTEGER NOT NULL, FOREIGN KEY(`uf_id`) REFERENCES `uf`(`id`) ON UPDATE NO ACTION ON DELETE NO ACTION )",
        "fields": [
          {
            "fieldPath": "id",
            "columnName": "id",
            "affinity": "INTEGER",
            "notNull": true
          },
          {
            "fieldPath": "nome",
            "columnName": "nome",
            "affinity": "TEXT",
            "notNull": true
          },
          {
            "fieldPath": "ufId",
            "columnName": "uf_id",
            "affinity": "INTEGER",
            "notNull": true
          }
        ],
        "primaryKey": {
          "columnNames": [
            "id"
          ],
          "autoGenerate": true
        },
        "indices": [
          {
            "name": "index_municipio_uf_id",
            "unique": false,
            "columnNames": [
              "uf_id"
            ],
            "createSql": "CREATE  INDEX `index_municipio_uf_id` ON `${TABLE_NAME}` (`uf_id`)"
          }
        ],
        "foreignKeys": [
          {
            "table": "uf",
            "onDelete": "NO ACTION",
            "onUpdate": "NO ACTION",
            "columns": [
              "uf_id"
            ],
            "referencedColumns": [
              "id"
            ]
          }
        ]
      },
      {
        "tableName": "producao",
        "createSql": "CREATE TABLE IF NOT EXISTS `${TABLE_NAME}` (`id` INTEGER PRIMARY KEY AUTOINCREMENT NOT NULL, `data` INTEGER NOT NULL, `quantidade` INTEGER NOT NULL, `safra_id` INTEGER NOT NULL, `observacoes` TEXT, FOREIGN KEY(`safra_id`) REFERENCES `safra`(`id`) ON UPDATE NO ACTION ON DELETE CASCADE )",
        "fields": [
          {
            "fieldPath": "id",
            "columnName": "id",
            "affinity": "INTEGER",
            "notNull": true
          },
          {
            "fieldPath": "data",
            "columnName": "data",
            "affinity": "INTEGER",
            "notNull": true
          },
          {
            "fieldPath": "quantidade",
            "columnName": "quantidade",
            "affinity": "INTEGER",
            "notNull": true
          },
          {
            "fieldPath": "safraId",
            "columnName": "safra_id",
            "affinity": "INTEGER",
            "notNull": true
          },
          {
            "fieldPath": "observacoes",
            "columnName": "observacoes",
            "affinity": "TEXT",
            "notNull": false
          }
        ],
        "primaryKey": {
          "columnNames": [
            "id"
          ],
          "autoGenerate": true
        },
        "indices": [
          {
            "name": "index_producao_safra_id",
            "unique": false,
            "columnNames": [
              "safra_id"
            ],
            "createSql": "CREATE  INDEX `index_producao_safra_id` ON `${TABLE_NAME}` (`safra_id`)"
          }
        ],
        "foreignKeys": [
          {
            "table": "safra",
            "onDelete": "CASCADE",
            "onUpdate": "NO ACTION",
            "columns": [
              "safra_id"
            ],
            "referencedColumns": [
              "id"
            ]
          }
        ]
      },
      {
        "tableName": "safra",
        "createSql": "CREATE TABLE IF NOT EXISTS `${TABLE_NAME}` (`id` INTEGER PRIMARY KEY AUTOINCREMENT NOT NULL, `nome` TEXT NOT NULL, `data_inicio` INTEGER NOT NULL, `data_final` INTEGER, `ativa` INTEGER, `remuneracao_desejada_por_dia` INTEGER, `castanhal_tamanho` INTEGER, `castanhal_numero_castanheiras` INTEGER, `castanhal_numero_familias` INTEGER, `upf_id` INTEGER NOT NULL, FOREIGN KEY(`upf_id`) REFERENCES `upf`(`id`) ON UPDATE NO ACTION ON DELETE NO ACTION )",
        "fields": [
          {
            "fieldPath": "id",
            "columnName": "id",
            "affinity": "INTEGER",
            "notNull": true
          },
          {
            "fieldPath": "nome",
            "columnName": "nome",
            "affinity": "TEXT",
            "notNull": true
          },
          {
            "fieldPath": "dataInicio",
            "columnName": "data_inicio",
            "affinity": "INTEGER",
            "notNull": true
          },
          {
            "fieldPath": "dataFinal",
            "columnName": "data_final",
            "affinity": "INTEGER",
            "notNull": false
          },
          {
            "fieldPath": "ativa",
            "columnName": "ativa",
            "affinity": "INTEGER",
            "notNull": false
          },
          {
            "fieldPath": "remuneracaoDesejadaPorDia",
            "columnName": "remuneracao_desejada_por_dia",
            "affinity": "INTEGER",
            "notNull": false
          },
          {
            "fieldPath": "castanhalTamanho",
            "columnName": "castanhal_tamanho",
            "affinity": "INTEGER",
            "notNull": false
          },
          {
            "fieldPath": "castanhalNumeroCastanheiras",
            "columnName": "castanhal_numero_castanheiras",
            "affinity": "INTEGER",
            "notNull": false
          },
          {
            "fieldPath": "castanhalNumeroFamilias",
            "columnName": "castanhal_numero_familias",
            "affinity": "INTEGER",
            "notNull": false
          },
          {
            "fieldPath": "upfId",
            "columnName": "upf_id",
            "affinity": "INTEGER",
            "notNull": true
          }
        ],
        "primaryKey": {
          "columnNames": [
            "id"
          ],
          "autoGenerate": true
        },
        "indices": [
          {
            "name": "index_safra_nome",
            "unique": true,
            "columnNames": [
              "nome"
            ],
            "createSql": "CREATE UNIQUE INDEX `index_safra_nome` ON `${TABLE_NAME}` (`nome`)"
          },
          {
            "name": "index_safra_upf_id",
            "unique": false,
            "columnNames": [
              "upf_id"
            ],
            "createSql": "CREATE  INDEX `index_safra_upf_id` ON `${TABLE_NAME}` (`upf_id`)"
          }
        ],
        "foreignKeys": [
          {
            "table": "upf",
            "onDelete": "NO ACTION",
            "onUpdate": "NO ACTION",
            "columns": [
              "upf_id"
            ],
            "referencedColumns": [
              "id"
            ]
          }
        ]
      },
      {
        "tableName": "tipo_equipamento",
        "createSql": "CREATE TABLE IF NOT EXISTS `${TABLE_NAME}` (`id` INTEGER PRIMARY KEY AUTOINCREMENT NOT NULL, `nome` TEXT NOT NULL)",
        "fields": [
          {
            "fieldPath": "id",
            "columnName": "id",
            "affinity": "INTEGER",
            "notNull": true
          },
          {
            "fieldPath": "nome",
            "columnName": "nome",
            "affinity": "TEXT",
            "notNull": true
          }
        ],
        "primaryKey": {
          "columnNames": [
            "id"
          ],
          "autoGenerate": true
        },
        "indices": [],
        "foreignKeys": []
      },
      {
        "tableName": "uf",
        "createSql": "CREATE TABLE IF NOT EXISTS `${TABLE_NAME}` (`id` INTEGER PRIMARY KEY AUTOINCREMENT NOT NULL, `nome` TEXT NOT NULL, `sigla` TEXT NOT NULL)",
        "fields": [
          {
            "fieldPath": "id",
            "columnName": "id",
            "affinity": "INTEGER",
            "notNull": true
          },
          {
            "fieldPath": "nome",
            "columnName": "nome",
            "affinity": "TEXT",
            "notNull": true
          },
          {
            "fieldPath": "sigla",
            "columnName": "sigla",
            "affinity": "TEXT",
            "notNull": true
          }
        ],
        "primaryKey": {
          "columnNames": [
            "id"
          ],
          "autoGenerate": true
        },
        "indices": [],
        "foreignKeys": []
      },
      {
        "tableName": "upf",
        "createSql": "CREATE TABLE IF NOT EXISTS `${TABLE_NAME}` (`id` INTEGER PRIMARY KEY AUTOINCREMENT NOT NULL, `nome_comunidade` TEXT, `nome_usuario` TEXT, `data_nascimento_usuario` INTEGER, `genero_usuario` TEXT, `unidade_area` TEXT, `unidade_valor` TEXT, `municipio_id` INTEGER, FOREIGN KEY(`municipio_id`) REFERENCES `municipio`(`id`) ON UPDATE NO ACTION ON DELETE NO ACTION )",
        "fields": [
          {
            "fieldPath": "id",
            "columnName": "id",
            "affinity": "INTEGER",
            "notNull": true
          },
          {
            "fieldPath": "nomeComunidade",
            "columnName": "nome_comunidade",
            "affinity": "TEXT",
            "notNull": false
          },
          {
            "fieldPath": "nomeUsuario",
            "columnName": "nome_usuario",
            "affinity": "TEXT",
            "notNull": false
          },
          {
            "fieldPath": "dataNascimentoUsuario",
            "columnName": "data_nascimento_usuario",
            "affinity": "INTEGER",
            "notNull": false
          },
          {
            "fieldPath": "generoUsuario",
            "columnName": "genero_usuario",
            "affinity": "TEXT",
            "notNull": false
          },
          {
            "fieldPath": "unidadeArea",
            "columnName": "unidade_area",
            "affinity": "TEXT",
            "notNull": false
          },
          {
            "fieldPath": "unidadeValor",
            "columnName": "unidade_valor",
            "affinity": "TEXT",
            "notNull": false
          },
          {
            "fieldPath": "municipioId",
            "columnName": "municipio_id",
            "affinity": "INTEGER",
            "notNull": false
          }
        ],
        "primaryKey": {
          "columnNames": [
            "id"
          ],
          "autoGenerate": true
        },
        "indices": [
          {
            "name": "index_upf_municipio_id",
            "unique": false,
            "columnNames": [
              "municipio_id"
            ],
            "createSql": "CREATE  INDEX `index_upf_municipio_id` ON `${TABLE_NAME}` (`municipio_id`)"
          }
        ],
        "foreignKeys": [
          {
            "table": "municipio",
            "onDelete": "NO ACTION",
            "onUpdate": "NO ACTION",
            "columns": [
              "municipio_id"
            ],
            "referencedColumns": [
              "id"
            ]
          }
        ]
      },
      {
        "tableName": "venda",
        "createSql": "CREATE TABLE IF NOT EXISTS `${TABLE_NAME}` (`id` INTEGER PRIMARY KEY AUTOINCREMENT NOT NULL, `quantidade` INTEGER NOT NULL, `valor_unitario` INTEGER NOT NULL, `data` INTEGER NOT NULL, `observacoes` TEXT, `safra_id` INTEGER NOT NULL, `comprador_id` INTEGER NOT NULL, `comprador` TEXT, `quitacao_aviamento` INTEGER, FOREIGN KEY(`safra_id`) REFERENCES `safra`(`id`) ON UPDATE NO ACTION ON DELETE CASCADE )",
        "fields": [
          {
            "fieldPath": "id",
            "columnName": "id",
            "affinity": "INTEGER",
            "notNull": true
          },
          {
            "fieldPath": "quantidade",
            "columnName": "quantidade",
            "affinity": "INTEGER",
            "notNull": true
          },
          {
            "fieldPath": "valorUnitario",
            "columnName": "valor_unitario",
            "affinity": "INTEGER",
            "notNull": true
          },
          {
            "fieldPath": "data",
            "columnName": "data",
            "affinity": "INTEGER",
            "notNull": true
          },
          {
            "fieldPath": "observacoes",
            "columnName": "observacoes",
            "affinity": "TEXT",
            "notNull": false
          },
          {
            "fieldPath": "safraId",
            "columnName": "safra_id",
            "affinity": "INTEGER",
            "notNull": true
          },
          {
            "fieldPath": "compradorId",
            "columnName": "comprador_id",
            "affinity": "INTEGER",
            "notNull": true
          },
          {
            "fieldPath": "comprador",
            "columnName": "comprador",
            "affinity": "TEXT",
            "notNull": false
          },
          {
            "fieldPath": "quitacaoAviamento",
            "columnName": "quitacao_aviamento",
            "affinity": "INTEGER",
            "notNull": false
          }
        ],
        "primaryKey": {
          "columnNames": [
            "id"
          ],
          "autoGenerate": true
        },
        "indices": [
          {
            "name": "index_venda_safra_id",
            "unique": false,
            "columnNames": [
              "safra_id"
            ],
            "createSql": "CREATE  INDEX `index_venda_safra_id` ON `${TABLE_NAME}` (`safra_id`)"
          },
          {
            "name": "index_venda_comprador_id",
            "unique": false,
            "columnNames": [
              "comprador_id"
            ],
            "createSql": "CREATE  INDEX `index_venda_comprador_id` ON `${TABLE_NAME}` (`comprador_id`)"
          }
        ],
        "foreignKeys": [
          {
            "table": "safra",
            "onDelete": "CASCADE",
            "onUpdate": "NO ACTION",
            "columns": [
              "safra_id"
            ],
            "referencedColumns": [
              "id"
            ]
          }
        ]
      }
    ],
    "views": [],
    "setupQueries": [
      "CREATE TABLE IF NOT EXISTS room_master_table (id INTEGER PRIMARY KEY,identity_hash TEXT)",
      "INSERT OR REPLACE INTO room_master_table (id,identity_hash) VALUES(42, '7ab5c55f56148a28029e01b6c776425d')"
    ]
  }
}