run;queries_part0;queries_part1;queries_part2;queries_part3;queries_part4;queries_part5;latencies_part0;latencies_part1;latencies_part2;latencies_part3;latencies_part4;latencies_part5
0;2437507;564013;2790994;1684870;2841703;3912129;3.62;4.33;48662.51;55199.54;3.19;3.02
1;2517088;565523;2722068;1770105;2833482;4055302;3.62;4.25;51363.54;57223.68;3.19;2.86
2;2556909;563689;2827097;1653265;2819138;4045470;3.55;4.49;46941.21;51363.54;3.19;2.91
3;2553193;563957;2776107;1716967;2861645;4062371;3.55;4.33;50446.94;55199.54;3.19;2.91
4;2503584;568464;2913437;1571667;2920670;4101234;3.55;4.49;43679.10;47794.11;3.13;2.86
5;2502039;567654;2719934;1770213;2710439;3949209;3.62;4.33;53247.01;58263.41;3.36;2.97
6;2519413;569067;2859611;1649123;2821650;3979472;3.62;4.33;46941.21;51363.54;3.19;2.97
7;2545972;566252;2738100;1734330;2779347;3968783;3.55;4.33;51363.54;56202.50;3.25;2.97
8;2554767;571496;2694915;1760214;2772907;3920469;3.55;4.49;53247.01;58263.41;3.25;2.97
9;2519130;565478;2651910;1817258;2764974;4025778;3.55;4.41;55199.54;60399.89;3.25;2.91
