run;total_request;ko_requests;min_response_time;max_response_time;mean_response_time;std_deviation;99th_response_time;mean_requests_per_second
0;29522;6;0;12472;34;287;407;136.046
1;29528;3;0;3332;23;138;359;141.282
2;29527;4;0;4097;26;162;417;139.938
3;29510;5;0;4760;29;188;473;137.897
4;29532;4;0;7716;34;245;446;135.468
5;29521;5;0;6168;36;241;617;134.799
6;29533;3;0;7504;26;170;414;138.005
7;29527;5;0;5042;28;179;476;136.069
8;29527;4;0;8894;35;251;537;133.606
9;29533;3;0;10571;30;205;586;135.472
