iteration;usage_avg;usage_std;active_anon_avg;active_anon_std;active_file_avg;active_file_std;inactive_anon_avg;inactive_anon_std;inactive_file_avg;inactive_file_std;unevictable_avg;unevictable_std;reads_avg;reads_std;read_bw_avg;read_bw_std
0;2617323929.6;7631871.4806789;341648588.8;786133.383308456;57935872;33326873.3868258;0;0;2206726144;30800551.6904523;0;0;118045.2;51657.2947139124;15268227072;6450877443.64925
1;2619463680;6192469.36342006;342578790.4;212536.226220379;151825203.2;38382698.0518643;0;0;2113993932.8;36776625.5207051;0;0;19.5;37.6835507881091;1171865.6;2824633.46617756
2;2619664793.6;6128741.80374928;342705766.4;47279.9774957645;235431116.8;36721137.6868983;0;0;2030415872;34964885.5880195;0;0;2.8;1.46969384566991;54067.2;25434.8078223524
3;2619653734.4;6128924.45831077;342709043.2;47760.1329981398;307389644.8;32193700.8733816;0;0;1958472499.2;30168063.7351414;0;0;1.7;1.41774468787578;27852.8;23228.3289661568
4;2619695513.6;6097342.37474131;342711500.8;47865.4009489109;368023142.4;27712256.4517386;0;0;1897854976;25373563.4569665;0;0;0.5;0.5;13107.2;16052.9759783038
5;2619693056;6103392.75440275;342711500.8;47865.4009489109;419500851.2;24679474.37271;0;0;1846389555.2;21987167.0780368;0;0;0.7;0.640312423743285;13107.2;12260.6629249808
6;2619721318.4;6114349.38092353;342711500.8;47865.4009489109;463178547.2;22388735.8538751;0;0;1802717593.6;19360729.5584058;0;0;0.3;0.458257569495584;8192;15105.3016388287
7;2619716403.2;6090676.74558419;342711910.4;46681.822929273;501025177.6;20628384.3461312;0;0;1764873420.8;17272965.5590046;0;0;1;0.894427190999916;16384;14654.2950973426
8;2619722956.8;6113503.81441216;342711910.4;46681.822929273;533549465.6;19703827.6859936;0;0;1732354867.2;15929755.153459;0;0;0;0;0;0
9;2619704115.2;6103367.0665717;342712729.6;47111.1227631013;562524160;18629224.731391;0;0;1703391641.6;14519965.9083412;0;0;0.6;0.66332495807108;9830.4;10867.9161130366
10;2619754905.6;6143563.6786738;342712729.6;47111.1227631013;587972608;17800088.3861913;0;0;1677962854.4;13499864.7747562;0;0;0.4;0.66332495807108;19660.8;39998.4414416362
11;2619722547.2;6135992.57708026;342715187.2;46811.0263933616;610304000;17220325.0443785;0;0;1655646617.6;12827294.3256305;0;0;0.5;0.806225774829855;9830.4;16708.4671421408
12;2619763507.2;6146987.18307302;342715187.2;46811.0263933616;630376448;16716052.7361561;0;0;1635579904;12083934.7931243;0;0;0.3;0.458257569495584;4915.2;7508.09201861565
13;2619750400;6169259.51276229;342715187.2;46811.0263933616;647958528;16226108.8662755;0;0;1618007654.4;11319185.4215243;0;0;0.2;0.4;3276.8;6553.6
14;2619789721.6;6168297.88192756;342715187.2;46811.0263933616;663945216;15976162.6531109;0;0;1602020966.4;10847495.2246218;0;0;0.1;0.3;1638.4;4915.2
15;2619753676.8;6157552.38404871;342715187.2;46811.0263933616;678731366.4;15905335.7600242;0;0;1587250380.8;10658319.6578643;0;0;0.3;0.458257569495584;4915.2;7508.09201861565
16;2619745484.8;6129965.83470022;342715187.2;46811.0263933616;692191641.6;15728333.6983481;0;0;1573802393.6;10364069.9492198;0;0;0.2;0.4;3276.8;6553.6
17;2619791360;6144229.16689278;342715187.2;46811.0263933616;704731545.6;16087848.953998;0;0;1561262489.6;10609866.0722963;0;0;0.1;0.3;1638.4;4915.2
18;2619768012.8;6145714.29175682;342715187.2;46811.0263933616;716024217.6;15939616.0974919;0;0;1549969817.6;10393052.6066445;0;0;0;0;0;0
19;2619776614.4;6151159.8549971;342715187.2;46811.0263933616;726618521.6;15961109.6152056;0;0;1539381657.6;10361854.3626592;0;0;0.4;0.916515138991168;6553.6;15016.1840372313
20;2619750809.6;6152190.14572209;342715187.2;46811.0263933616;736457113.6;15867557.3534449;0;0;1529549209.6;10228014.5532943;0;0;0.1;0.3;1638.4;4915.2
21;2619762688;6172320.07913524;342715187.2;46811.0263933616;745777971.2;15835632.8997228;0;0;1520229580.8;10123375.7921199;0;0;0.1;0.3;1638.4;4915.2
22;2619768012.8;6114387.6857445;342715187.2;46811.0263933616;754447155.2;15751215.8833421;0;0;1511560396.8;10015648.7270415;0;0;0;0;0;0
23;2619764736;6121779.15806835;342715187.2;46811.0263933616;762570342.4;15862114.4309336;0;0;1503438438.4;10093192.4903139;0;0;0;0;0;0
24;2619791360;6138563.08990174;342715187.2;46811.0263933616;770526822.4;15722997.7559965;0;0;1495481958.4;9930734.4637786;0;0;0.3;0.640312423743285;4915.2;10490.87875061
25;2619768832;6143470.50093349;342715187.2;46811.0263933616;777868902.4;15868673.4034232;0;0;1488139878.4;10065028.2491947;0;0;0;0;0;0
26;2619793817.6;6162458.46263843;342715187.2;46811.0263933616;784694886.4;15893160.0956366;0;0;1481313894.4;10054218.9232071;0;0;0.2;0.4;4915.2;10490.87875061
27;2619787673.6;6164946.51814466;342715187.2;46811.0263933616;791182950.4;15992175.304724;0;0;1474825830.4;10105842.1605691;0;0;0;0;0;0
28;2619799961.6;6158686.05032729;342715187.2;46811.0263933616;797565337.6;16058785.0855477;0;0;1468443443.2;10135432.6202052;0;0;0;0;0;0
29;2619763097.6;6145056.18571808;342715187.2;46811.0263933616;803629465.6;16034792.0802754;0;0;1462379315.2;10093901.1741958;0;0;0.1;0.3;1638.4;4915.2
30;2619793408;6162038.51826196;342715187.2;46811.0263933616;809236070.4;15984691.4242687;0;0;1456775987.2;10031361.6984687;0;0;0;0;0;0
31;2619791769.6;6162458.66685822;342715187.2;46811.0263933616;814599782.4;16133576.6903863;0;0;1451412275.2;10163489.4169623;0;0;0.1;0.3;1638.4;4915.2
32;2619787264;6111894.75008855;342715187.2;46811.0263933616;819890176;16038622.8675976;0;0;1446129254.4;10071496.0491685;0;0;0.1;0.3;1638.4;4915.2
33;2619804057.6;6135018.88141577;342715187.2;46811.0263933616;824983552;16001753.0902626;0;0;1441035878.4;10004285.7965542;0;0;0;0;0;0
34;2619802009.6;6127654.72848724;342715187.2;46811.0263933616;829837312;16077614.4833174;0;0;1436182118.4;10063844.1931596;0;0;0.1;0.3;1638.4;4915.2
35;2619769241.6;6120064.26126785;342715187.2;46811.0263933616;834591948.8;16069566.6421359;0;0;1431427481.6;10056853.0393319;0;0;0;0;0;0
36;2619831500.8;6121974.02374365;342715187.2;46811.0263933616;839077068.8;16153262.6042181;0;0;1426942361.6;10139806.8335494;0;0;0.3;0.458257569495584;4915.2;7508.09201861565
37;2619785625.6;6128061.84825186;342715187.2;46811.0263933616;843525324.8;15976287.5983447;0;0;1422494105.6;9950856.18764536;0;0;0.1;0.3;1638.4;4915.2
38;2619806105.6;6147257.21793256;342715187.2;46811.0263933616;847746252.8;16057058.3131471;0;0;1418273177.6;10012157.6116336;0;0;0;0;0;0
39;2619812659.2;6143192.2294833;342715187.2;46811.0263933616;851961036.8;15997388.1759162;0;0;1414060032;9959685.43978775;0;0;0;0;0;0
40;2619790540.8;6160121.74416837;342715187.2;46811.0263933616;855850188.8;16096483.3760342;0;0;1410170880;10058302.766386;0;0;0;0;0;0
41;2619822080;6144714.30089439;342715187.2;46811.0263933616;859708620.8;16133655.8625542;0;0;1406312448;10102730.1531861;0;0;0;0;0;0
42;2619826995.2;6115540.01173012;342715187.2;46811.0263933616;863431884.8;16213673.7628361;0;0;1402589184;10188371.1665282;0;0;0;0;0;0
43;2619788083.2;6150278.70423577;342715187.2;46811.0263933616;866893004.8;16178783.5299523;0;0;1399129702.4;10140727.9015676;0;0;0.1;0.3;1638.4;4915.2
44;2619812249.6;6158782.757074;342715187.2;46811.0263933616;870585548.8;16182430.648917;0;0;1395437158.4;10135622.216884;0;0;0;0;0;0
45;2619817984;6149924.87438473;342715187.2;46811.0263933616;873872588.8;16106394.59445;0;0;1392150118.4;10056899.4161978;0;0;0;0;0;0
46;2619808563.2;6160944.19244843;342715187.2;46811.0263933616;877270220.8;16196518.0609977;0;0;1388752486.4;10144835.0832924;0;0;0;0;0;0
47;2619813478.4;6160598.17837456;342715187.2;46811.0263933616;880680140.8;16107465.7910563;0;0;1385342566.4;10049039.48441;0;0;0;0;0;0
48;2619807334.4;6152671.72047786;342715187.2;46811.0263933616;883832012.8;16120531.8272449;0;0;1382190694.4;10062140.8368088;0;0;0.1;0.3;1638.4;4915.2
49;2619796275.2;6132881.60162774;342715187.2;46811.0263933616;886774988.8;16140093.1568702;0;0;1379247718.4;10077972.1005845;0;0;0;0;0;0
50;2619806515.2;6113457.1615033;342715187.2;46811.0263933616;889742540.8;16228550.1875045;0;0;1376280166.4;10161184.3019113;0;0;0;0;0;0
51;2619777843.2;6140540.85539702;342715187.2;46811.0263933616;892499558.4;16268390.1882688;0;0;1373528064;10187882.7428698;0;0;0;0;0;0
52;2619784396.8;6136505.42865433;342715187.2;46811.0263933616;895319654.4;16188968.1836688;0;0;1370707968;10108296.029514;0;0;0;0;0;0
53;2619837235.2;6138683.83648221;342715187.2;46811.0263933616;898121318.4;16189926.6627755;0;0;1367906304;10103352.9236095;0;0;0.1;0.3;1638.4;4915.2
54;2619843788.8;6147014.20320988;342715187.2;46811.0263933616;900864409.6;16192623.8359787;0;0;1365169356.8;10105843.5883119;0;0;0.1;0.3;1638.4;4915.2
55;2619794636.8;6137310.33435331;342715187.2;46811.0263933616;903598489.6;16022618.902563;0;0;1362435276.8;9937570.78717973;0;0;0;0;0;0
56;2619803648;6159510.61046119;342715187.2;46811.0263933616;906252697.6;16029179.3943361;0;0;1359781068.8;9949411.78153724;0;0;0.1;0.3;1638.4;4915.2
57;2619787264;6127885.20481512;342715187.2;46811.0263933616;908771737.6;16011375.1176273;0;0;1357262028.8;9919598.8645348;0;0;0;0;0;0
58;2619815936;6145235.29765037;342715187.2;46811.0263933616;911204761.6;15940940.1745839;0;0;1354829004.8;9848889.33021628;0;0;0;0;0;0
59;2619790950.4;6160748.97979653;342715187.2;46811.0263933616;913637785.6;15953306.6345547;0;0;1352395980.8;9864149.39224422;0;0;0;0;0;0
60;2618847232;6532373.17565248;341293465.6;1076555.03916521;915322060.8;15765657.6710855;0;0;1351222886.4;9672462.72064359;0;0;5;0;475136;0
61;2620209561.6;6195949.81379804;342571827.2;239586.591010432;915702988.8;15884811.3509669;0;0;1350841958.4;9791326.24049347;0;0;0;0;0;0
62;2620343910.4;6161129.94968423;342700851.2;50425.7361274974;916128563.2;15945342.468412;0;0;1350416384;9849913.98639237;0;0;0;0;0;0
63;2620350873.6;6123529.43862149;342700851.2;50425.7361274974;916552499.2;15991302.8164987;0;0;1349992448;9897187.43874723;0;0;0;0;0;0
64;2620359065.6;6179242.33862243;342700851.2;50425.7361274974;916958003.2;15973172.418389;0;0;1349586944;9875805.45345523;0;0;0;0;0;0
65;2620375859.2;6170681.78972275;342700851.2;50425.7361274974;917351219.2;16007202.068661;0;0;1349193728;9910306.83159306;0;0;0;0;0;0
66;2620358656;6130038.34899326;342700851.2;50425.7361274974;917812019.2;16013588.8587062;0;0;1348732928;9914558.71049277;0;0;0;0;0;0
67;2620338176;6123299.4421818;342713139.2;46586.4857657239;918217523.2;15999754.6824514;0;0;1348327424;9899721.57526867;0;0;0;0;0;0
68;2620355379.2;6113402.00070893;342724608;55409.6609626877;918659891.2;15994345.5496057;0;0;1347885875.2;9893943.9245211;0;0;0.2;0.4;3276.8;6553.6
69;2620360704;6163905.24048123;342745497.6;59284.5593388363;919138713.6;15998026.9970239;0;0;1347407052.8;9897205.88196891;0;0;0.2;0.4;3276.8;6553.6
70;2620398796.8;6131671.997448;342745497.6;59284.5593388363;919544217.6;16025347.192363;0;0;1347006873.6;9927361.97083435;0;0;0.5;1.20415945787923;8192;19728.9485578933
71;2620411084.8;6163147.58091935;342746726.4;60232.0944347779;919980441.6;16044564.3770533;0;0;1346575564.8;9950601.19264037;0;0;0.2;0.6;4915.2;14745.6
72;2620402892.8;6156530.75743929;342752460.8;49281.5358526903;920471961.6;16047406.2388781;0;0;1346088960;9956130.44155931;0;0;0.1;0.3;1638.4;4915.2
73;2620423372.8;6151259.23022075;342765158.4;41829.3661438947;920905728;16042748.0664699;0;0;1345658880;9955420.30914054;0;0;0.5;0.806225774829855;9830.4;16708.4671421408
74;2620430336;6150423.60736364;342781132.8;38458.8006053231;921323520;16004060.2985317;0;0;1345249280;9919269.42375576;0;0;0.6;0.66332495807108;11468.8;12796.3130690055
75;2620422963.2;6157970.05987915;342785638.4;39941.7762249002;921765888;15954431.8340474;0;0;1344808550.4;9867979.49032648;0;0;0.7;1.00498756211209;11468.8;16465.7162176445
76;2620446720;6149215.33956065;342791372.8;40591.7524627849;922122240;15962354.5051103;0;0;1344458752;9879146.46729362;0;0;0.6;1.01980390271856;9830.4;16708.4671421408
77;2620495462.4;6100647.68699455;342801612.8;45122.9756111008;922509312;15916478.4809264;0;0;1344085606.4;9839683.20288738;0;0;0.7;1.00498756211209;16384;23170.4750059208
78;2620490547.2;6101082.62294226;342801612.8;45122.9756111008;922945536;15899620.7693703;0;0;1343649382.4;9826407.15922559;0;0;0.2;0.4;3276.8;6553.6
79;2620518400;6130877.42082518;342801612.8;45122.9756111008;923375616;15940623.9911512;0;0;1343219302.4;9866574.37203247;0;0;0.4;0.489897948556636;6553.6;8026.48798915192
80;2620536832;6140295.62143322;342810624;48117.1051498321;923842560;15947573.5920361;0;0;1342780211.2;9881690.41718997;0;0;1.1;0.94339811320566;24576;23458.318030072
81;2620545433.6;6090916.49887141;342816768;50207.3371530497;924315648;15933804.4240057;0;0;1342325555.2;9873462.63866856;0;0;0.7;1.00498756211209;16384;23170.4750059208
82;2620584755.2;6101104.89682385;342816768;50207.3371530497;924794880;15940354.421981;0;0;1341852057.6;9881611.02737727;0;0;0.4;0.8;6553.6;13107.2
83;2620570828.8;6093244.01760245;342817587.2;50831.6735903905;925274112;15921108.900789;0;0;1341384294.4;9863248.83101222;0;0;0.5;0.670820393249937;11468.8;16465.7162176445
84;2620563046.4;6095305.87863415;342825779.2;54341.124316672;925734912;15911151.9903625;0;0;1340933324.8;9856654.27227069;0;0;0.6;0.66332495807108;11468.8;12796.3130690055
85;2620597043.2;6073201.72957625;342839705.6;57122.6813096164;926238720;15885107.8389752;0;0;1340446310.4;9836201.84202175;0;0;1.2;1.4;22937.6;27610.8075767443
86;2620647014.4;6092275.40027271;342845440;59533.0738329544;926705664;15875824.648247;0;0;1340010496;9840539.19781879;0;0;1.1;1.3;24576;31301.5880491709
87;2620683059.2;6048229.60563106;342852403.2;44259.5497491784;927226265.6;15842713.0797727;0;0;1339511603.2;9812355.20156746;0;0;0.6;0.916515138991168;16384;25381.9836577049
88;2620694528;6057287.446094;342856499.2;46152.3059445571;927723929.6;15792565.0776793;0;0;1339034419.2;9764352.16698128;0;0;0.9;0.830662386291807;18022.4;18608.6468675183
89;2620707635.2;6038989.32594255;342869606.4;44727.1198267897;928270745.6;15815253.0648025;0;0;1338522009.6;9799751.72469833;0;0;1.4;1.28062484748657;37683.2;39491.8978951379
90;2620757606.4;6025217.16944244;342870835.2;45057.861822328;928781107.2;15829087.6613667;0;0;1338044825.6;9823535.00241537;0;0;1.2;1.53622914957372;31129.6;44236.8
91;2620807577.6;6053101.50582922;342874112;45840.4439769076;929346355.2;15802331.1380791;0;0;1337493094.4;9800714.16614769;0;0;1.1;1.13578166916005;19660.8;19106.8631690291
92;2620822323.2;6004490.90563921;342877798.4;46275.7374009318;929839104;15781339.0488488;0;0;1337020825.6;9787230.21566694;0;0;0.5;0.5;13107.2;19106.8631690291
93;2620847718.4;6009545.11395596;342882713.6;48332.7997947564;930385920;15706530.5939785;0;0;1336493260.8;9721346.17398722;0;0;1.6;1.49666295470958;32768;31086.4543105192
94;2620880486.4;6046558.48497242;342890086.4;50803.611210228;930926592;15654663.3658958;0;0;1335984947.2;9681391.90051017;0;0;1.5;1.11803398874989;31129.6;25853.5159202767
95;2620937011.2;5983546.88183923;342894182.4;51361.9457575353;931522560;15660431.4372651;0;0;1335409459.2;9694441.15594499;0;0;0.9;1.3;19660.8;34210.7963683981
96;2620959948.8;5975895.21643076;342896230.4;52083.6640800165;932032512;15620471.7888453;0;0;1334913024;9662128.23155479;0;0;0.9;0.94339811320566;14745.6;15456.6346867615
97;2620989849.6;6023674.98580327;342901555.2;39021.7904253508;932634624;15581352.5122328;0;0;1334316236.8;9624540.35005101;0;0;1;1.4142135623731;16384;23170.4750059208
98;2620981657.6;6030859.61353836;342905651.2;40828.7177364169;933249024;15520727.1602023;0;0;1333734604.8;9577722.58058543;0;0;1;1.26491106406735;16384;20724.3028736795
99;2621008691.2;5998429.44436625;342910566.4;37772.1387268447;933777817.6;15487128.9032182;0;0;1333227110.4;9553727.0426388;0;0;1.1;1.4456832294801;19660.8;28188.0994350453
100;2621044736;5996949.179788;342916300.8;40249.3225781503;934361497.6;15454389.31723;0;0;1332662272;9524012.29464473;0;0;0.5;0.670820393249937;11468.8;16465.7162176445
101;2621011558.4;5984997.83184322;342917120;40919.019538596;934902169.6;15419576.0931284;0;0;1332126924.8;9492111.98031207;0;0;0.7;0.458257569495584;14745.6;11468.8
102;2621051289.6;5960083.80135447;342926131.2;42558.9973566107;935516569.6;15381483.8635695;0;0;1331546521.6;9466328.54360591;0;0;0.9;1.04403065089105;19660.8;29124.8354666597
103;2621080371.2;5976461.17811402;342926131.2;42558.9973566107;936205516.8;15295569.3315899;0;0;1330863308.8;9381223.38012351;0;0;0.8;0.748331477354788;13107.2;12260.6629249808
104;2621075046.4;5971789.45043443;342932275.2;36775.1463899194;936813772.8;15216167.5524192;0;0;1330262835.2;9306280.34551463;0;0;0.5;0.5;9830.4;10867.9161130366
105;2621108633.6;5971799.00249565;342933094.4;37515.8722676149;937551462.4;15133059.3605645;0;0;1329526784;9223357.89337658;0;0;0.3;0.640312423743285;6553.6;15016.1840372313
106;2621147545.6;5960485.68935385;342947430.4;42927.9562057175;938245734.4;15063648.3676262;0;0;1328861184;9161462.68550956;0;0;1.3;0.781024967590665;24576;15105.3016388287
107;2621155328;5995854.08924;342953984;43579.592104562;938915430.4;14968330.6477087;0;0;1328215654.4;9078097.26339083;0;0;1.1;1.37477270848675;22937.6;32105.9519566077
108;2621182361.6;5940515.50370774;342955622.4;44463.7734790919;939585126.4;14808224.6143916;0;0;1327561523.2;8927017.34031608;0;0;0.9;1.22065556157337;18022.4;28800.443729915
109;2621225369.6;5919945.32843944;342955622.4;44463.7734790919;940303974.4;14673377.0141339;0;0;1326854963.2;8798356.31664733;0;0;0.9;1.04403065089105;19660.8;29124.8354666597
110;2621268377.6;5944622.45070349;342957260.8;45271.4555542452;940924518.4;14614106.9657769;0;0;1326257356.8;8747282.62237182;0;0;1;1.18321595661992;19660.8;22937.6
111;2621261414.4;5883683.28519202;342967500.8;48948.4852472474;941637222.4;14499354.772085;0;0;1325565132.8;8638016.91460997;0;0;0.8;1.24899959967968;13107.2;20463.6094411519
112;2621275750.4;5906084.4404502;342971596.8;50167.2219681337;942270054.4;14454838.2263435;0;0;1324940492.8;8598197.65762663;0;0;0.8;0.979795897113271;14745.6;18608.6468675183
113;2621300736;5896696.68697992;342978150.4;51042.4714135199;943004057.6;14353679.6288238;0;0;1324229836.8;8505490.51974688;0;0;0.8;0.979795897113271;16384;20724.3028736795
114;2621321216;5872907.30525044;342984704;42773.3025145359;943704473.6;14310198.6878729;0;0;1323538432;8469384.93487219;0;0;0.9;0.830662386291807;14745.6;13609.572537005
115;2621358899.2;5911589.74238774;342985523.2;43349.9246596808;944300441.6;14214721.888377;0;0;1322947788.8;8376410.94272147;0;0;0.4;0.489897948556636;6553.6;8026.48798915192
116;2621369139.2;5899591.25511319;342992076.8;44041.0483072327;944978329.6;14091910.1164593;0;0;1322279321.6;8257832.51786569;0;0;0.6;0.8;11468.8;16465.7162176445
117;2621377740.8;5920742.9364741;342995763.2;44524.104213336;945691033.6;13977594.8327326;0;0;1321591603.2;8158073.81079235;0;0;1;1.54919333848297;19660.8;31769.7547135637
118;2621412966.4;5881434.4619142;342996582.4;44876.9096975271;946502041.6;13879437.3013041;0;0;1320784691.2;8066932.7722182;0;0;0.9;1.04403065089105;18022.4;22524.2760558469
119;2621412147.2;5874574.4754588;343004364.8;47839.1056772595;947191808;13787230.7942095;0;0;1320121548.8;7980697.53677609;0;0;0.5;0.806225774829855;8192;13209.2030948123
120;2619633664;6341732.7126671;341297971.2;1149711.59475061;953596723.2;13755798.7262042;0;0;1313754316.8;8008587.73109566;0;0;0.7;0.9;11468.8;14745.6
121;2620973465.6;5927700.42052194;342504243.2;241252.661481692;956791603.2;13370650.922784;0;0;1310597120;7707783.97435527;0;0;2.8;2.03960780543711;50790.4;39081.9362959411
122;2621200384;5867802.20979269;342696755.2;54395.1268405544;960614809.6;12798090.066376;0;0;1306805043.2;7202010.62568058;0;0;2.5;1.91049731745428;55705.6;44689.5937846833
123;2621239296;5832755.7750511;342705356.8;56816.4072077776;964252057.6;12283681.572485;0;0;1303202201.6;6726930.07226328;0;0;2.1;1.7;39321.6;35292.2160800367
124;2621227417.6;5797218.42230427;342706995.2;57462.3693211479;967987609.6;11723739.3849437;0;0;1299471155.2;6164377.40863552;0;0;0.7;0.9;13107.2;17646.1080400183
125;2621296230.4;5810837.55944631;342710272;57204.8597935525;971466342.4;11228793.883401;0;0;1296013721.6;5686272.26186295;0;0;0.8;0.871779788708135;13107.2;14283.2400581941
126;2621236428.8;5815806.54934395;342711091.2;57345.4630114711;974743961.6;10799079.7564326;0;0;1292750848;5290339.11746005;0;0;0.3;0.458257569495584;6553.6;10867.9161130366
127;2621281075.2;5803176.54652002;342711091.2;57345.4630114711;978040012.8;10376162.7725583;0;0;1289460940.8;4897887.05147679;0;0;0.8;1.0770329614269;14745.6;21299.2
128;2621310976;5817435.69246519;342711091.2;57345.4630114711;981081292.8;10019618.2212298;0;0;1286419660.8;4541638.09525682;0;0;0.1;0.3;1638.4;4915.2
129;2621316300.8;5837143.99635438;342711091.2;57345.4630114711;984036556.8;9690581.14578151;0;0;1283470540.8;4275348.62582971;0;0;0.2;0.4;3276.8;6553.6
130;2621314252.8;5810196.44383079;342711091.2;57345.4630114711;986782924.8;9402831.66362474;0;0;1280724172.8;4035980.58372337;0;0;0.3;0.640312423743285;6553.6;15016.1840372313
131;2621334732.8;5832346.17863103;342711091.2;57345.4630114711;989301964.8;9085662.00014771;0;0;1278205132.8;3738865.86488256;0;0;0.1;0.3;1638.4;4915.2
132;2621300736;5822560.16804155;342711091.2;57345.4630114711;991612108.8;8905645.57804363;0;0;1275901132.8;3577819.33045032;0;0;0.2;0.4;3276.8;6553.6
133;2621303603.2;5839460.2272854;342714777.6;46384.3742654787;993821081.6;8770758.10499412;0;0;1273692160;3453667.43587625;0;0;0;0;0;0
134;2621326131.2;5815231.22749629;342714777.6;46384.3742654787;995946905.6;8619266.71761815;0;0;1271566336;3294906.51865208;0;0;0.2;0.4;3276.8;6553.6
135;2621339238.4;5816957.78721489;342714777.6;46384.3742654787;997900697.6;8496998.22831004;0;0;1269612544;3183631.38135557;0;0;0;0;0;0
136;2621316710.4;5807078.32678155;342714777.6;46384.3742654787;999867596.8;8377460.00247426;0;0;1267651788.8;3047684.97118452;0;0;0.1;0.3;1638.4;4915.2
137;2621299507.2;5830553.21792092;342714777.6;46384.3742654787;1001735372.8;8181607.80578879;0;0;1265784012.8;2829717.70914909;0;0;0;0;0;0
138;2621301145.6;5796153.03889606;342714777.6;46384.3742654787;1003621580.8;8091627.79471028;0;0;1263897804.8;2766125.45131561;0;0;0;0;0;0
139;2621336371.2;5818519.03535049;342714777.6;46384.3742654787;1005305036.8;8108227.4448296;0;0;1262214348.8;2791845.61874614;0;0;0;0;0;0
140;2621320396.8;5810785.11259055;342714777.6;46384.3742654787;1006994636.8;8114710.89186152;0;0;1260524748.8;2837220.90955216;0;0;0;0;0;0
141;2621317939.2;5793884.24263792;342714777.6;46384.3742654787;1008622796.8;8062819.8469528;0;0;1258896588.8;2793855.02780942;0;0;0;0;0;0
142;2621312204.8;5811790.94510737;342714777.6;46384.3742654787;1010207948.8;8129229.93961913;0;0;1257311436.8;2846294.92721187;0;0;0;0;0;0
143;2621315891.2;5808167.29896789;342714777.6;46384.3742654787;1011777536;8176996.3339779;0;0;1255745536;2843457.39021776;0;0;0;0;0;0
144;2621288038.4;5779466.0004343;342714777.6;46384.3742654787;1013276672;8067352.91270389;0;0;1254246400;2756408.51818158;0;0;0;0;0;0
145;2621337190.4;5832913.52792547;342714777.6;46384.3742654787;1014689792;8169517.33414502;0;0;1252833280;2839613.70519865;0;0;0;0;0;0
146;2621322035.2;5817828.34403354;342716006.4;42741.9121706084;1016139776;8188716.80768214;0;0;1251384115.2;2830657.88224858;0;0;0.2;0.4;3276.8;6553.6
147;2621296640;5801102.77979627;342716006.4;42741.9121706084;1017600000;8189880.71146925;0;0;1249925529.6;2824520.46295154;0;0;0;0;0;0
148;2621318348.8;5796582.45721529;342716006.4;42741.9121706084;1019037696;8180860.16338527;0;0;1248487833.6;2770113.74696708;0;0;0;0;0;0
149;2621303603.2;5795535.48413811;342716006.4;42741.9121706084;1020420096;8180940.91279383;0;0;1247105433.6;2793983.32265889;0;0;0;0;0;0
150;2621345382.4;5810092.6066451;342716006.4;42741.9121706084;1021784064;8231501.20568539;0;0;1245741465.6;2821644.26163186;0;0;0;0;0;0
151;2621301145.6;5808037.13918704;342716006.4;42741.9121706084;1023191040;8269929.13811479;0;0;1244334489.6;2845867.78664646;0;0;0;0;0;0
152;2621313843.2;5821063.02253463;342716006.4;42741.9121706084;1024524288;8228165.06101038;0;0;1243001241.6;2791413.30174949;0;0;0;0;0;0
153;2621317529.6;5818827.66813247;342716006.4;42741.9121706084;1025820672;8235758.10122857;0;0;1241704857.6;2776514.74254757;0;0;0;0;0;0
154;2621294592;5820203.3413825;342716006.4;42741.9121706084;1027141632;8301938.67543142;0;0;1240383897.6;2823946.16995721;0;0;0;0;0;0
155;2621324083.2;5781084.02512885;342716006.4;42741.9121706084;1028395008;8297323.72529649;0;0;1239130521.6;2822737.5009547;0;0;0;0;0;0
156;2621316710.4;5844842.29459649;342716006.4;42741.9121706084;1029563596.8;8331904.56440783;0;0;1237964390.4;2881186.61065888;0;0;0;0;0;0
157;2621306060.8;5839557.91098196;342716006.4;42741.9121706084;1030767820.8;8356292.56563172;0;0;1236760166.4;2892618.40009636;0;0;0;0;0;0
158;2621297049.6;5800500.74907607;342716006.4;42741.9121706084;1031965900.8;8335997.58293247;0;0;1235562086.4;2855472.25075783;0;0;0;0;0;0
159;2621308928;5841897.79680268;342716006.4;42741.9121706084;1033176268.8;8388173.99877518;0;0;1234351718.4;2873027.484037;0;0;0;0;0;0
160;2621297868.8;5811587.7860922;342716006.4;42741.9121706084;1034454220.8;8391067.44946315;0;0;1233073766.4;2911920.23534712;0;0;0;0;0;0
161;2621290496;5802903.4668545;342716006.4;42741.9121706084;1035566284.8;8476276.05728459;0;0;1231961702.4;2957677.58223374;0;0;0;0;0;0
162;2621328179.2;5835740.70712262;342716006.4;42741.9121706084;1036628787.2;8487013.56911652;0;0;1230899200;2960577.4946277;0;0;0;0;0;0
163;2621334732.8;5841793.56103312;342716006.4;42741.9121706084;1037753139.2;8571094.3008155;0;0;1229774848;3013872.8722121;0;0;0;0;0;0
164;2621318348.8;5820869.41029534;342716006.4;42741.9121706084;1038828339.2;8512870.59322295;0;0;1228699648;2946031.73414001;0;0;0;0;0;0
165;2621324492.8;5827068.64475784;342716006.4;42741.9121706084;1039921971.2;8499682.78131084;0;0;1227606016;2941132.93549544;0;0;0;0;0;0
166;2621310976;5794233.291342;342716006.4;42741.9121706084;1040935731.2;8610542.58558518;0;0;1226592256;3040905.8205002;0;0;0;0;0;0
167;2621332275.2;5848007.12124327;342716006.4;42741.9121706084;1041974067.2;8531641.33626631;0;0;1225553920;2927986.42890844;0;0;0.1;0.3;1638.4;4915.2
168;2621317939.2;5822822.60160208;342716006.4;42741.9121706084;1042957107.2;8515816.24140681;0;0;1224570880;2923358.70211782;0;0;0;0;0;0
169;2621323264;5801875.85188653;342716006.4;42741.9121706084;1044044595.2;8464246.79824685;0;0;1223483392;2885426.61130308;0;0;0;0;0;0
170;2621337190.4;5811212.88703417;342716006.4;42741.9121706084;1045144371.2;8580416.28029596;0;0;1222383616;3018718.2370059;0;0;0;0;0;0
171;2621323673.6;5815285.29299948;342716006.4;42741.9121706084;1046158131.2;8603224.01796164;0;0;1221369856;3063908.20800363;0;0;0;0;0;0
172;2621294592;5814840.13171815;342716006.4;42741.9121706084;1047257907.2;8629205.41889043;0;0;1220270080;3092683.03017299;0;0;0;0;0;0
173;2621341696;5796921.93770729;342716006.4;42741.9121706084;1048345395.2;8604390.4934911;0;0;1219182592;3047585.30327471;0;0;0;0;0;0
174;2621347840;5777308.39421404;342716006.4;42741.9121706084;1049310003.2;8580159.35112816;0;0;1218217984;3042260.67530578;0;0;0;0;0;0
175;2621292134.4;5854437.15871236;342716006.4;42741.9121706084;1050329907.2;8580774.67776238;0;0;1217198080;3033645.51366701;0;0;0;0;0;0
176;2621320396.8;5800184.70503138;342716006.4;42741.9121706084;1051355955.2;8597107.67017652;0;0;1216172032;3065156.42628039;0;0;0;0;0;0
177;2621356441.6;5816690.41663797;342716006.4;42741.9121706084;1052303769.6;8612829.06144828;0;0;1215224217.6;3126510.47260296;0;0;0;0;0;0
178;2621313433.6;5806869.73024193;342716006.4;42741.9121706084;1053280665.6;8630709.62132037;0;0;1214247321.6;3133715.43724059;0;0;0;0;0;0
179;2621343334.4;5793950.66891253;342716006.4;42741.9121706084;1054245273.6;8661996.94841415;0;0;1213282713.6;3169913.00374758;0;0;0;0;0;0
