iteration;usage_avg;usage_std;reads_avg;reads_std
0;71151206.4;73133489.2709114;287000.3;191732.81229933
1;76393676.8;69747040.0559402;705;520.123639147463
2;76352307.2;69760855.6961995;1963.5;591.924530662483
3;76317491.2;69772463.9536875;2042.1;543.836271317021
4;76312985.6;69773956.8251703;2171.7;550.929587152478
5;76304384;69776821.6086892;2086.9;506.831421677859
6;76304384;69776821.6086892;2088.6;491.345133282095
7;76292096;69780947.81669;2090.7;528.757042506292
8;76279398.4;69785157.9840041;2119.4;520.529768601181
9;76279398.4;69785157.9840041;2115.2;495.967700561237
10;76266700.8;69789372.2942095;2087;484.793564313719
11;76266700.8;69789372.2942095;2157.6;509.010648218679
12;76260147.2;69791551.2264302;2108.7;463.907544668117
13;76260147.2;69791551.2264302;2168.9;443.608487294822
14;76260147.2;69791551.2264302;2138;443.976350721522
15;76260147.2;69791551.2264302;2082.6;356.85885164866
16;76260147.2;69791551.2264302;2129.3;311.978540928697
17;76260147.2;69791551.2264302;2155.2;269.844325491571
18;76260147.2;69791551.2264302;2209.4;251.563590370306
19;76260147.2;69791551.2264302;2192.4;207.082688798459
20;76273254.4;69830872.7812173;2276.4;227.869348531127
21;76273254.4;69830872.7812173;2247.8;128.778724950976
22;76273254.4;69830872.7812173;2268.5;76.2341786864683
23;76260556.8;69792780.0250165;2242.6;192.492701160331
24;76260556.8;69792780.0250165;2236.6;95.6213365311341
25;76260556.8;69792780.0250165;2273.7;108.750218390587
26;76260556.8;69792780.0250165;2285.4;172.681324989125
27;76251545.6;69795774.4122884;2267.4;118.10944077422
28;76251545.6;69795774.4122884;2217.7;264.419760986203
29;76251545.6;69795774.4122884;2242.4;127.346142462185
