run;queries_part0;queries_part1;queries_part2;queries_part3;queries_part4;latencies_part0;latencies_part1;latencies_part2;latencies_part3;latencies_part4
0;3572377;3835250;3602510;562663;3918512;2.61;2.43;2.52;3.62;590.56
1;3674900;4460389;3763246;563465;3943408;2.61;2.07;2.43;4.03;2120.76
2;3627309;4258610;3566441;562061;3912491;2.57;2.18;2.52;4.10;2045.74
3;3517260;4266155;3771078;562675;3928720;2.71;2.14;2.39;3.82;4943.53
4;3725311;4417465;3971492;564356;3938080;2.57;2.14;2.22;3.89;2632.28
5;3448102;4289647;3837350;560645;3912112;2.76;2.18;2.35;3.82;1506.29
6;3564086;4257430;3819420;566853;3926739;2.66;2.18;2.35;3.82;2778.39
7;3602681;4328620;3743209;561266;3942272;2.66;2.18;2.43;3.89;1803.47
8;3604771;4269842;3818820;570039;3930848;2.61;2.18;2.26;3.82;2585.31
9;3564965;4313211;3751891;565395;3911802;2.66;2.14;2.43;4.10;1869.60
