run;total_request;ko_requests;min_response_time;max_response_time;mean_response_time;std_deviation;99th_response_time;mean_requests_per_second
0;13070;1666;0;1020;3;19;19;105.403
1;13070;1666;0;1030;3;21;12;105.403
2;13071;1667;0;1042;3;18;18;105.411
3;29522;6;0;6273;47;261;1104;115.32
4;13071;1667;0;1022;3;24;17;105.411
5;13071;1667;0;1019;3;19;12;105.411
6;29526;4;0;11929;53;341;1293;115.336
7;13071;1667;0;1168;3;15;20;105.411
8;29527;6;0;7608;46;258;1219;117.637
9;29497;6;0;5188;45;245;1227;115.675
