iteration;usage_avg;usage_std;reads_avg;reads_std
0;37554995.2;21497260.4426375;103369.9;54173.1253029581
1;150477209.6;91665062.5252656;235.3;161.086964090829
2;555397939.2;120623320.556907;580.7;53.801579902452
3;984738611.2;119245022.844703;621.2;18.5623274402737
4;1410048000;110495639.533085;608.5;20.8242646929015
5;1572858265.6;4915.2041666649;549.7;41.6462483304316
6;1572848844.8;38687.1463925682;599.2;34.7672259462838
7;1572847616;25447.9987425338;588.6;48.8675761625229
8;1572832870.4;36690.6479637523;609.3;37.2828378748194
9;1572780851.2;34758.1283730871;596.9;63.4798393192674
10;1572796006.4;40098.9751489985;593.9;38.7000000000008
11;1572800921.6;45655.2479349308;594.1;28.0871856902744
12;1572782899.2;38676.3059249458;616;26.2030532572061
13;1572775936;33888.0604343182;622.7;11.5849039702521
14;1572789043.2;41933.518430964;600;26.4537331959024
15;1572784537.6;42258.3354144481;597.3;27.6588141466706
16;1572809932.8;49247.4801791929;613.3;27.2325173276369
17;1572812800;41861.4430711604;604.1;21.9519930757996
18;1572821811.2;31940.9214644788;619.9;5.44885309033567
19;1572823040;30266.0882176736;614.1;6.02411819272504
20;1572819763.2;36350.697159752;614.2;18.9989473392582
21;1572814848;32819.1631825067;598;26.8663358126855
22;1572805017.6;31312.306590221;602.6;6.10245852095618
23;1572811161.6;30511.7692702341;616.2;33.7514444135346
24;1572802969.6;22091.846097599;603.4;36.672060209375
25;1572800512;31153.8448349477;602.5;13.6400146627483
26;1572801740.8;39703.7477324245;608.4;10.4422219857643
27;1572793548.8;40622.7427926771;609.9;20.2506790009625
28;1572784947.2;35851.1125629317;613.7;27.1516113702293
29;1572784947.2;42843.8414710913;594.2;38.1360721627166
