iteration;usage_avg;usage_std;reads_avg;reads_std
0;42856857.6;20307127.5879997;104934.5;54296.0189410789
1;175924838.4;100409375.733385;266.9;148.935858677486
2;585212313.6;114750245.635705;584.2;36.0909961070617
3;980274380.8;80202779.4866491;590.8;31.6663859636692
4;1048571904;0;583.6;25.838730618975
5;1048562892.8;27033.6039772724;611.5;7.86447709641122
6;1048570675.2;12018.8119213173;624.3;25.0081986556427
7;1048548556.8;43696.8538913272;606.4;12.5872951820501
8;1048539545.6;54875.6989568242;604.1;34.4251361653076
9;1048508825.6;53128.1343169511;623.2;22.189186555616
10;1048516198.4;59079.0320841498;613.6;4.73708771293105
11;1048514560;55379.3746443565;621.4;23.4827596334004
12;1048487526.4;52236.4470460999;601.6;6.63626400920886
13;1048502272;54092.0187828112;612.5;12.387493693238
14;1048499404.8;54587.5578497518;623.7;24.1911140710791
15;1048502681.6;51986.9374362445;613.4;6.60605782596656
16;1048500224;53066.5212728327;625;19.2613602842582
17;1048523980.8;56668.5713248534;603.1;5.48543526075802
18;1048523571.2;54733.3504181865;612.3;12.2396895385486
19;1048520294.4;54530.6677751153;611.9;18.0357977367245
20;1048519884.8;54155.5649587372;613.2;14.105318146003
21;1048534220.8;50292.477051742;619.7;20.0152441903647
22;1048546918.4;44623.8479739253;603.3;6.24579858785628
23;1048542412.8;41763.1355144702;621.1;16.5375330687497
24;1048543641.6;43750.5715619808;610.2;15.0519101777794
25;1048551014.4;28931.2166353232;615.9;10.5304320899009
26;1048544870.4;38081.7881933084;621;17.9610690105009
27;1048545280;35719.8450164611;602.6;5.73061951275492
28;1048542822.4;35635.2005747126;621.1;13.575345299475
29;1048536268.8;37898.5154326657;609.1;6.00749531834752
