time;time_passed_in;calls
0;2784.49;3
1;7620.161;23
2;7954.073;28
3;6605.07;22
4;6483.989;23
5;6710.454;30
6;3863.134;75
7;2245.423;89
8;2495.047;87
9;2302.92;102
10;2618.216;122
11;2235.656;110
12;2211.211;106
13;2140.88;100
14;2292.366;112
15;2743.646;98
16;2446.118;73
17;2881.472;84
18;3507.73;97
19;3183.246;92
20;2811.158;94
21;2859.425;85
22;3004.175;85
23;2763.751;81
24;3107.783;83
25;3030.074;83
26;2994.438;121
27;3236.13;151
28;3202.799;133
29;2740.217;95
30;2966.575;98
31;2889.115;90
32;3257.287;91
33;3434.693;88
34;3102.745;82
35;3541.079;122
36;3114.159;144
37;2895.581;78
38;3021.493;90
39;3070.531;96
40;3540.48;91
41;2939.555;91
42;3291.86;86
43;1579.415;101
44;239.344;76
45;197.718;64
46;238.333;61
47;249.068;88
48;205.88;73
49;151.73;69
50;158.491;63
51;175.981;67
52;170.845;67
53;758.875;72
54;1967.838;67
55;1984.321;70
56;2423.559;73
57;1894.459;61
58;2239.305;65
59;2912.905;61
60;3779.655;57
61;3970.777;51
62;3813.274;55
63;4217.903;56
64;3527.325;49
65;4057.404;54
66;3875.587;55
67;3386.921;52
68;4947.683;52
69;4850.235;43
70;5063.389;45
71;4321.881;28
72;4565.654;38
73;5153.654;41
74;4911.617;40
75;4318.067;38
76;4239.804;40
77;4385.587;35
78;4864.178;33
79;5558.083;44
80;5259.249;36
81;4760.598;45
82;3449.85;33
83;4206.862;43
84;4578.938;41
85;4091.607;39
86;4307.651;52
87;2976.277;45
88;3732.157;46
89;4065.16;49
90;4395.767;59
91;4376.824;46
92;4581.374;51
93;2925.742;37
94;3750.891;49
95;3993.269;53
96;4494.39;51
97;3651.71;49
98;3645.959;45
99;3451.299;49
100;4690.448;56
101;5622.06;52
102;4248.086;51
103;4514.886;44
104;3265.269;31
105;3758.799;42
106;4824.17;49
107;4888.848;45
108;4270.626;45
109;3360.421;48
110;4605.124;49
111;4064.535;50
112;5254.206;56
113;4644.394;54
114;5033.164;38
115;3805.293;41
116;3965.883;40
117;3800.809;46
118;4221.267;58
119;3720.782;49
120;4158.712;56
121;3268.825;49
122;4934.788;46
123;4729.737;52
124;4207.114;47
125;4692.884;37
126;3877.093;45
127;3728.637;46
128;4740.447;52
129;4719.174;50
130;4159.718;53
131;3188.045;50
132;4281.835;48
133;3953.097;55
134;4869.077;46
135;4947.397;45
136;4343.02;35
137;4339.142;47
138;3741.355;37
139;4971.207;47
140;3861.075;45
141;4165.171;50
142;3322.755;48
143;3517.553;46
144;4297.802;48
145;4926.326;57
146;4635.716;51
147;4099.733;38
148;2853.59;42
149;4863.391;52
150;3191.338;43
151;4376.971;45
152;4927.87;50
153;3916.939;47
154;4184.231;50
155;5214.453;46
156;4377.817;50
157;4369.141;52
158;4904.659;34
159;4781.574;46
160;4430.382;50
161;4656.416;51
162;3910.078;50
163;3732.016;48
164;3898.754;52
165;3528.838;52
166;3715.254;53
167;5107.988;51
168;4113.618;47
169;3942.27;46
170;4302.583;49
171;3644.203;46
172;3819.55;53
173;3385.738;55
174;3874.581;53
175;3841.806;51
176;3590.617;46
177;3368.675;46
178;3364.719;48
179;2864.375;29
180;3896.814;51
181;3922.413;48
182;3672.842;52
183;3317.084;51
184;2721.041;45
185;4144.533;50
186;3383.543;40
187;4223.534;57
188;4427.596;49
189;4885.605;43
190;4214.521;35
191;3549.952;44
192;3939.822;47
193;3432.208;45
194;3016.522;42
195;3713.833;46
196;3664.244;49
197;3943.679;43
198;3870.19;48
199;2866.823;49
200;3772.011;39
201;3819.591;43
202;3429.138;44
203;3752.029;45
204;4016.271;43
205;3278.769;41
206;4221.489;45
207;2622.381;44
208;4691.966;50
209;4223.149;38
210;4930.605;40
211;4197.752;30
212;4332.1;36
213;4733.85;43
214;3543.277;41
215;3845.731;43
216;4206.415;39
217;3246.665;45
218;4433.059;47
219;4031.015;48
220;4321.822;51
221;4059.358;48
222;3798.875;36
223;4740.692;51
224;3563.139;46
225;3669.658;37
226;3140.497;39
227;3335.652;35
228;829.737;27
229;6842.717;4
230;0;0
231;6468.578;1
232;0;0
233;0;0
234;6260.189;1
235;0;0
236;5854.102;1
237;0;0
238;0;0
239;5837.057;1
240;0;0
241;5606.702;1
242;0;0
243;5332.702;1
244;0;0
245;5060.835;1
246;0;0
247;4786.975;1
248;0;0
249;0;0
250;4739.447;1
251;0;0
252;4579.004;1
253;1921.183;2
254;4472.886;1
255;0;0
256;3751.143;4
257;4424.233;1
258;0;0
259;4237.089;1
260;0;0
261;1869.544;2
262;34448.596;3
263;0;0
264;0;0
265;0;0
266;0;0
267;0;0
268;0;0
269;0;0
270;5132.406;1
271;0;0
272;4961.135;1
273;0;0
274;4867.095;1
275;0;0
276;0;0
277;4572.707;1
278;4361.735;1
279;0;0
280;4300.514;1
281;0;0
282;0;0
283;5825.053;3
284;0;0
285;4164.126;1
286;0;0
287;3845.072;1
288;0;0
289;3862.152;1
290;0;0
291;3743.337;1
292;0;0
293;3788.836;1
294;0;0
295;3749.612;1
296;0;0
297;3467.930;1
298;3473.843;1
299;0;0
300;3432.778;1
301;0;0
302;3339.458;1
303;3146.999;1
304;0;0
305;6119.594;1
306;0;0
307;0;0
308;5796.781;1
309;0;0
310;0;0
311;5405.814;1
312;0;0
313;0;0
314;5426.823;1
315;0;0
316;0;0
317;5084.442;1
318;0;0
319;4931.449;1
320;0;0
321;0;0
322;4883.526;1
323;0;0
324;0;0
325;4556.546;1
326;0;0
327;4517.024;1
328;0;0
329;0;0
330;4386.320;1
331;0;0
332;4075.460;1
333;0;0
334;4086.255;1
335;0;0
336;0;0
337;3899.411;1
338;0;0
339;3929.770;1
340;0;0
341;3659.015;1
342;0;0
343;3489.489;4
344;3910.972;1
345;0;0
346;0;0
347;3835.038;1
348;0;0
349;3877.167;1
350;0;0
351;3775.168;1
352;0;0
353;3494.547;1
354;0;0
355;3367.237;1
356;0;0
357;3521.893;1
358;0;0
359;3296.036;1
360;0;0
361;3227.707;1
362;0;0
363;3265.625;1
364;0;0
365;2988.198;1
366;2913.119;1
367;0;0
368;2920.170;1
369;0;0
370;2999.885;1
371;2623.135;1
372;0;0
373;2782.832;1
374;2462.110;1
375;0;0
376;2617.366;1
377;0;0
378;2598.817;1
379;2439.528;1
380;0;0
381;2606.695;1
382;2345.360;1
383;2517.732;1
384;2251.536;1
385;0;0
386;2247.159;1
387;2172.905;1
388;2083.850;1
389;3801.725;1
390;0;0
391;3676.460;1
392;0;0
393;3544.897;1
394;0;0
395;3512.324;1
396;0;0
397;3263.967;1
398;0;0
399;3177.783;1
400;0;0
401;3162.727;1
402;0;0
403;2908.190;1
404;0;0
405;2898.909;1
406;2853.636;1
407;0;0
408;2878.346;23
409;7178.786;27
410;10422.647;12
411;8588.47;11
412;11153.708;15
413;9790.301;11
414;11766.885;11
415;11147.809;13
416;7144.668;49
417;174.623;63
418;216.519;69
419;198.838;63
420;201.504;62
421;159.5;61
422;154.931;60
423;160.656;60
424;205.34;64
425;262.56;67
426;3176.215;47
427;3302.323;59
428;4705.463;55
429;4374.915;57
430;4548.711;53
431;3965.789;55
432;3253.309;46
433;3986.698;47
434;4581.642;56
435;3957.84;52
436;2983.826;56
437;2726.531;41
438;3124.371;52
439;3161.366;49
440;4066.898;50
441;3913.684;50
442;3233.758;43
443;3806.205;45
444;4880.853;58
445;4646.255;45
446;5137.033;45
447;4315.973;35
448;4377.108;44
449;4568.63;46
450;4033.303;42
451;4117.309;48
452;4121.703;47
453;4036.296;38
454;5021.883;43
455;4222.898;51
456;3456.447;47
457;3830.07;49
458;3795.705;33
459;3672.484;48
460;3083.361;42
461;2310.241;43
462;2806.596;44
463;4390.692;47
464;3549.95;45
465;2785.632;38
466;4020.004;50
467;5577.417;40
468;3744.574;47
469;3099.027;34
470;3714.372;48
471;3634.497;47
472;3046.626;41
473;3007.71;44
474;4049.322;47
475;3148.814;42
476;3773.35;50
477;3742.678;57
478;4136.722;51
479;3840.343;37
480;3492.6;37
481;3333.433;39
482;2608.083;38
483;3478.276;52
484;2678.695;43
485;3503.884;46
486;3209.66;43
487;3849.608;48
488;3195.84;49
489;3994.455;53
490;3552.716;31
491;3516.103;40
492;3444.653;49
493;3422.965;43
494;3623.409;47
495;3230.305;41
496;4385.869;46
497;3604.051;42
498;4219.738;43
499;4529.152;43
500;4603.462;35
501;3969.439;30
502;3312.214;37
503;4231.938;40
504;3612.708;34
505;4087.288;37
506;4068.003;37
507;4521.12;43
508;3745.023;43
509;4612.813;41
510;4285.437;46
511;5473.29;32
512;3446.55;31
513;4189.152;39
514;4557.697;40
515;3866.627;44
516;4110.474;40
517;4238.354;44
518;3425.972;50
519;4103.885;46
520;5863.518;51
521;4299.074;54
522;3846.609;37
523;3847.239;49
524;3531.207;54
525;3949.133;43
526;3819.159;42
527;4604.404;40
528;4675.422;51
529;3972.415;52
530;5593.776;41
531;4998.583;42
532;4985.519;40
533;3519.171;36
534;4626.627;44
535;4337.34;42
536;4798.244;44
537;4884.341;50
538;4347.769;49
539;4316.425;48
540;4017.228;47
541;6531.964;44
542;5028.797;39
543;3580.651;25
544;4165.059;43
545;3961.769;43
546;4311.198;40
547;3355.273;43
548;4313.551;42
549;3535.362;48
550;5241.874;50
551;5491.313;47
552;5296.766;51
553;4314.238;39
554;4885.088;46
555;3679.636;46
556;2940.769;39
557;4076.764;50
558;4083.183;38
559;3851.75;40
560;3814.429;47
561;3423;54
562;3505.753;51
563;4579.798;47
564;5423.497;38
565;4356.291;40
566;5283.658;47
567;4966.685;40
568;4832.277;41
569;4553.069;37
570;5183.744;44
571;4428.879;48
572;4407.788;53
573;4142.715;50
574;4632.283;44
575;4225.295;30
576;5001.156;44
577;4221.944;43
578;3780.679;44
579;2908.057;38
580;2866.371;47
581;2956.739;50
582;2876.474;44
583;3842.615;41
584;3314.309;49
585;4405.113;41
586;3651.239;39
587;5227.01;50
588;21341.459;5
589;20823.415;1
590;0;0
591;0;0
592;22654.022;1
593;0;0
594;0;0
595;18295.231;1
596;0;0
597;0;0
598;9076.158;1
599;8543.997;1
600;0;0
601;7976.017;1
602;7576.725;1
603;0;0
604;7287.154;1
605;0;0
606;13034.244;1
607;0;0
608;0;0
609;7474.262;1
610;6962.010;1
611;0;0
612;6957.734;1
613;0;0
614;6503.880;1
615;0;0
616;6254.125;1
617;6144.293;1
618;0;0
619;5886.414;1
620;0;0
621;5481.808;1
622;0;0
623;5431.378;1
624;0;0
625;5111.459;1
626;0;0
627;5210.861;1
628;0;0
629;5057.816;1
630;0;0
631;4723.347;1
632;4573.440;1
633;0;0
634;4710.917;1
635;0;0
636;4456.334;1
637;0;0
638;4307.956;1
639;4244.699;1
640;0;0
641;4196.132;1
642;0;0
643;4088.594;1
644;28402.269;1
645;0;0
646;0;0
647;0;0
648;0;0
649;0;0
650;1946.672;2
651;2011.941;1
652;1928.607;1
653;1916.524;2
654;1947.599;2
655;1977.473;2
656;2023.664;2
657;1849.43;2
658;4249.416;2
659;1801.852;2
660;1947.354;1
661;2238.39;2
662;1900.446;2
663;1855.979;2
664;3756.853;4
665;0;0
666;1997.783;2
667;1895.705;2
668;1739.965;2
669;3647.488;4
670;1819.883;1
671;1800.639;2
672;1856.708;2
673;1863.520;1
674;2074.884;1
675;2379.197;1
676;0;0
677;2334.419;1
678;1820.312;1
679;24876.343;1
680;0;0
681;0;0
682;0;0
683;0;0
684;0;0
685;0;0
686;0;0
687;0;0
688;1881.651;2
689;3752.046;4
690;1787.215;2
691;0;0
692;3741.983;4
693;1964.418;1
694;0;0
695;3746.471;4
696;1860.173;1
697;1851.191;1
698;1799.220;1
699;2492.240;1
700;1823.269;2
701;1896.578;2
702;1883.158;2
703;1786.796;2
704;1838.259;3
705;1843.155;2
706;1922.475;2
707;1769.809;2
708;1891.324;1
709;1866.485;2
710;1886.898;1
711;1874.058;1
712;1857.972;1
713;10030.198;1
714;0;0
715;0;0
716;0;0
717;0;0
718;0;0
719;3795.533;3
720;1865.114;2
721;1906.838;1
722;15362.716;1
723;0;0
724;0;0
725;0;0
726;0;0
727;0;0
728;0;0
729;0;0
730;18179.242;1
731;0;0
732;0;0
733;0;0
734;0;0
735;0;0
736;0;0
737;0;0
738;0;0
739;2201.839;2
740;1856.366;2
741;1893.743;1
742;1824.733;2
743;1870.902;2
744;1837.265;2
745;1825.079;1
746;1870.385;2
747;1912.069;2
748;1888.893;2
749;1886.744;2
750;2083.763;1
751;1904.339;2
752;1860.289;2
753;1904.568;2
754;1880.666;2
755;1889.259;3
756;1957.076;2
757;0;0
758;3895.929;4
759;0;0
760;1931.498;2
761;1931.320;1
762;8395.757;1
763;0;0
764;0;0
765;0;0
766;0;0
767;1873.918;1
768;11073.832;1
769;9157.254;11
770;9673.022;10
771;12306.272;4
772;7594.176;11
773;10323.122;3
774;8623.134;12
775;9436.618;14
776;8426.21;19
777;6561.121;33
778;6275.424;47
779;5059.052;51
780;4686.463;46
781;4920.454;37
782;4382.254;49
783;4872.824;52
784;4231.275;45
785;4690.398;46
786;4206.63;50
787;21750.834;4
788;2056.310;1
789;10976.628;11
790;11155.635;2
791;6769.325;11
792;8979.755;19
793;6256.141;19
794;6644.525;38
795;5048.61;40
796;5264.494;49
797;4194.874;45
798;4121.078;47
799;4693.371;43
800;4835.626;50
801;5846.644;50
802;5999.321;43
803;5362.283;36
804;4144.126;41
805;4651.939;46
806;5401.314;42
807;5155.165;43
808;5110.01;48
809;5343.654;40
810;4353.829;52
811;4542.268;64
812;4221.602;60
813;5028.602;52
814;4389.094;39
815;4617.28;48
816;4845.32;48
817;20985.001;4
818;3734.023;5
819;8321.628;12
820;7815.274;11
821;8032.787;13
822;7214.89;16
823;7699.375;28
824;5488.89;41
825;5542.842;48
826;4949.861;30
827;4769.741;46
828;3839.446;48
829;3811.939;47
830;4670.849;56
831;3316.994;48
832;3694.064;48
833;21616.155;4
834;7879.312;9
835;22300.941;2
836;3953.277;4
837;11472.022;12
838;9730.064;1
839;3991.218;4
840;7038.425;9
841;7531.602;11
842;7734.35;12
843;7380.406;13
844;7143.25;18
845;6854.809;26
846;5519.875;43
847;4973.647;49
848;4459.791;35
849;4149.236;32
850;4801.095;43
851;3873.493;47
852;4074.056;44
853;4959.123;48
854;3952.658;48
855;3984.779;48
856;4088.035;50
857;5337.877;54
858;4903.59;49
859;4830.424;57
860;4026.643;38
861;4663.577;48
862;4444.745;49
863;4326.069;42
864;23122.928;4
865;4073.534;3
866;8985.929;11
867;8751.945;10
868;9636.077;15
869;8754.998;23
870;6233.423;29
871;5622.439;38
872;4482.777;42
873;4715.725;50
874;4530.865;46
875;4541.428;41
876;5907.739;38
877;4788.308;53
878;4401.925;47
879;3829.077;49
880;4549.63;56
881;5608.158;50
882;5193.2;42
883;23243.801;9
884;4071.587;5
885;11634.204;3
886;6020.478;6
887;9360.792;13
888;9503.354;19
889;8193.942;26
890;22170.322;3
891;5620.926;7
892;10424.09;12
893;9151.783;12
894;23389.502;3
895;1346.071;1
896;9591.94;11
897;8319.045;10
898;9605.821;12
899;9269.437;12
900;8543.823;15
901;22512.279;3
902;1954.534;3
903;10809.214;13
904;9984.894;13
905;7967.975;11
906;9258.661;14
907;7954.43;17
908;8228.983;28
909;6002.92;45
910;4598.994;46
911;4702.941;52
912;4542.393;54
913;4632.976;51
914;5274.606;51
915;5935.4;47
916;5703.633;49
917;5985.452;33
918;4935.864;33
919;5962.136;51
920;5120.656;49
921;4831.487;45
922;4493.302;47
923;4664.09;56
924;3824.352;51
925;4655.586;53
926;5327.627;52
927;5809.796;51
928;4852.3;32
929;6451.193;42
930;4670.436;43
931;4611.639;49
932;4846.373;48
933;4905.639;50
934;5077.181;48
935;5242.677;48
936;5496.851;53
937;4149.655;53
938;5215.408;51
939;4970.438;36
940;4101.051;43
941;4807.224;43
942;4616.065;42
943;5251.235;40
944;5035.561;52
945;3913.064;51
946;4553.342;50
947;5314.13;54
948;986.027;78
949;3694.486;22
950;5446.784;27
951;6195.803;23
952;5736.18;19
953;6486.414;16
954;5732.345;15
955;5980.805;15
956;6697.632;13
957;7097.889;13
958;6296.647;10
959;7159.428;12
960;5437.052;11
961;4316.278;8
962;6809.597;13
963;5338.279;9
964;5400.01;10
965;6071.518;10
966;6699.991;11
967;7068.616;11
968;6921.153;9
969;5597.693;9
970;6772.214;10
971;6486.151;8
972;4095.559;5
973;8429.777;7
974;5468.36;8
975;5963.066;7
976;6233.226;9
977;7333.248;8
978;6293.927;9
979;6569.364;7
980;6053.548;7
981;4934.047;7
982;7470.03;10
983;2695.722;5
984;6685.836;7
985;5970.812;8
986;6330.374;7
987;5884.851;7
988;6493.359;9
989;6282.826;8
990;6501.585;8
991;5845.386;9
992;5159.061;7
993;6045.083;10
994;4963.044;6
995;6401.355;8
996;5859.545;9
997;4893.174;6
998;7351.149;8
999;6315.17;8
1000;6235.267;8
1001;6444.352;7
1002;5177.613;6
1003;6015.223;8
1004;6616.141;8
1005;4422.859;6
1006;4935.824;5
1007;6280.644;9
1008;5844.352;9
1009;4850.639;7
1010;6079.023;9
1011;7528.405;9
1012;4678.004;7
1013;6321.951;8
1014;5911.651;6
1015;6574.212;7
1016;4587.665;7
1017;4540.217;7
1018;4936.056;6
1019;7443.487;11
1020;3079.258;5
