iteration;usage_avg;usage_std;reads_avg;reads_std
0;339732480;906986.576094707;118190.7;74510.7480435541
1;343728128;1775944.54722888;289.2;98.1741310121969
2;349553868.8;2151630.0475909;110.7;66.1514172183786
3;354816000;1283673.59177012;196.1;32.0014062191024
4;358800998.4;1201848.27533595;191.9;7.62167960491626
5;362771660.8;1121683.52365897;198;12.9151074327705
6;366924595.2;1203596.61915776;207.2;10.5052367893351
7;370992332.8;1191829.09100928;211.2;10.2352332655393
8;375207116.8;1259706.20438259;209.8;7.70454411370285
9;379369881.6;1352452.06168352;211.4;6.69626761711357
10;383602278.4;1376054.17186388;209.3;6.41950153828098
11;387818700.8;1383667.4192305;210;5.9665735560704
12;392074854.4;1437698.56729427;211.2;3.81575680566843
13;396197068.8;1464391.66392601;207.6;5.74804314528067
14;400399155.2;1469822.70495458;207.2;8.20731381147331
15;404532838.4;1549771.22268288;207;5.44058820349404
16;408782028.8;1551920.34785294;207.1;6.42572953056701
17;413014835.2;1721120.53298309;208.6;5.64269439186669
18;417354956.8;1764252.37856266;209.1;6.20403094769886
19;421673369.6;1904360.04204247;207.7;4.96084670192578
20;426110566.4;1977839.98651458;207.3;7.00071424927448
21;430338048;2132790.77917737;205.3;10.8355895086514
22;434747801.6;2236911.96609612;207.1;6.36317530797363
23;439200563.2;2375605.17620584;206;6.21288982680351
24;443548876.8;2531927.11822438;206.3;12.5781556676644
25;447908659.2;2540891.82251587;208.5;6.8883960397176
26;452302848;2532859.39437625;206.6;9.93176721434808
27;456705638.4;2557297.96654516;207.7;6.97208720542191
28;461064601.6;2704985.00298985;202.8;7.74338427304232
29;465431756.8;2850115.47438766;202.8;10.75918212505
30;469803827.2;2945641.92416118;203.8;13.5558105622642
31;474125516.8;3063996.94133529;200.5;6.29682459657258
32;478534451.2;3074851.70423551;198.9;7.31368580129048
33;483015065.6;3188197.16078915;204.2;9.95791142760422
34;487451852.8;3315074.66793977;204.8;8.34026378479664
35;491930419.2;3440195.65283139;205.3;5.71051661410711
36;496486809.6;3466221.55282204;204.6;6.03655530911482
37;500969472;3618117.15538345;203.1;6.18789140176206
38;505527910.4;3630397.56187666;205.3;8.06287789812017
39;510123622.4;3788383.93426221;202.7;10.8078675047395
40;514608332.8;3906095.93267549;203.6;10.3460137251021
41;519137689.6;3976572.31487018;204;5.36656314599977
42;523706777.6;3957729.53687338;200.7;9.52942810456141
43;528262348.8;4062806.2951177;201.7;9.84936546179546
44;532868710.4;4113173.93401446;198.8;6.66033032213873
45;537493094.4;4262955.14897541;200.3;6.82715167547882
46;541936844.8;4445280.99234053;200.8;6.0464865831316
47;546391654.4;4420204.31635643;196;8.70631954387173
48;550926745.6;4553179.33597349;203.1;7.81600921186743
49;555611750.4;4626271.33030133;200.5;11.8342722632194
50;560261120;4710117.9908652;203.2;5.60000000000005
51;564966195.2;4728668.63613174;200;10.3826778819341
52;569594675.2;4848062.62857897;198.8;8.74985714169081
53;574122803.2;4897397.6231562;198.6;9.38296328459197
54;578583756.8;4914632.26161877;198.9;5.55787729263605
55;583180288;5029742.56988327;199.2;9.11921049214299
56;587646156.8;5128241.41676345;196.3;10.2863987867474
57;592201318.4;5224912.95800112;197.1;10.8853112036361
58;596623769.6;5411350.67056941;193;12.4739729036101
59;601066700.8;5568312.10739628;200.2;10.6376689175779
60;605586227.2;5647936.89751718;196.5;7.0746024623298
61;610136064;5672876.30494443;199.7;11.8831813922033
62;614706380.8;5766975.93862433;200.9;7.32734604068861
63;619087462.4;5852828.04706784;193.6;11.2534439173081
64;623514419.2;5782215.65614289;193.6;8.60464990571963
65;627949977.6;5651769.2251089;190.2;8.51821577561903
66;632320000;5715919.78998166;189.2;4.35430821141618
67;636606054.4;5616153.50332093;188;10.1980390271856
68;640908083.2;5557291.24292762;189.2;7.83326241102696
69;645293670.4;5603746.32731211;192.5;14.2916059279565
70;649628057.6;5593178.873169;191.8;9.1301697684103
71;653899776;5566502.65417273;189.5;16.3966459984961
72;658008883.2;5438970.43898567;185.8;13.166624472506
73;662315417.6;5219587.44304413;190.2;13.7389955964768
74;666581401.6;5187148.00750624;184.4;9.58331884056857
75;670832230.4;5072665.13380728;188.5;12.5399362039845
76;674920857.6;4918928.06243962;183.5;15.0748134316813
77;679107379.2;4922370.63721455;186.3;13.6605270762149
78;683058380.8;4917314.12240788;178.1;10.5778069560757
79;686968832;4800335.15578569;172.2;8.13387976306532
80;690890752;4638889.98540642;175.9;14.3767172887276
81;694742220.8;4480300.14015311;168.4;12.5235777635626
82;698626867.2;4230078.15709166;170.4;14.0726685458017
83;702502912;4197049.20162154;174.3;7.70778826901701
84;706217574.4;4049481.43498498;169.8;13.5336617365736
85;709976064;4045803.13636736;170.2;13.0291979799219
86;713539174.4;3960925.37668661;158.6;15.2
87;717022822.4;3869714.8107756;154.9;10.7093417164641
88;720625254.4;3750181.12881818;162.2;14.0484874630689
89;723945062.4;3616518.52041601;153.7;15.6910802687389
90;727255040;3574629.32601857;154.3;9.20923449587391
91;730438041.6;3605688.67588315;141.9;7.38173421358409
92;733514956.8;3705467.99150013;141.3;13.0541181241781
93;736552960;3590657.07320318;141.3;10.3542261903051
94;739467673.6;3485807.39882398;131.2;11.7029910706624
95;742461440;3444722.36287803;134.1;16.4344151097629
96;745238528;3388319.54023702;124.3;10.9183332061263
97;748038553.6;3299561.36966597;126.4;13.1468627436358
98;750747238.4;3285887.91614078;124.7;6.51229606206596
99;753443635.2;3259844.1564811;119.7;8.98943824718761
100;755917209.6;3249026.85206509;116.5;6.68206554891522
101;758413312;3176318.59439824;113.5;9.79030132324845
102;760758272;2980229.44643663;107.2;9.22821759604745
103;763072102.4;2995421.60291335;107.7;5.02095608425319
104;765453926.4;3062564.81986978;108;8.36660026534076
105;767874662.4;3023304.85262998;108.3;9.06697303403958
106;770130329.6;3001107.33521879;99;7.33484832835685
107;772332748.8;3042299.58140877;100.5;12.4839897468718
108;774386892.8;3020514.40505885;93;13.8491877018112
109;776419737.6;3064453.10684174;92;9.89949493661167
110;778575052.8;2959054.72597179;92.1;8.63075894692928
111;780580864;2943821.87204593;87;9.76729235765981
112;782358528;2879402.49546325;82;10.1291658096805
113;784200499.2;2849632.1514413;84.7;11.1897274318904
114;786006835.2;2828785.37853687;80.6;8.24863625092057
115;787782860.8;2926547.60008307;78.3;9.14385039247693
116;789497856;2807925.70898875;78.9;6.72978454335643
117;791198105.6;2654249.21252244;76.9;8.38391316748922
118;792915968;2649206.54701894;75.5;8.87975224879616
119;794645299.2;2659925.37006887;79.9;8.89325587172658
120;796291481.6;2617496.20138941;73.8;9.69329665284211
121;797915136;2699141.08611462;74.4;7.74854825112415
122;799460556.8;2683802.09817043;69.1;7.58221603490699
123;801055539.2;2556925.6952833;72.2;7.18052922840646
124;802495692.8;2488195.63356903;64.3;7.34914961066927
125;803900211.2;2497296.66893463;64.3;9.05593727893475
126;805417779.2;2414190.04436353;66;5.42217668469035
127;806987366.4;2357358.27983784;68.3;8.1737384347678
128;808364441.6;2453996.42788982;59.9;5.35630469633684
129;809907404.8;2424767.68780846;66.5;8.40535543567312
130;811247206.4;2310700.37897777;58.9;4.34626276242013
131;812520652.8;2372878.9799128;59.6;4.19999999999999
132;813791641.6;2389424.13017363;58.8;5.24976189936271
133;815030681.6;2336992.85634852;54.4;8.00249960949705
134;816202956.8;2343289.38167526;54.1;5.41202365109392
135;817557504;2431657.59342223;59.6;8.61626369141519
136;818743705.6;2384964.15724849;52.4;8.60464990571961
137;819879116.8;2394559.43482554;51.6;9.71802449060508
138;821153382.4;2367605.95194386;56.1;6.53375848956786
139;822376038.4;2268765.63711636;52.2;6.7941151005852
140;823485235.2;2308031.70606991;51.3;8.35523787812175
141;824747622.4;2337777.92500143;53.3;7.69480344128426
142;825926860.8;2346215.15071402;52.3;6.43506021727849
143;827074969.6;2388447.2471227;48.3;6.55820097282785
144;828249702.4;2443220.0182546;51.2;6.50845603810917
145;829300736;2466175.03469644;45.7;7.51065909225015
146;830287872;2461781.18987371;45;6.8264192663504
147;831311872;2463354.9684542;44.6;7.5392307299883
148;832364953.6;2407327.92239695;48;4.40454310910906
149;833382809.6;2371116.48641057;45.8;7.01141925718326
150;834380185.6;2413076.24744847;44.2;7.30479294709985
151;835300147.2;2436885.27756232;42.3;6.7386942355326
152;836268032;2479309.84887327;42.8;7.89683480895988
153;837285068.8;2377752.55472894;44;7.88669766125214
154;838290227.2;2402905.78867504;40.6;8.56971411425141
155;839147110.4;2411920.44424687;39.5;4.78016736108684
156;840007680;2399879.92139607;37.6;6.49923072370875
157;840905523.2;2405823.03971676;40.3;3.57910603363471
158;841900441.6;2405045.11493319;41.8;10.0079968025575
159;842771251.2;2473783.29463193;38.2;6.91086101726838
160;843549491.2;2436508.65554465;38.1;6.45677938294316
161;844428902.4;2480171.2596093;37.8;3.84187454245974
162;845332480;2488904.32776513;40;3.79473319220207
163;846125465.6;2532614.93034531;35.1;4.08533964316311
164;846878310.4;2522284.87257724;34.6;5.95315042645487
165;847722086.4;2490865.93760162;37.5;5.86941223633168
166;848695296;2408382.51882711;38.7;6.85638388656876
167;849444454.4;2476465.07433156;34.1;4.57055795281056
168;850264064;2396683.6706349;35.8;6.4
169;851007897.6;2404257.93669814;34.8;3.60000000000004
170;851758284.8;2292393.86976671;34.3;6.22976725086902
171;852685619.2;2281443.17334796;37.9;7.09154426059657
172;853450342.4;2278920.64795596;34.2;4.35430821141543
173;854156083.2;2263207.94826459;32.2;5.05568986390581
174;854876160;2322139.41014057;32.3;4.79687398208461
175;855561011.2;2295914.36197085;32.5;4.63141447076377
176;856220467.2;2332089.02929884;31.5;4.4553338819891
177;856962662.4;2258738.22510179;33;4.12310562561766
178;857621708.8;2304117.08802483;29.1;5.39351462406471
179;858356121.6;2353693.04468701;31.4;5.90254182534949
180;859016806.4;2376113.18313585;29.1;3.59026461420325
181;859714764.8;2386125.17795358;32.1;6.00749531835023
182;860454502.4;2369991.36630326;32.7;5.56866231693032
183;861154099.2;2302112.37247186;32;6.14817045957576
184;861833216;2278280.66061054;30.6;5.16139516022556
185;862470553.6;2305004.81183706;29.5;3.85356977359954
186;863209062.4;2278053.80187212;32.2;7.83326241102645
187;863957401.6;2333537.21393767;32.9;8.10493676718086
188;864542310.4;2316517.01702707;27.5;4.92442890089805
189;865180057.6;2317224.31351995;27.1;2.7730849247724
190;865758412.8;2399656.06372913;25.4;4.60868744872117
191;866351513.6;2477164.62879317;28.6;5.00399840127872
192;867016294.4;2430169.2267264;28.7;6.49692234831232
193;867686400;2484052.45507256;32.2;7.29109045342326
194;868344627.2;2575375.6266176;26.4;4.52106182218293
195;868914790.4;2648376.29763748;26.4;7.29657453878189
196;869453824;2616754.21210935;24.9;4.67867502611584
197;870060851.2;2701550.20341433;26.6;6.66633332499958
198;870646169.6;2665727.93656967;25.1;6.87677249878167
199;871187251.2;2716662.72878177;23;3.06594194335117
200;871716864;2723234.61782932;22.1;3.91024295920342
201;872279654.4;2669137.55536728;25.5;4.6743983570081
202;872782233.6;2646567.69775798;22.8;3.12409987036266
203;873399500.8;2636569.49252167;26;5.45893762558247
204;873943859.2;2705664.4451698;23.4;5.23832034148352
205;874502553.6;2727549.8662294;24.8;4.42266887749919
206;875068620.8;2683797.09714129;24.6;5.04380808516739
207;875540070.4;2603361.30841341;20.9;4.482186966203
208;876063539.2;2671537.33647127;24.2;4.87442304278157
209;876607078.4;2653391.96148025;23.1;5.73498038357587
210;877203046.4;2633455.63059946;25.2;4.64327470649757
211;877805568;2602369.67404402;24.3;5.08035431835221
212;878406860.8;2597150.05820457;26.3;5.86600375042498
213;878874624;2571635.68799004;22.2;7.1805292284065
214;879502950.4;2520989.47449132;25.2;7.15262189689907
215;880044032;2560214.45756718;22.1;4.13400532171887
216;880549068.8;2634346.97746823;20.6;4.00499687890015
217;880965632;2741060.36862525;19;4.83735464897913
218;881419059.2;2743743.32040299;20.4;3.23109888428071
219;881904844.8;2785972.49934453;20.6;5.33291665038935
220;882362368;2787090.83721934;20.7;4.47325384926901
221;882916966.4;2708538.62096297;21.7;3.66196668472011
222;883354419.2;2637747.07164125;21.6;5.23832034148351
223;883811123.2;2641127.22565196;19.3;4.40567815438213
224;884251852.8;2584148.05916379;18.8;4.79165942028437
225;884756889.6;2625043.57116753;21.2;4.55631429995781
226;885199257.6;2569214.45725342;19.5;3.35410196624968
227;885663744;2592883.3389877;20.9;6.36317530797322
228;886053273.6;2561728.38726357;19.3;6.01747455333215
229;886439116.8;2672079.08733256;17.6;5.42586398650021
230;886853632;2713641.88708238;18.8;3.89358446678635
231;887257497.6;2670796.91777567;18.5;4.4328320518603
232;887712153.6;2718654.51719633;18.9;4.86723740945519
233;888202854.4;2711684.52897899;22.2;3.68239052790439
234;888623513.6;2683724.36226376;16.3;4.4955533585978
235;889084723.2;2677845.04348702;21;4.62601340248815
236;889448038.4;2724742.94136383;16.9;4.03608721412212
237;889903513.6;2694988.84071604;19.4;4.58693797647189
238;890300825.6;2688202.77166139;18;3.71483512420134
239;890685440;2717725.63178552;19.2;3.48711915483254
240;891107328;2667222.76794122;17.7;5.55067563455117
241;891572224;2686806.16048125;20.6;5.12249938994627
242;891967078.4;2652044.20246722;18;5.32916503778969
243;892385689.6;2674581.48933698;17.6;5.04380808516739
244;892649062.4;2667876.98849254;13.5;5.57225268630201
245;893066035.2;2705564.14580619;18.3;6.32534584034738
246;893426073.6;2673817.34850831;15.9;3.38969025133566
247;893780377.6;2620687.54000472;15.3;4.64865571966778
248;894163763.2;2625592.26346209;17.5;4.5
249;894571315.2;2692874.25993863;17.7;5.69297813099612
250;894971084.8;2675747.10498881;19.2;3.45832329315812
251;895452774.4;2827398.04030773;20.5;6.57647321898295
252;895783321.6;2826098.9812871;15.9;4.98898787330657
253;896212582.4;2777837.89568794;18.7;5.45985347788748
254;896514867.2;2822804.42499299;15.1;5.00899191454728
255;896949862.4;2780733.61467365;18.7;4.77598157450382
256;897253376;2764866.14203292;14.9;4.22965719651132
257;897678950.4;2735513.80700007;17.6;2.76405499221704
258;898028748.8;2751731.11972518;16;3.92428337406971
259;898359296;2683332.08526414;15.8;4.09389789809174
260;898616934.4;2680377.74047167;12.7;3.57910603363466
261;898944204.8;2705657.624342;14.3;3.68917334913934
262;899356672;2704546.49355636;16;2.40831891575846
263;899744972.8;2737498.7435862;16.2;4.74973683481517
264;900085760;2751151.35894192;17.1;7.4222638056054
265;900440883.2;2733888.87730866;15.7;4.02616442783948
266;900750131.2;2728534.37471182;14.8;4.62168800331654
267;901078220.8;2719578.55113766;13.1;3.78021163428716
268;901430886.4;2767064.58534238;14.9;5.94053869611166
269;901754880;2748962.28252044;14.6;4.4988887516808
270;902096076.8;2680776.80202437;15.8;3.89358446678636
271;902373376;2704875.09543787;11.7;5.21632054229799
272;902692864;2658801.91085233;14.7;5.060632371552
273;903054540.8;2734886.68562922;16.2;4.4226688774992
274;903468646.4;2810661.47103631;17.9;5.87281874401041
275;903747174.4;2789189.05735986;13.1;4.22965719651132
276;904067891.2;2843502.70406624;14.2;3.54400902933387
277;904353792;2891225.5113429;15.3;4.64865571966778
278;904606924.8;2859405.27854028;11.7;2.64764045897475
279;905004236.8;2902517.65161764;16.4;3.16859590355098
280;905379020.8;2916133.27001905;16.3;1.95192212959431
281;905745203.2;2944362.41312784;15.8;5.77581163127746
282;906058956.8;3020511.48899785;14.6;4.52106182218293
283;906371891.2;2962765.54398218;12.4;3.77359245282264
284;906690560;2940732.32107106;14.5;3.82753184180093
285;907094425.6;2859226.40587695;16.9;4.32319326424346
286;907461836.8;2931466.90935443;16.2;5.03587132480567
287;907769856;2961655.70415469;13.3;4.00124980474851
288;908110643.2;3033807.43887808;12.4;3.8262252939418
289;908543180.8;2977912.59575697;16.8;2.31516738055805
290;908826624;3041214.35295311;13.2;2.95972971738975
291;909131776;2985377.12351388;13.9;4.65725240887801
292;909428326.4;3022480.11463963;12.7;3.52278299076171
293;909656883.2;3012188.37439095;10.4;3.16859590355097
294;909928038.4;2990260.21858433;10.8;2.95972971738975
295;910199603.2;2981803.06865225;13.8;4.19046536795139
296;910495334.4;2935882.08279829;12.7;3.74299345444258
297;910752153.6;2903880.97406764;12;5.42217668469038
298;911036006.4;2866933.42577745;12.6;4.38634243989226
299;911293235.2;2843720.41287888;12.5;4.12916456441252
