time;transactions_avg;transactions_std;queries_avg;queries_std;latencies_avg;latencies_std
0;571.116;49.7797340691955;9152.224;800.160412294964;5.738;0.777403370201079
1;722.999;39.1362360096108;11570.77;621.06740001388;4.354;0.261694478352132
2;732.757;37.6563625566803;11725.916;602.374388452893;4.323;0.262451900355089
3;745.697;40.9435362542134;11926.808;658.198527388184;4.269;0.258899594437685
4;737.973;46.2970059615101;11811.87;737.229064945244;4.264;0.160324670590619
5;764.702;63.693368697219;12233.015;1022.70384964809;4.124;0.20165316759227
6;789.502;64.2513762965431;12635.123;1026.86526631348;4.023;0.236391624217094
7;803.002;60.0151698822888;12844.635;963.186077715508;3.91;0.258263431402897
8;828.403;60.6092255436419;13260.134;965.26866025162;3.832;0.215953698741195
9;853.377;82.7592264403183;13650.748;1322.87903471027;3.72;0.278639552109891
10;871.855;57.4220769826344;13946.095;920.847385740402;3.61;0.207942299689118
11;880.453;36.108382420151;14087.615;579.874116326149;3.532;0.182142801120437
12;887.692;34.161570455701;14204.487;544.960439042186;3.504;0.0958331884056845
13;883.506;39.0761457157708;14138.887;625.389115448082;3.522;0.106658333007797
14;878.715;43.0469795107655;14058.128;690.38533886229;3.545;0.204071066052974
15;891.138;38.8408230602841;14258.123;619.759017490617;3.472;0.116172285851645
16;889.897;52.2343492445311;14238.38;835.93374592726;3.48;0.154077902374074
17;868.671;59.0326515498002;13900.95;943.342816318626;3.556;0.172406496397317
18;886.208;55.9455640421973;14178.028;895.738158233811;3.521;0.224875521122245
19;886.143;55.4456465468655;14177.479;885.77046798194;3.441;0.154301652615913
20;885.647;59.291953762713;14165.949;945.940025196653;3.48;0.196672316303022
21;905.858;47.9135598343534;14500.635;768.373931120148;3.438;0.201186480659114
22;883.502;39.0243385081707;14132.139;623.801788831216;3.471;0.149763146334467
23;886.415;48.9022987700976;14185.548;779.648972048343;3.494;0.190850727009343
24;893.848;37.4378284092454;14297.949;601.676342570445;3.474;0.189905239527507
25;887.976;49.1952729843018;14207.389;785.134352457598;3.469;0.198517001790776
26;872.298;58.3120717862101;13958.953;933.507145479358;3.514;0.223794548637796
27;891.394;34.3631058549747;14263.009;551.75895085537;3.453;0.115243221058741
28;891.794;42.4993275711545;14265.512;677.019064484937;3.405;0.131472430570054
29;896.624;34.5980413318394;14348.97;553.419442285852;3.441;0.125892811550148
30;903.881;41.5183230513927;14460.596;661.775644024432;3.405;0.156540729524298
31;900.819;43.6439554692278;14411.102;699.429933042625;3.43;0.169469761314503
32;909.374;40.8333114503338;14552.771;653.147463892374;3.369;0.12589281155012
33;912.428;42.436871892257;14596.949;677.975257136228;3.352;0.113736537664911
34;882.317;38.0349999474171;14122.741;606.134870741675;3.509;0.102999999999985
35;889.708;20.8813097290435;14231.656;332.576044964217;3.394;0.0901332347139526
36;892.001;36.2927779179274;14273.926;582.748934073744;3.403;0.14546820958546
37;887.407;31.0342324055269;14196.411;497.624776401801;3.461;0.121115647213703
38;891.755;51.709861970422;14272.28;829.953525578325;3.492;0.169634902069127
39;892.126;46.2028291774442;14268.814;743.159242682188;3.392;0.135631854665478
40;885.778;46.3935350668605;14174.435;741.675674553893;3.488;0.192966318304507
41;896.665;40.7079712709928;14342.538;658.779449843421;3.422;0.155999999999983
42;899.82;45.1769684684565;14399.829;720.047621417527;3.492;0.177696370249933
43;901.546;29.311341218036;14424.224;463.398924150704;3.44;0.0893308457365085
44;887.983;57.0481046223273;14210.245;915.866884074853;3.473;0.168763147635962
45;884.212;22.0909958127745;14145.201;357.543771235024;3.523;0.0897830719010988
46;880.97;25.2718839820052;14097.832;398.337201998574;3.435;0.114913010577571
47;878.486;40.5423699849903;14052.858;648.841910326404;3.487;0.162483845350837
48;881.696;40.2924737885408;14107.53;645.51531964783;3.518;0.125841169733923
49;895.165;30.9910720208193;14323.735;497.662529476558;3.457;0.0760328876210744
50;874.698;45.9788794556812;13996.501;738.475391038169;3.493;0.181220859726466
51;860.764;51.3169572753505;13770.014;819.748161561836;3.538;0.186911743879293
52;879.408;33.1909857642147;14074.129;530.905607419145;3.507;0.178384416359723
53;901.91;39.5671664388523;14428.956;632.547421561368;3.422;0.0995791142760214
54;882.605;66.778628954182;14116.9;1065.86190331583;3.482;0.245022447951196
55;863.146;52.1815147729538;13812.614;832.25584884942;3.534;0.246381817510951
56;904.511;33.5498177193231;14470.247;536.391192303711;3.41;0.1106345334875
57;863.412;56.8701374712615;13816.482;907.613326541675;3.573;0.223698457750603
58;873.332;35.525308950099;13974.88;566.720202410362;3.465;0.119184730565624
59;867.59;33.7038428076113;13879.437;542.97644766693;3.515;0.12839392508994
60;878.012;26.5083589835336;14047.07;421.939370123184;3.459;0.12161003248085
61;876.486;40.6874747803291;14025.476;650.345182241001;3.487;0.16498787834263
62;875.619;46.6029169580604;14010.526;747.417747116014;3.489;0.201019899512449
63;874.793;36.9567628587805;13997.788;592.772688065157;3.502;0.120648249054848
64;864.288;45.3421598074054;13829.989;720.96953090195;3.505;0.155579561639703
65;863.835;45.5264765274043;13819.338;731.761522967714;3.524;0.165420675854024
66;889.772;68.3749428957707;14235.841;1093.69192603264;3.457;0.193341666487058
67;891.059;56.6781551305253;14260.141;902.906291377443;3.443;0.18628204422326
68;886.342;16.4507074619864;14179.963;263.21598925785;3.459;0.124535135604381
69;878.998;36.6315925943663;14060.1;587.340696580759;3.521;0.214123795968595
70;871.671;40.7683657877043;13949.336;651.913799228052;3.492;0.158606431143252
71;884.319;39.8660598630005;14149.5;638.266117540318;3.495;0.204364869779515
72;894.304;27.6239570662839;14306.637;444.103527818724;3.453;0.111628849317736
73;894.343;27.4998516541418;14310.974;436.772273598164;3.426;0.102975725294817
74;892.209;15.4580066308639;14270.253;246.036489084414;3.383;0.0648151216923687
75;905.883;20.9394360239195;14494.52;333.975177790176;3.384;0.0984073168011134
76;906.861;40.6831270799138;14511.677;647.33234853586;3.424;0.151076139744158
77;905.44;34.9290867329799;14491.835;555.582777293316;3.389;0.0594053869610895
78;898.505;41.9858000400173;14374.872;677.357786871914;3.423;0.140217687899926
79;908.834;40.911876319717;14539.328;653.461724782752;3.39;0.145396010949416
80;895.913;28.84479538842;14336.599;462.320658817068;3.421;0.0933220231242127
81;885.574;23.65401538852;14168.788;377.259880846073;3.435;0.0980051019080066
82;880.352;16.8405729118698;14086.142;271.432212377174;3.491;0.128409501206102
83;885.287;22.4021217968346;14167.396;356.242268132287;3.426;0.095099947423756
84;889.251;17.5669191664353;14223.691;280.478521546607;3.423;0.109457754407826
85;873.071;47.3770128754464;13966.426;761.998834752376;3.527;0.220093162092788
86;888.114;50.5716237034199;14213.404;804.646319437288;3.48;0.166132477258344
87;888.901;57.6665673419183;14223.808;921.347048215827;3.442;0.181151869987584
88;883.292;44.5562634878636;14130.299;714.074152570259;3.485;0.139731886124808
89;873.091;43.7363566040876;13971.968;701.533917281271;3.485;0.167167580589052
90;878.501;46.6427928945082;14055.118;743.645124448523;3.463;0.184989188873302
91;871.205;41.2775993124616;13940.179;664.165626563884;3.511;0.166820262558236
92;852.964;42.6519446684437;13644.795;679.633814495035;3.563;0.184881042835658
93;871.746;51.7882071904381;13951.715;827.985609660591;3.499;0.185334832128229
94;862.473;45.6230682988357;13796.857;731.651721272497;3.591;0.230410503232821
95;876.929;42.1002226716224;14027.956;673.113430354821;3.519;0.155077400029797
96;890.384;27.6771187806826;14250.339;437.188348940113;3.441;0.11352973178862
97;875.406;24.2755404471257;14004.894;388.131847629095;3.484;0.0818779579618189
98;865.308;35.9392701094505;13845.629;573.978747593522;3.492;0.158354033734536
99;870.884;45.3920810714814;13932.533;725.507046596394;3.507;0.22812496575342
100;880.078;30.7759122691746;14083.037;491.185463853515;3.545;0.188321533553645
101;869.53;34.4424630362007;13911.245;554.497040014664;3.533;0.196979694384974
102;872.111;66.3604568172941;13955.664;1060.89018635483;3.515;0.294898287550136
103;865.29;28.8187445944511;13839.655;457.196201761349;3.536;0.121507201432663
104;880.91;33.1264103095993;14099.245;530.785849740769;3.468;0.175886326927362
105;895.125;32.6665269809932;14316.734;519.965992026372;3.398;0.139771241677232
106;890.669;38.5175664989341;14255.384;614.541085432022;3.447;0.114372199419263
107;907.632;51.6177507840059;14521.035;823.774452617349;3.412;0.187445992221763
108;874.69;44.9881862270501;13998.057;716.357797152374;3.497;0.131988635874459
109;871.783;28.6869406002108;13942.728;458.223592338973;3.489;0.0957548954362125
110;888.486;30.7829489165619;14217.87;492.651532160427;3.441;0.122592821975826
111;893.73;45.3135807457308;14299.779;724.669677348927;3.447;0.145330657467724
112;877.515;50.6019954646067;14040.657;812.733071851378;3.488;0.203558345444238
113;881.675;60.5610967948904;14107.799;967.014997758018;3.534;0.214112120161375
114;888.47;53.1208060932805;14217.61;850.317461869435;3.468;0.192655132296026
115;896.147;51.7999386196547;14336.439;828.113246548467;3.448;0.258874486962306
116;903.83;34.6456730343013;14460.305;554.977107946747;3.423;0.130923641868057
117;888.398;49.7457561607028;14216.481;792.697466748184;3.438;0.198534631739647
118;866.279;56.6411335426811;13858.788;904.180707832209;3.533;0.185313248312142
119;887.885;37.5374885281409;14204.044;598.363173619475;3.411;0.117596768663086
120;883.688;37.7257630274044;14140.203;604.49953690718;3.472;0.138621787609308
121;896.804;64.3965608087904;14350.461;1031.35609145872;3.42;0.228648201392448
122;891.123;58.9438549893041;14253.777;943.012029160271;3.453;0.257800310317886
123;907.988;44.2999893453714;14532.209;710.681652787656;3.37;0.173031788986869
124;894.58;30.6982657490639;14312.002;484.775338848887;3.452;0.0911921049214373
125;876.914;53.0225424135837;14028.615;847.651382872114;3.477;0.218268183664051
126;891.906;46.3469559302449;14273.605;735.695733768376;3.495;0.216437057825132
127;911.406;72.5986524943822;14583.313;1162.58213192061;3.363;0.200302271579719
128;912.953;61.7470313537431;14607.449;988.570797904243;3.389;0.19305180651835
129;879.95;55.7430293400025;14076.967;887.664030791472;3.515;0.22186707732333
130;875.694;41.7002981284299;14012.018;670.850939431424;3.526;0.181835090122895
131;910.181;58.383580645587;14561.974;931.825591118885;3.389;0.21125576915199
132;896.289;49.9861981850985;14341.913;797.230997328241;3.443;0.190107864119291
133;872.462;52.5498745574125;13958.213;845.720887350572;3.56;0.236262565803393
134;898.314;44.4225627806411;14373.145;711.224477253821;3.436;0.123466594672409
135;870.872;30.4981221717008;13935.564;489.25622398082;3.521;0.10064293318457
136;874.124;37.5952308677542;13987.389;603.550508051259;3.51;0.127357763799452
137;875.983;46.3503967728456;14013.716;738.910180809555;3.485;0.176139149538079
138;866.988;37.2106935705346;13870.309;594.515757124269;3.548;0.14330387294137
139;868.7;40.5767384100792;13901.894;646.530516591422;3.551;0.180579622327642
140;898.32;41.0062775681954;14371.008;658.483254134803;3.42;0.108258948821797
141;869.509;65.0918918837061;13912.154;1041.18249501422;3.571;0.227176143113658
142;866.94;48.7649509381493;13873.759;783.300333147519;3.557;0.191209309396799
143;893.536;57.3820484472266;14291.877;921.162506847127;3.414;0.203676213633316
144;894.003;35.6957527025237;14305.737;569.690102618111;3.403;0.109640321050237
145;862.809;26.8139070073737;13805.657;425.846566571761;3.557;0.160190511579186
146;838.048;50.2604826479002;13409.135;805.751578034477;3.666;0.277568009684121
147;866.693;66.4902433519381;13868.1;1063.57923313692;3.507;0.218084845874261
148;864.558;67.829042275415;13831.445;1082.24681901356;3.539;0.202556165050577
149;862.503;46.4306452787377;13801.057;743.384270374975;3.554;0.137564530312148
150;871.862;29.092724107589;13949.015;467.535959371066;3.523;0.143530484566859
151;882.234;22.0726601024877;14115.348;351.602980072763;3.496;0.1123565752415
152;875.993;17.8579819968555;14017.593;286.96788026022;3.525;0.140801278403259
153;870.763;31.8292924992083;13927.116;506.603019517246;3.542;0.133850663054009
154;878.655;44.3924879343351;14060.39;706.437982741624;3.494;0.180177690072871
155;875.693;22.4518516162937;14013.485;365.171927049574;3.528;0.0798498591107053
156;864.596;36.7068432856895;13828.549;589.724510402107;3.62;0.150465942990429
157;865.001;51.7238719451699;13844.397;828.533471056522;3.55;0.167272233200855
158;875.18;44.9730990704431;14002.884;723.386278307866;3.501;0.197000000000001
159;877.725;41.6523839053665;14041.279;666.264490115593;3.486;0.197291662266807
160;875.457;28.9154640460763;14013.327;459.943796806662;3.489;0.126210142223198
161;864.93;31.884478041831;13832.174;506.299599924793;3.561;0.146249786324628
162;860.785;35.7248550032022;13774.984;570.828267768836;3.614;0.157619795711071
163;866.631;46.5044319285826;13866.483;743.311427869246;3.552;0.186965237410588
164;864.772;37.1825439689069;13837.86;598.861468354811;3.54;0.200748598998839
165;877.72;25.5614025436783;14037.509;408.151464690445;3.509;0.103580886267696
166;875.563;24.481018381599;14011.61;389.221541104747;3.51;0.119163752878118
167;871.133;38.8220519936782;13938.158;620.504212907527;3.557;0.193858195596677
168;872.616;39.1509647901577;13965.152;633.018732247332;3.517;0.15244999180058
169;872.39;44.5808339984801;13960.837;715.586752644929;3.494;0.168949696655549
170;868.662;35.1769858856633;13892.692;563.02477014423;3.548;0.104192130221059
171;876.513;39.5279316559842;14025.307;632.871834213657;3.53;0.147241298554453
172;868.832;35.9522204599358;13901.629;575.726620705487;3.583;0.194012886169972
173;867.141;41.1206297252365;13875.953;659.846917338383;3.577;0.1948871468312
174;888.6;51.9779201199883;14213.418;823.753458454661;3.461;0.18544271352629
175;897.181;69.3638575123945;14358.906;1115.2343080286;3.468;0.200389620489684
176;892.356;29.4592393656017;14276.112;472.13104881593;3.485;0.105190303735626
177;881.447;28.1066590152601;14106.838;453.571733793019;3.514;0.170070573586374
178;901.658;60.7781891470976;14428.03;973.670264483802;3.418;0.190724932822107
179;889.547;39.0144978309378;14228.279;626.372874387922;2.691;1.36001801458657
180;199.684;8.58572443070468;3180.838;143.064978579659;4.234;0.410078041353107
181;194.303;12.3670643646746;3109.646;199.358061898685;4.07;0.303578655376176
182;192.185;12.4079952047054;3075.573;200.05009702822;4.105;0.379822326884559
183;199.509;12.3698580832606;3188.366;198.2502298208;3.926;0.372322440903031
184;197.383;14.2250814057426;3158.112;228.120135621569;4.207;0.356904749197892
185;192.823;10.7682766030601;3086.59;173.092865248694;4.528;0.841900231618923
186;190.678;13.8241627594584;3054.936;218.774102909828;4.131;0.488353355675988
187;186.315;10.7122576985432;2977.227;170.901819010206;3.852;0.449128044103241
188;195.759;12.5735607128611;3133.257;200.427788445117;3.788;0.445865450556559
189;193.942;10.6773665292522;3101.874;169.04871210394;3.885;0.399030074054572
190;195.599;11.3769709940744;3133.416;180.080595745351;4.138;0.830021686463672
191;200.297;10.7694679998594;3200.966;172.604815066092;4.118;0.348935524130172
192;201.408;12.1763359020681;3223.329;197.075039842694;3.889;0.367979619000832
193;196.104;12.5068542807537;3136.747;197.774231893325;3.806;0.251602861668938
194;193.581;9.81949739039647;3099.5;150.289846829367;3.87;0.366769682498429
195;188.494;9.50107804409549;3012.503;149.994434566752;3.675;0.166988023522656
196;202.523;14.5808854669393;3243.471;239.051653223722;4.083;0.447125262091057
197;203.793;13.0221358079234;3259.279;206.124206557603;4.109;0.322380210310752
198;196.296;13.5627483940388;3141.254;217.822080111272;4.068;0.273342276276464
199;197.087;11.4721733337671;3158.883;178.686728105356;3.996;0.283485449362046
200;197.72;13.058138458448;3160.52;202.610247272944;4.149;0.261245095647749
201;197.805;16.7281907270333;3162.657;261.218640914083;4.02;0.297691115084067
202;201.303;9.20066742144299;3222.742;152.668231587331;3.895;0.409273747020251
203;193.903;13.0911741642988;3099.24;211.205057562548;4.043;0.344239742040338
204;198.696;14.8215999136395;3179.118;238.263063557909;3.971;0.174267036469892
205;198.307;18.44809152731;3174.708;295.740460769241;3.997;0.292268711975815
206;194.498;15.4450016510199;3111.935;243.683867387646;4.185;0.377339369798586
207;196.804;9.86933553994364;3148.96;158.992296417146;3.986;0.351260587029065
208;194.1;12.5649608037592;3104.797;199.258393953681;3.99;0.27924899283613
209;196.303;16.4530319698226;3139.724;261.510889761788;3.763;0.220410979762799
210;195.196;15.0325009230004;3123.726;246.986249544375;4.078;0.317420856277593
211;198.394;13.1515772438133;3173.206;208.118980595234;3.862;0.275963765737456
212;191.502;15.8847957493949;3064.751;253.951050970451;4.114;0.302132421299009
213;195.838;11.3658697863382;3133.222;181.103619776089;4.034;0.174022986987336
214;195.953;13.3071725396493;3136.329;213.329532107032;4.129;0.403421615682648
215;199.409;11.6273638026856;3186.908;184.051691152243;3.938;0.355268912234098
216;201.501;11.347648611056;3223.501;181.388802270146;3.964;0.221774660410071
217;202.599;14.3946993369091;3251;233.33956441204;4.222;0.232198191207435
218;190.992;14.2337941533517;3049.372;223.13733187434;4.033;0.280465684175445
219;188.614;18.2784672223906;3019.212;293.082180788939;4.107;0.309388105783013
220;195.497;16.3799591269329;3125.539;262.631493140103;3.879;0.31567229843621
221;189.899;11.7570527344228;3038.887;191.451100809054;3.937;0.254795996828832
222;185.607;14.4175726459063;2971.007;227.221888824552;4.008;0.225379679651919
223;199.997;11.5631414849073;3202.352;185.167213123702;4.147;0.365268394471789
224;198.788;15.2480266264195;3175.802;241.564148987385;4.042;0.186697616481843
225;195.3;14.4883698185817;3126.198;231.777166640722;4.2;0.450000000000001
226;193.117;10.6603996641779;3090.753;170.064840578536;4.181;0.304973769363856
227;201.296;20.4815713264389;3221.939;327.7178900045;4.253;0.517359642801788
228;190.395;13.0769409649199;3045.017;212.270109579757;4.302;0.404197971296249
229;195.303;7.50257295865941;3131.037;119.917198353707;4.316;0.311871768520326
230;193.702;14.2535425771982;3092.113;228.283403165899;4.308;0.454814247797928
231;192.71;13.6967959757018;3081.764;218.655382975126;4.157;0.289034600004901
232;188.28;13.0893032664074;3014.094;207.251581137516;4.186;0.364313052195498
233;196.215;13.7392032156162;3140.645;218.052721893127;4.26;0.244458585449555
234;197.999;16.6569033436592;3166.571;266.601377245126;4.245;0.344710023062876
235;195.703;16.5065629674985;3131.169;260.654741121272;4.146;0.336784797756671
236;184.303;15.237660614412;2948.543;244.789311084034;4.125;0.347972700078614
237;198.896;11.3361062098055;3184.917;186.139251317394;4.148;0.245837344600041
238;203.405;12.1718628401736;3252.369;194.053290487436;4.204;0.313247505975709
239;200.299;10.6509468593167;3207.177;170.050572186626;4.212;0.202721483814607
240;199.302;12.1619519814874;3186.247;190.385443563834;4.259;0.506230184797397
241;188.296;9.8170578077139;3011.339;155.98226838011;4.423;0.363787025607017
242;203.702;10.0737965038015;3265.535;158.326923184292;4.114;0.529531868729353
243;204.796;10.6742973539246;3273.541;163.45563425284;4.534;0.641999999999998
244;196.303;9.12481566937127;3140.341;147.904129925431;4.303;0.478101453668572
245;194.303;11.12449374129;3108.852;175.539953218638;4.483;0.629699134507893
246;196.785;14.272068000118;3152.37;225.357617355173;4.572;0.780074355430302
247;197.104;14.9376144012355;3152.303;238.737932765202;4.29;0.676771748819345
248;206.083;14.4502221782226;3292.743;229.826969481397;4.294;0.397899484794846
249;188.015;14.542309479584;3013.847;234.987179822639;4.901;2.00515560493444
250;199.905;15.0900372762959;3195.278;238.88505774954;4.315;0.587864780370458
251;194.092;11.6295329226928;3108.141;185.184289044728;4.439;0.620925921507551
252;193.908;13.2152281856954;3100.251;214.712342842702;4.475;0.501961153875479
253;198.897;13.0283406848304;3187.46;208.114367884581;4.36;0.348912596505188
254;199.102;10.9298561747172;3179.723;182.440704561781;4.375;0.344913032516893
255;194.897;11.5150111159302;3121.037;183.210340486009;4.001;0.241472565729521
256;194.702;8.35579415734939;3117.039;129.586461055929;4.11;0.331602171283599
257;192.797;12.8692268998571;3084.451;207.971392044675;4.357;0.642137835670814
258;195.706;21.3154353462463;3128.401;331.801541541019;4.139;0.559239662398865
259;197.398;16.0217881648708;3155.543;254.381312326593;4.246;0.360255464913443
260;196.994;14.2404214825266;3152.516;228.721824677931;4.369;0.526791229995339
261;197.611;9.28634206778909;3163.172;149.56356119055;4.073;0.411826419745023
262;192.601;7.73517608073684;3085.696;129.026755767929;4.058;0.22116961816668
263;199.605;13.0738718442548;3187.061;208.472642879113;4.466;0.397849217669214
264;190.198;15.6406162282691;3042.567;249.916277743169;4.402;0.286209713322248
265;206.296;12.2050237197642;3301.721;195.659695770488;4.455;0.25823438965405
266;196.499;15.8764318724329;3149.399;254.32326808414;4.537;0.277382407517128
267;199.601;10.4369022703103;3189.729;171.970601118335;4.547;0.2960760037558
268;201.804;10.7129708297931;3231.77;169.05539411684;4.355;0.484463620925251
269;202.399;14.7736572655522;3236.995;238.749599004906;4.322;0.277265215993625
270;199.284;16.9656106285629;3185.133;274.276232876627;4.358;0.436343901068874
271;193.81;13.0892452036013;3103.882;210.188833328505;4.317;0.289967239528884
272;203.601;15.8836705140844;3260.601;248.267115440204;4.384;0.35516756608678
273;199.102;10.0894864091291;3183.35;158.298257286682;4.609;0.855715490101704
274;202.159;8.74213068994068;3233.439;134.683471996369;4.359;0.497341934688801
275;198.738;10.5891952479874;3184.304;171.902769448325;4.594;1.73281966747841
276;195.903;8.66826401305365;3129.658;141.924450663008;4.357;0.472356856624303
277;197.895;9.85440028616625;3165.111;160.495913745479;4.316;0.276846527881433
278;191.212;10.4644768622228;3057.887;165.902686057229;4.395;0.306667572462415
279;196.682;13.0844111827778;3150.324;207.676872482229;4.343;0.349887124655942
280;202.609;13.4639061568327;3238.839;217.316611074708;4.479;0.439214070812844
281;186.5;11.8607141437605;2988.122;186.953830279035;4.351;0.663015082784691
282;193.498;9.17966535337808;3094.066;143.647796516347;4.283;0.519038534214945
283;193.603;13.9824340155782;3099.857;225.191804959681;4.366;0.436948509552322
284;203.207;12.1282884612795;3247.316;193.467490095883;4.339;0.383704313241328
285;191.788;15.8315992875005;3073.498;250.246107174522;4.297;0.333198139250513
286;198.116;13.7391908058668;3167.377;216.79531388155;4.267;0.402717022237696
287;194.063;10.7524741803923;3105.011;172.51696643809;4.35;0.391612052929932
288;193.226;10.3970593919631;3091.923;169.657982308532;4.212;0.319524646936664
289;201.905;15.9360347953937;3227.391;258.454081161435;4.359;0.245293701509032
290;194.878;9.97515192866759;3121.937;163.241384584306;4.436;0.16823792675849
291;201.221;14.3904165679804;3218.942;225.272529918762;4.806;0.406551349770235
292;204.387;13.4480965567623;3270.609;215.625517852125;4.587;0.272508715456936
293;195.409;11.3325905687978;3122.758;181.744427799033;4.304;0.223033629751203
294;200.299;15.160432348716;3205.872;241.745787255948;4.418;0.291609327697176
295;195.998;17.4850300543065;3137.07;282.135148147131;4.521;0.532943711849573
296;190.891;12.6273262807292;3053.581;202.406488109934;4.382;0.342660181520996
297;195.81;15.6899662204863;3134.152;251.693155957804;4.569;0.277649059065584
298;189.298;9.180703458886;3027.863;143.627690926917;4.359;0.208300264042065
299;202.798;15.2103719875618;3250.176;248.945128379723;4.625;0.354774576315718
300;201.092;12.9080841335962;3213.447;205.944922056837;4.475;0.393071240362346
301;203.612;15.099099178428;3255.393;243.055677903228;4.639;0.410303546170397
302;203.202;12.8490963106358;3251.241;203.769703658311;4.36;0.355105618091295
303;202.897;13.0741524008254;3244.94;206.633723143142;4.316;0.45253066194458
304;193.501;14.542054497216;3101.427;231.085378769403;4.314;0.367401687530142
305;197.695;8.96600161722047;3163.53;148.766081752528;4.384;0.367999999999996
306;195.406;11.486135294345;3122.298;188.674874946298;4.279;0.40746656304536
307;194.996;7.74727590834342;3122.948;120.98546266391;4.308;0.617556475150246
308;200.401;15.725437005056;3208.509;246.696794079291;4.578;0.470102116566177
309;199.597;8.29600753374779;3194.973;130.059085038292;4.247;0.391357892471845
310;206.098;11.6337696384277;3296.47;186.169403178927;4.37;0.45431266766402
311;201.502;10.6806383704342;3224.144;169.184509113571;4.6;0.350513908425904
312;198.197;12.4531241461732;3164.342;199.759448577537;4.488;0.463611906663315
313;198.584;13.8043299004333;3182.744;215.557605906179;4.353;0.676329061921784
314;201.307;11.1980463028156;3217.804;174.993928820402;4.266;0.323857993571254
315;193.506;9.2790120163736;3096.409;148.628823883536;4.929;1.7052944027352
316;201.504;8.77885094986823;3225.743;140.313630417706;4.417;0.38390233132921
317;199.807;16.7792431593325;3192.009;271.31107380459;4.293;0.270149958356476
318;192.091;15.6729706501351;3077.84;248.243602656743;4.343;0.422280712322976
319;198.405;14.5696295423047;3173.084;233.060647394615;4.478;0.588910859128955
320;195.483;19.0223663354485;3126.225;307.130020292712;4.064;0.335803513978044
321;192.217;12.2073445515395;3082.575;195.635981161445;4.434;0.474872614497826
322;196.992;8.51649552339468;3146.47;138.446586234535;4.524;0.776546199527112
323;197.606;5.98391209828462;3162.782;100.278001057048;4.321;0.350098557552021
324;194.002;8.14408840816423;3103.807;130.290270860872;4.164;0.281112077293033
325;201.005;10.9398457484557;3213.991;172.211433734806;4.368;0.358825863058948
326;198.852;16.23850904486;3185.103;261.427448560779;4.263;0.382048426249867
327;201.151;16.7129736731676;3217.509;275.052292099155;4.627;0.381341054700372
328;195.793;15.30834416258;3132.09;245.234231582794;4.213;0.50858725898316
329;196.894;12.8883452778079;3152.997;202.778428983454;4.121;0.452248825316327
330;199.798;8.4595742209646;3192.853;136.263052442692;4.04;0.287262945748302
331;193.397;10.8209713519627;3099.657;176.06361850479;4.208;0.274510473388538
332;199.816;12.3554604932399;3190.542;193.269368747347;4.408;0.355015492619682
333;191.497;23.4692816464415;3064.258;372.937690098493;4.318;0.386310755739476
334;194.193;17.1471671421256;3111.087;272.155471378032;4.191;0.317063085205461
335;189.496;12.3432128718577;3032.045;201.107111522689;4.169;0.34984139263386
336;203.009;17.9468233679392;3244.832;284.721901012203;4.382;0.432129610186565
337;193.796;15.3289518232656;3108.049;243.329107032017;4.129;0.311237851168532
338;193.802;13.3552699710638;3094.736;211.764501189412;4.126;0.266165362134146
339;196.7;11.8881689086255;3146.8;188.116417784316;4.188;0.305542141119677
340;190.701;11.9545484649148;3053.998;190.731986294914;4.148;0.505248453733407
341;195.108;14.5339876152419;3119.115;225.157111912987;4.439;0.519874023201774
342;199.496;11.9487289700619;3190.942;190.775048148331;4.38;0.313464511547958
343;193.197;10.7571948481004;3091.942;172.683329930831;4.144;0.20279053232338
344;201.795;12.9764565656419;3233.931;212.889092179476;4.392;0.358825863058958
345;204.911;13.964132232259;3276.268;224.986536654974;4.394;0.288416365693764
346;201.398;9.1405544689587;3218.364;147.632894383335;4.574;0.352851243444025
347;193.201;8.67984613918972;3093.235;139.589196448008;4.317;0.401647855714427
348;192.801;12.1556813465966;3081.723;190.67695770858;4.216;0.274452181627332
349;198.589;16.1169950362964;3176.907;256.45900280747;4.264;0.466801885171855
350;192.001;8.38452914599251;3075.635;131.1294876258;5.053;2.00512368695799
351;196.808;14.1590174800372;3146.012;226.124460366406;4.271;0.384667388791927
352;195.304;13.7526697044611;3129.674;215.936529804478;4.292;0.374454269571068
353;197.196;8.52407672419721;3154.73;128.891815023299;4.299;0.446014573752921
354;200.8;10.86269855975;3214.781;181.509686873725;4.489;0.281405401511768
355;201.395;9.54851637690324;3221.3;151.527674634049;4.458;0.47355675478236
356;188.608;7.66227746822051;3011.634;118.405484433792;4.149;0.265949243277735
357;197.798;13.1638617434248;3169.685;213.142850935703;4.242;0.326582302031199
358;199.197;17.940494446921;3181.457;285.800304690185;4.298;0.335165630696226
359;196.884;18.7632913957017;3158.236;300.914270356197;1.229;1.88999179892401
360;794.374;50.9689109556012;12717.288;814.545647791442;383.877;37.9879752158498
361;791.572;63.0820888683958;12666.229;1013.86305405068;798.289;71.6261237887412
362;807.127;58.8800005180033;12915.52;935.39670496532;1203.363;105.713868725913
363;816.706;71.6297184414384;13066.421;1151.24159679408;1608.365;171.196443844492
364;841.008;81.6911881172013;13456.946;1306.57179706437;1989.497;215.542923198605
365;856.802;52.5578783437833;13709.538;839.739523480963;2355.168;244.284041631866
366;871.698;53.6960843637585;13946.377;857.353716152766;2715.908;288.666631040026
367;913.321;75.2103585219505;14613.036;1199.96798302453;3048.23;328.50575020842
368;920.451;71.2380486046572;14728.416;1146.03417441369;3390.607;368.778852703075
369;933.217;61.0551144540712;14929.558;976.601591159894;3710.844;406.712161195111
370;920.616;57.655686311067;14732.25;921.724593780608;4028.776;419.308955334842
371;911.072;45.2477970292452;14576.235;724.494297620753;4349.924;424.173538736205
372;917.209;43.4235890847345;14675.673;701.162379852928;4688.915;432.139011690682
373;925.906;38.8328907499839;14811.688;615.945600841519;5010.798;450.498116928361
374;943.495;36.349233073059;15098.934;589.424052583522;5325.474;463.536516171053
375;938.505;80.1425068549757;15015.551;1277.95144604518;5623.854;514.5850708328
376;945.206;70.5910116374609;15121.392;1134.23309328199;5946.972;546.433432538671
377;947.031;38.128683546644;15153.41;610.053972776134;6243.61;580.615702336766
378;961.675;49.0991629765737;15389.322;782.774982658497;6546.874;533.081840343507
379;962.692;41.6037163724584;15404.146;663.169333265725;6808.801;526.915545157868
380;953.583;45.3709378457129;15253.225;726.8617228779;7097.86;562.776967439141
381;975.393;51.2134980351863;15608.575;820.629526159616;7382.23;557.763443101103
382;988.018;56.9048867497321;15808.895;910.311532600231;7681.368;589.385296148457
383;968.501;68.1937222110677;15495.895;1090.85033444787;7944.273;555.430861909027
384;967.622;54.6133219645168;15479.634;872.324888733506;8235.322;572.23742150965
385;961.247;63.4809332083241;15380.745;1014.92931024037;8550.183;562.180821427585
386;967.813;85.7175675168161;15483.003;1369.21817868482;8862.557;564.671985387125
387;968.856;90.7747116988013;15503.315;1450.78352609375;9139.35;598.163648979113
388;987.103;94.025141643075;15792.464;1505.74598412347;9437.9;586.466788727186
389;955.487;93.7442408951087;15291.78;1498.78540718145;9676.416;563.294160828963
390;970.413;64.1227767723777;15522.217;1027.69794327957;10015.375;619.753710763366
391;955.205;92.9752172624513;15283.304;1487.33730294915;10287.553;605.062336078708
392;1024.671;72.4520346781264;16397.521;1166.11769546178;10531.577;623.601100080009
393;999.044;61.0187097864242;15983.887;973.519805376876;10798.994;617.475785487965
394;983.485;44.1559507314715;15731.159;709.506480639185;11076.025;652.926310424881
395;963.498;32.8768884780815;15419.067;526.962584308418;11379.262;673.741503720852
396;965.222;27.8756584854984;15445.728;440.1263133192;11626.819;670.723741989965
397;957.495;32.4274803985709;15317.197;519.394209922456;11923.985;697.100254658551
398;972.682;54.4596714643017;15564.499;872.758816483075;12206.601;715.343633220423
399;975.613;58.0847315651862;15609.496;928.986659669573;12522.145;795.849556602862
400;960.983;66.9295888303534;15373.007;1071.30370071282;12841.434;808.123771339528
401;953.513;60.9744382589929;15256.417;979.261240916303;13124.011;856.890198303683
402;968.641;56.7356911388249;15504.968;907.498573010465;13407.157;823.638845405547
403;966.449;44.3876959190307;15462.487;711.033145951011;13702.289;877.204021917963
404;971.911;58.536984283441;15548.657;936.995894975548;13973.354;850.331638741017
405;977.804;56.5089662266113;15643.751;904.737232907411;14303.95;864.298399986919
406;969.581;56.8016393161301;15511.312;910.269554778105;14615.609;875.52537664478
407;964.091;54.5553534403396;15425.737;870.467552365315;14881.17;891.432431146654
408;969.59;51.8207915802126;15515.057;828.2809838219;15151.555;907.628772100714
409;958.101;56.7714598103656;15332.217;911.111274631689;15426.852;924.120062944179
410;961.929;74.492919052752;15387.239;1192.29695399634;15767.726;1008.31529128739
411;959.878;78.5432415679424;15353.851;1253.23625290246;16079.201;969.00304769852
412;985.737;66.482802746275;15775.813;1064.71972236876;16312.311;980.516941469604
413;983.273;62.0986768055499;15735.657;993.034121196751;16670.393;1029.05080369291
414;976.2;55.2277060903295;15618.896;882.194007236522;16911.552;1033.79888200557
415;970.241;74.2864149693607;15522.668;1191.18842117273;17187.713;1050.29931545299
416;947.649;53.6731093658651;15161.183;859.649470308132;17498.847;1049.27858392376
417;945.398;51.6370107190551;15128.465;829.37335965473;17816.793;1068.34309967401
418;958.556;61.9410495874885;15335.491;990.116073422237;18107.674;1084.26288514549
419;951.169;52.2430520643633;15215;833.864620103358;18505.397;1141.34373185337
420;951.197;51.9236308534003;15217.044;831.823374631877;18736.199;1087.52193605878
421;943.101;52.7573423231313;15095.106;838.772863786219;19044.948;1148.4713290179
422;960.192;50.8894747074489;15360.856;821.503779823335;19286.914;1173.25281772686
423;970.574;44.3249553186496;15532.687;708.561509469016;19602.055;1195.10117507472
424;965.119;40.5947418885735;15438.387;644.756158389372;19958.217;1216.81552716961
425;958.009;47.1761915482764;15329.848;758.23606975405;20281.529;1189.14240336006
426;961.11;69.2445388460349;15378.453;1107.37924019779;20504.07;1238.70859335843
427;964.408;88.7130585426957;15425.022;1419.46821330948;20725.368;1230.09931635464
428;936.887;48.0505121824956;14996.095;765.053533215218;21101.941;1252.44933178516
429;953.794;50.3591606760893;15255.622;806.877553706907;21412.178;1338.38572684264
430;945.576;50.4385160765084;15131.61;806.143395085557;21723.034;1357.33698082827
431;945.615;50.854058490941;15136.057;813.19001721675;22040.379;1411.71950802169
432;965.011;65.5119287534714;15439.249;1048.72289917257;22397.818;1392.48185462359
433;974.465;42.5415837152285;15587.66;683.560238662328;22553.972;1309.82712282043
434;977.495;60.138509667265;15636.31;958.355357745785;22880.641;1319.27848694247
435;984.025;45.3087354160327;15748.886;723.545978693848;23213.149;1344.80755913593
436;971.882;35.6238863124135;15547.816;570.824362815777;23469.511;1433.88155789418
437;967.031;24.371224610175;15471.802;388.678376213564;23760.421;1334.43244161291
438;942.396;44.0800206896519;15077.056;703.901343715157;24104.395;1339.95723837182
439;943.014;43.8033334804572;15092.515;698.625286505573;24326.793;1424.51677260783
440;947.379;60.0470084933437;15157.469;964.396798122498;24631.703;1383.36493388439
441;992.689;77.168810078942;15883.701;1228.01186152618;24985.902;1346.96729261551
442;958.322;92.1637632478198;15329.835;1475.46057058294;25168.474;1386.79158149462
443;971.325;62.7262835261304;15544.997;1003.47940005813;25530.728;1354.70165917663
444;956.26;98.6069631415572;15300.07;1580.1834363453;25902.78;1402.23939497504
445;972.596;85.8520152588168;15560.359;1375.25733959466;26042.548;1400.12465553468
446;971.013;56.3130642124907;15535.795;905.917124998231;26422.231;1451.70774842219
447;965.261;82.0067338027791;15445.497;1313.80849537556;26706.758;1419.11949590438
448;983.116;80.8815014944702;15731.049;1292.83221257403;27046.321;1454.27426485837
449;965.926;67.7286666338584;15455.902;1082.13313494969;27282.839;1312.10223912208
450;994.173;44.3382990314249;15905.984;708.780842365228;27488.047;1477.83875616428
451;1001.694;69.2338593753077;16027.119;1109.70859423946;27832.934;1430.00007686165
452;987.522;40.6307956604356;15798.844;654.818767938124;28188.27;1483.78677389981
453;985.395;41.2352158354961;15765.133;656.768964827892;28338.647;1455.98154276803
454;969.339;51.5571875590556;15512.333;828.132229683699;28700.439;1510.74660467227
455;949.842;58.5551997349512;15195.167;934.22235432523;28959.406;1517.0506882712
456;957.382;71.1703102143002;15321.808;1141.34438227731;29275.321;1552.38225816623
457;971.066;51.0129803481427;15534.155;814.147832021322;29535.282;1481.81043257097
458;977.275;43.2796546312485;15637.615;691.243980896071;29807.244;1580.58799807667
459;988.795;44.2720691294163;15820.546;707.254023250523;30071.926;1508.73291845975
460;981.525;19.5240770588563;15703.392;310.053909596205;30400.344;1551.79331116745
461;963.885;59.0056460434085;15421.662;943.519020632857;30674.69;1560.13648456789
462;978.854;45.505538827706;15657.986;727.228657633938;30952.707;1579.98782132041
463;982.647;50.9374972000055;15725.936;814.869333748688;31291.536;1653.85307970924
464;970.576;48.4431586913975;15534.214;774.014855247602;31515.106;1608.69614776189
465;969.296;43.479131132072;15503.626;695.641064460788;31801.655;1662.16242182432
466;954.988;64.9553167646809;15278.127;1035.92106755338;32141.128;1555.81203912158
467;954.416;60.2926463509403;15272.436;969.123525823254;32379.479;1692.36272998103
468;993.29;61.3065934463826;15891.436;977.334790695621;32606.106;1554.24006946277
469;989.387;50.1355542604273;15832.115;804.069930270345;33023.163;1649.28026050784
470;985.905;56.2837636001712;15773.569;904.095457774805;33137.967;1564.18866272606
471;974.119;29.3232578169644;15584.226;465.921248500157;33623.182;1679.24560898502
472;966.273;42.0135535393084;15462.559;672.825644063173;33740.072;1592.6078845516
473;967.391;29.6223802048396;15475.739;473.230393707924;34171.305;1684.8072654533
474;960.228;48.6940589394627;15365.338;781.252129300134;34353.119;1621.54637606491
475;979.008;20.1805400324187;15663.043;318.065559155862;34729.383;1711.15887607224
476;969.571;34.7489425594525;15513.135;557.041757774972;34917.802;1718.27410553615
477;972.517;75.209646063519;15562.975;1200.64954769704;35173.001;1798.10999574789
478;965.799;32.0385678362805;15450.988;517.4082001051;35612.823;1681.00704293021
479;969.519;34.1997097794682;15516.711;549.787083068521;35812.083;1830.78076490914
480;980.715;27.800932808083;15684.843;445.457703919273;36127.324;1662.88990892484
481;977.684;34.1481352931558;15643.638;539.716437507662;36321.575;1636.53164499357
482;970.663;51.6366437813322;15534.024;827.040311244879;36527.879;1852.15558000648
483;1011.483;59.825287471099;16180.526;955.412014559113;36981.525;1666.26596283582
484;1005.441;73.6121076250353;16091.745;1179.30163252031;37119.047;1761.49094753317
485;986.722;57.1891045217502;15781.847;916.29031729088;37518.462;1703.36884008027
486;962.28;65.9051972153962;15402.785;1052.92578472795;37720.953;1688.35001019956
487;927.918;67.9932406640537;14844.264;1092.57317564729;37923.689;1665.30652802703
488;942.945;68.6348534273959;15086.453;1092.83520618659;38406.328;1719.02714183215
489;951.267;69.8688073534981;15214.758;1119.82206075607;38690.368;1875.81723144752
490;944.578;62.5349553130074;15118.459;998.423164138854;39034.194;1758.75246098007
491;951.789;60.5388695715414;15231.018;970.526996912513;39393.359;1909.89966380674
492;966.017;51.2511221438118;15456.648;817.408748702864;39527.134;1740.60408464526
493;968.205;54.0337581979959;15488.481;867.344612682276;39892.613;1926.48769111591
494;951.189;50.9933767169814;15217.002;811.034980550142;40176.61;1849.94264115402
495;968.695;33.4699349416738;15497.944;541.083109590259;40469.75;1925.8301299231
496;988.736;32.9057813157441;15820.867;524.830828001674;40759.941;1879.33612612249
497;955.664;56.7314318874451;15293.724;906.169170168555;41050.417;1804.40998566863
498;959.807;79.0823870466743;15359.673;1261.25570008663;41355.45;1997.13255441399
499;969.786;36.4650597695896;15515.684;583.428711792525;41649.863;1917.77983914754
500;957.294;72.9618691098315;15312.796;1167.82053659115;41955.118;2025.20013303271
501;949.578;65.7755569797762;15192.841;1056.36456416762;42335.389;2052.53841715293
502;956.154;58.6537946257556;15298.25;931.094612260225;42717.427;2061.99836864168
503;970.354;80.3878060653487;15529.968;1293.65844306603;42717.427;2061.99836864168
504;962.529;71.5392344731191;15396.838;1143.34150631213;43340.374;2158.29165611694
505;950.025;41.3425991563192;15202.409;657.544504994809;43493.586;2099.46339153221
506;948.172;44.7730027583602;15170.377;718.645994729612;43571.533;2090.41478396055
507;968.101;67.2858633666841;15490.234;1073.20254946771;44208.66;2223.40799787629
508;981.116;58.5929287883839;15696.053;936.304634016636;44283.85;2137.61020387737
509;947.777;82.604434511713;15164.027;1321.74552052997;44602.848;2119.34338660746
510;1000.938;52.127833026125;16017.805;834.085324834965;44926.625;2171.56532562227
511;1000.047;55.8272227591543;15997.658;893.880895520183;45088.471;2176.44850989596
512;1003.509;74.1133667363715;16054.64;1182.340009016;45495.538;2166.89645442882
513;976.061;46.8001167626733;15619.478;747.501102029963;45742.924;2211.0229653905
514;986.681;56.6652058056747;15781.193;907.548027545047;45907.711;2215.99515158527
515;978.608;67.2475713762248;15664.501;1073.97900640048;46316.354;2088.3609797933
516;963.347;81.6032682004839;15410.264;1307.96048980999;46574.056;2251.19547460993
517;962.569;64.2425565260285;15404.787;1029.66070183387;46740.26;2220.59541542355
518;951.22;48.7972366020852;15220.42;783.313501645385;47241.675;2099.44591393193
519;942.554;54.7626166650241;15079.254;877.436942272195;47501.095;2199.11652347601
520;956.248;81.4785414449688;15295.969;1302.90264146211;47676.353;2283.69398752132
521;968.453;47.5163561418551;15499.566;760.547218352653;48100.036;2137.59284303263
522;975.594;42.2978163029698;15607.116;682.055298391577;48364.171;2239.07727148237
523;948.782;50.5931374397762;15181.302;806.637070345752;48713.223;2232.56644955994
524;958.938;28.8390179444471;15342.209;462.100039351894;48979.084;2302.87167245672
525;958.586;34.8268247763152;15340.163;558.008086232621;49332.956;2307.58312774291
526;958.808;33.20950038769;15338.55;529.090840990494;49593.675;2176.94180232842
527;981.811;47.6303236289664;15712.174;761.19665729956;49770.511;2129.51461756656
528;963.682;32.1774041215261;15418.613;518.733553899294;50135.991;2283.13025492845
529;944.895;51.3957983204842;15117.292;820.984092961576;50494.771;2216.49450455197
530;952.097;35.8423129973499;15231.357;574.135405702365;50775.117;2387.3147996862
531;959.215;52.6982960350727;15346.623;841.008459315906;51133.782;2215.11881139965
532;972.871;37.4795919001296;15570.237;602.746753521757;51228.804;2282.33141005502
533;982.301;58.6408824029789;15712.943;938.920472074726;51697.682;2430.69282605936
534;980.494;68.1472580813041;15690.681;1088.54819643827;51974.447;2366.85342563097
535;968.516;60.2363925214616;15495.462;964.347351993043;52071.195;2435.66676050016
536;962.462;79.3330260106074;15397.798;1267.23179922065;52533.036;2247.71512914438
537;961.917;62.7056190544354;15393.462;1004.23695131971;52918.804;2409.8572164312
538;968.595;46.9087917665759;15499.403;748.396162537566;53017.309;2479.92016356761
539;976.38;34.4681133803443;15619.672;549.890955386579;21425.692;26304.2092553609
540;931.697;57.9192094300372;14907.759;927.960390754344;53880.318;2453.64068297617
541;981.469;60.57298200518;15704.193;968.657229974058;53980.614;2524.97753834053
542;998.195;62.9081789992368;15966.822;1008.2442945815;54169.022;2393.30080609113
543;1006.969;78.592034004724;16115.709;1254.94567371225;54658.711;2421.40593337208
544;1051.442;71.6899759799089;16822.976;1151.52911986803;54759.007;2462.15886032572
545;1100.208;81.2126366768128;17602.83;1303.85490642942;54861.125;2539.86067790046
546;1145.291;100.439903071438;18325.887;1602.87045975689;55054.746;2452.78427615307
547;1151.462;92.5834626485744;18421.618;1481.19304432478;55259.513;2614.19687526407
548;1181.334;90.7780273193886;18898.229;1453.85203560366;55359.809;2629.16883960863
549;1230.501;86.0893437598413;19687.607;1379.41744301744;55454.831;2532.13013660226
550;1240.713;86.7223123596208;19858.879;1384.50283605672;55651.841;2465.4037454886
551;1270.746;94.4976549127027;20330.835;1511.19145142669;55651.841;2465.4037454886
552;1317.839;93.3574404587024;21080.528;1499.94487437908;55651.841;2465.4037454886
553;1326.097;91.6627406365268;21217.259;1466.23229172224;55858.601;2630.46250006146
554;1364.705;105.179504491128;21837.686;1683.00252825244;55858.601;2630.46250006146
555;1344.313;144.187417623729;21510.099;2308.70303348634;55858.601;2630.46250006146
556;1406.732;136.803468289368;22505.296;2186.4089049224;55760.096;2671.42353195158
557;1427.783;135.760297071713;22847.812;2174.27737132039;55661.591;2708.18535921184
558;1469.586;115.928702071576;23510.66;1855.25162394755;55561.295;2704.86589506122
559;1495.485;123.593115686108;23926.963;1975.8129370568;55561.295;2704.86589506122
560;1451.028;153.453291512435;23215.381;2454.55390533778;55658.043;2636.80416402923
561;1488.857;142.200944937088;23822.208;2276.38952848496;55658.043;2636.80416402923
562;1522.25;128.883605862034;24354.784;2059.24124999093;55168.837;2821.21003727884
563;1536.707;102.758129415633;24588.73;1643.83958946728;55168.837;2821.21003727884
564;1592.106;76.5491674938479;25472.981;1225.14871793946;55168.837;2821.21003727884
565;1573.714;85.0699111554719;25182.82;1357.72483818331;54973.584;2879.29678477305
566;1568.072;124.561743228005;25085.552;1995.36798324927;54880.259;2977.97910931719
567;1592.989;93.7320590246543;25489.926;1498.40246525557;54691.912;3130.95289105677
568;1597.242;104.973541409256;25553.263;1679.23472689823;54394.572;3081.49281175478
569;1613.004;118.45052234583;25810.068;1900.27921895595;54199.319;3086.15727421165
570;1635.057;95.612037950248;26165.106;1526.85354304339;54107.659;3181.16892475855
571;1646.743;110.437604107481;26341.687;1764.84469101988;53922.674;3331.33276389559
572;1655.101;106.841341104461;26482.337;1714.06861217428;53715.914;3075.07985502885
573;1640.681;107.445402084034;26251.587;1719.32416237349;53432.362;3166.93630211535
574;1648.422;103.528416659388;26375.27;1658.07769480812;53052.062;3212.48941746991
575;1636.083;118.449625752888;26176.74;1894.39737441223;52960.402;3271.88662865876
576;1630.894;147.890861867796;26096.485;2359.53233881309;52685.334;3425.39658736665
577;1601.404;204.979056061834;25620.474;3282.62482630044;52685.334;3425.39658736665
578;1659.598;95.6235000196097;26553.5;1527.61720463603;52588.586;3394.36264870198
579;1681.687;87.3693916712272;26907.992;1394.51518566707;52038.238;3599.10292157038
580;1690.895;79.6857301215187;27055.108;1279.17372760547;51948.213;3648.69778833236
581;1693.283;77.2594333463595;27090.811;1238.35233225806;51854.888;3650.52320279671
582;1703.135;86.0984525122285;27253.259;1377.12301702834;51494.526;3802.19800827419
583;1704.515;88.6218490271968;27267.545;1412.53339381587;51306.179;3757.10404672398
584;1714.979;78.7771213551243;27441.838;1258.45191658483;50937.407;3686.29530751147
585;1718.865;79.0747499838003;27500.522;1266.78514210404;50760.571;3769.046914087
586;1713.561;83.4816315664676;27418.966;1335.10300578786;50270.301;4363.31866773777
587;1725.897;66.8034803060486;27610.442;1072.12392800282;49002.744;6146.97734765667
588;1719.687;56.8798488130958;27517.401;915.22029928809;47180.521;8648.64798580503
589;1669.791;135.817607654531;26719.066;2167.33678344738;43114.597;11674.0775792352
590;1723.373;51.9053835454491;27570.874;829.720765151864;39050.142;14975.476719541
591;1608.265;328.121679053671;25730.744;5253.18528309101;33494.791;17194.620310138
592;1575.817;472.347621123469;25215.579;7558.83004123712;27100.664;17639.9645087637
593;1408.211;504.331895549945;22531.286;8061.27527438457;20912.797;18218.129596929
594;953.153;716.403742034476;15242.957;11468.8767555555;15665.213;18430.8278950822
595;936.383;753.829463526732;14981.822;12060.7707548372;12475.121;17221.8407757937
596;897.981;701.863844608767;14367.603;11231.9668339513;9489.558;16879.241306042
597;535.308;515.754281665213;8558.814;8250.0243759715;6761.879;17253.6139918456
598;342.97;436.048133008272;5487.624;6979.41607214414;5828.689;17478.2403361582
599;344.286;443.408336394344;5509.176;7089.29167896935;5138.898;15408.2140017835
600;343.848;442.877947019266;5500.76;7091.86012695682;4449.938;13340.9340010749
601;349.469;448.989737799206;5590.881;7179.34782339656;3650.825;10943.5483393479
602;341.736;446.634106449563;5470.583;7148.87772129451;2941.882;8816.74267310644
603;350.178;457.761169165756;5600.149;7324.30936022428;2166.72;6491.61000951228
604;336.886;452.195215016701;5389.176;7233.78390034178;1357.748;4064.35067723443
605;311.1;371.776498880712;4980.404;5941.5638643613;616.197;1839.90435110117
606;188.406;13.4059891093495;3012.135;216.078736124132;2.955;0.422072268693406
607;188.17;11.0430104591095;3009.817;176.001137612801;2.836;0.187467330487196
608;197.117;9.98318992106171;3152.663;161.232145185136;2.865;0.407976715021825
609;194.707;13.2645445078224;3116.501;213.703897552194;2.905;0.24183672177732
610;195.788;11.0103930901673;3134.009;174.750990008649;2.88;0.34061708706405
611;197.204;5.32442710533163;3153.847;86.3264508769018;2.937;0.276515822332108
612;192.026;12.0181822252782;3072.513;190.640846570194;2.897;0.232208957622226
613;199.781;11.1393127705437;3195.702;179.405730276371;3.047;0.251
614;195.483;11.7240104486478;3128.541;185.718548317069;3.042;0.469804214540484
615;199.214;12.1767731357698;3191.52;196.164960938487;3.115;0.340595067492181
616;202.613;17.34685334578;3238.611;275.614602241975;3.011;0.214823183106475
617;194.104;20.7843836569672;3108.647;334.950782684562;2.94;0.205475059313773
618;199.478;12.8784174493605;3191.156;206.891108083459;3.048;0.361712593090152
619;193.522;14.2778645462125;3095.336;225.856808628829;3.03;0.321372058524072
620;190.675;17.1166423401317;3049.603;271.340372633707;3.073;0.245399674001414
621;198.409;16.6343009771975;3173.438;265.320446094898;3.121;0.215334623319146
622;200.411;13.9238187649798;3212.179;220.86493440336;3.089;0.284936835105608
623;196.058;16.51151283196;3130.546;262.922418907176;3.066;0.296755791855867
624;196.714;11.658541246657;3149.647;184.934452877235;3.094;0.22913751329714
625;197.117;10.7691820023617;3152.672;169.994989679106;3.065;0.371463322550155
626;190.583;14.4174748482529;3052.636;228.521196487328;3.143;0.275101799339813
627;191.637;9.38636782786623;3062.294;147.595898533797;3.164;0.379504940679299
628;200.16;16.4327210163137;3205.391;261.588712350135;3.06;0.395752447876192
629;199.027;8.02858773384261;3185.338;130.445893519114;3.069;0.31605221087662
630;199.586;13.2230126673162;3193.167;218.964897782725;3.066;0.275724500180888
631;190.207;11.9497238880231;3045.241;193.569653016685;3.158;0.266413212885544
632;196.808;13.3079966937176;3146.526;219.347570864135;3.123;0.243928268144553
633;196.769;9.4799614450685;3145.194;152.579135808268;3.201;0.304678519098416
634;193.229;9.984937105461;3092.167;157.868665608469;3.268;0.271948524540952
635;196.061;13.106131732895;3136.767;213.463463808214;3.121;0.381010498543018
636;191.91;11.8259866395998;3070.266;188.564005748716;3.226;0.313534687076245
637;200.134;10.3909645365573;3204.835;163.694966645289;3.332;0.380862179797365
638;197.063;11.7392564074565;3153.399;184.751178153216;3.465;0.374946662873527
639;190.327;16.3870522364454;3044.012;264.029818346339;3.416;0.305489770696165
640;196.781;14.4909526601946;3149.095;231.891766833143;3.267;0.215316046777744
641;201.392;16.020665903763;3220.282;255.054055792104;3.301;0.300114977966769
642;196.392;13.8391609572255;3142.477;217.282314238875;3.504;0.30855145437998
643;200.205;14.1337824024575;3202.866;227.861223827138;3.324;0.357133028436177
644;195.703;17.1426275990585;3132.648;273.758629737947;3.431;0.495286785610116
645;205.844;11.7413859488568;3295.31;183.334153010281;3.451;0.403322451643846
646;199.59;9.75124197217971;3192.421;162.867879365447;3.426;0.301668692442562
647;191.681;9.40784188855328;3063.902;149.028590465038;3.484;0.425539657376376
648;195.906;11.4461864391594;3140.508;184.030673084671;3.701;0.473169102964263
649;193.179;12.5475865806932;3086.469;202.839249774303;3.514;0.414974698023866
650;195.28;12.8586546730209;3125.676;208.759881500252;3.458;0.300359784258803
651;192.543;11.604041580415;3079.253;187.11141130621;3.49;0.306789830339928
652;196.205;17.0582878683647;3140.662;278.586096056494;3.704;0.247353997339847
653;201.817;8.19959029464282;3232.675;131.22441565883;3.699;0.369471243806613
654;193.88;12.4007185275688;3098.173;191.964056325663;3.707;0.291549309723079
655;192.091;14.3957705247066;3073.662;234.585196966901;3.63;0.440068176536317
656;199.732;6.98503371502165;3195.089;113.29477582396;3.558;0.321365835147421
657;195.007;7.80740039962065;3118.745;123.775727366081;3.663;0.315944615399602
658;184.287;14.1777304601268;2950.594;228.629266551772;3.683;0.431996527763818
659;196.484;15.3159395402305;3143.767;242.941746352901;3.589;0.190286625909427
660;187.905;20.1460414225727;3006.903;320.42610542994;3.477;0.300933547481825
661;189.181;11.8342717984673;3027.291;183.147202405604;3.765;0.409395896413244
662;198.448;13.1391139731717;3172.493;215.380973256694;3.714;0.192052076270996
663;197.481;8.58440265830956;3160.388;138.81352043659;3.739;0.24287651183266
664;205.993;17.3863757292891;3296.188;280.293536058186;3.742;0.290922670137618
665;190.794;15.2549658800012;3059.611;242.527517261446;3.892;0.202573443471745
666;196.708;16.2957619030222;3141.947;264.646232773117;4.03;0.343744090858295
667;192.305;10.7169960809918;3076.074;173.610820008423;4.01;0.440136342512184
668;198.983;10.6296039907418;3183.835;173.017524964956;3.863;0.291343439946748
669;193.826;19.449803186665;3100.608;314.062377937884;3.724;0.336160675867952
670;204.077;10.0732289262188;3266.632;159.897580019212;3.869;0.362476206115657
671;194.99;10.2185321842223;3118.958;165.730576647766;3.894;0.403588899748249
672;198.41;11.2460277431628;3171.555;181.504846615733;3.95;0.328298644529644
673;195.522;17.2438927159734;3130.43;276.939501913327;3.974;0.29323028492978
674;196.876;9.95641923584938;3154.215;156.095090073323;3.976;0.301004983347454
675;194.896;18.0423436393388;3121.947;290.415563083316;4.128;0.45369152515779
676;199.829;11.5121835027067;3192.457;190.081747679779;3.918;0.276181100005051
677;193.39;13.1115338538246;3092.861;207.739285714092;3.951;0.412806249952688
678;187.076;11.6499666952315;2995.214;186.17082860642;3.82;0.370162126641824
679;190.251;12.0814050921231;3042.32;196.795782373509;3.975;0.355928363578965
680;195.997;9.29211176213497;3137.332;144.947190783393;4.12;0.517860985207421
681;194.89;16.3222345283974;3115.439;264.853096128777;4.064;0.402348107986103
682;199.932;17.1101150200694;3199.522;270.421840567662;4.026;0.361696004954438
683;198.783;16.9183096377855;3180.641;268.140205021548;3.917;0.259848032511307
684;190.205;9.76062830969373;3041.461;154.926070010831;3.899;0.295683952895658
685;199.384;11.148157874734;3190.338;177.337353075994;3.999;0.323464062918893
686;202.605;10.9700749769547;3244.996;176.746696953577;4.068;0.455319667925736
687;200.816;10.1478364196504;3209.431;159.890432637482;4.2;0.361579866696132
688;191.917;10.8561190579331;3071.982;178.505917761855;4.163;0.452969093868444
689;197.675;18.8736298840471;3163.017;302.407755590035;4.017;0.433036949924596
690;197.701;12.1981748224887;3163.248;200.608560674751;3.986;0.220236236800395
691;197.22;11.2967517455234;3156.125;183.292009168426;3.953;0.258032943633164
692;194.972;6.67406892382686;3118.751;112.219372877416;4.075;0.366749233128034
693;201.922;8.15954998759127;3230.642;131.039988232605;4.027;0.46744090535596
694;199.929;11.8784059957553;3198.867;193.330839601448;3.939;0.361287973782687
695;196.085;11.9889417798234;3139.756;193.316617868209;3.941;0.388830297173452
696;195.566;15.2934673635504;3127.535;247.723084077768;3.936;0.337496666650205
697;205.287;10.6302474571387;3282.078;172.826230636441;4.109;0.237505789403126
698;195.652;12.3942799710187;3131.943;197.287074946633;4.153;0.622929369993095
699;191.058;18.8910125721199;3059.672;307.273864615919;4.042;0.317200252206713
700;196.252;10.1372864219179;3136.536;163.799578277848;4.004;0.150279739153372
701;191.179;15.0192692565249;3057.346;238.594986921352;4.102;0.226927301134102
702;195.489;16.6566409879061;3127.62;266.593501346151;4.127;0.360778325291313
703;189.389;11.9744882562892;3034.251;190.61381384622;4.272;0.474105473497198
704;192.896;13.1147254641493;3083.744;210.641355920437;4.284;0.362414127759936
705;193.408;14.2773007252766;3095.729;227.909736450642;4.13;0.331240094191503
706;196.301;12.1655476243361;3140.941;195.129217415026;3.984;0.307772643358694
707;192.051;12.9473722816641;3074.481;213.590112432666;4.031;0.261818639519804
708;186.159;10.8121232419905;2979.624;172.686844965095;3.904;0.376621826239523
709;192.673;11.0738232331919;3080.482;175.78937589058;3.918;0.27766166462081
710;189.835;14.2072067979603;3036.95;228.312155042174;4.004;0.294421466608673
711;196.027;8.390862947278;3137.444;130.7756566185;4.102;0.414724004610291
712;196.775;15.6279533208926;3148.831;248.817174545893;4.25;0.312793861832349
713;198.796;9.88234101820023;3179.82;162.842932852476;3.974;0.260430412970528
714;191.927;13.196582171153;3078.537;213.061463106304;4.214;0.348717650829432
715;197.276;11.2092365484898;3152.82;184.824962112793;4.244;0.233589383320388
716;195.282;9.02219019972395;3118.308;140.189460217236;4.222;0.438561284200963
717;193.728;10.8418087051935;3101.368;172.538725670496;4.033;0.297726384453925
718;195.293;14.5191439485943;3125.909;235.038843149388;3.999;0.301875802276367
719;199.279;15.1720871668996;3187.944;238.489396418366;0.462;1.12627527718582
720;1076.659;101.155658907448;17239.957;1617.49584293163;2.842;0.259953842056622
721;1071.639;83.5149710471133;17149.2;1336.52320389131;2.934;0.243852414382139
722;1033.727;100.891776676796;16538.321;1611.00426274076;3.001;0.213046943183895
723;990.669;67.900578414324;15850.392;1085.27892580479;3.142;0.198736005796634
724;995.682;53.4947937279869;15928.217;853.705503824955;3.123;0.149736435111825
725;1043.859;86.145153485266;16702.508;1382.52819185582;3.04;0.246536001427782
726;1025.609;112.632042283714;16410.939;1803.11273704916;3.071;0.261742239617523
727;949.791;71.5576765204109;15199.388;1147.13063645602;3.24;0.210902821223425
728;929.313;57.8790943346581;14868.939;926.164974596293;3.298;0.19848425630261
729;971.528;42.9487354412241;15538.073;683.695651222807;3.173;0.13008074415532
730;946.7;64.6971041082975;15150.497;1033.53991887156;3.265;0.217267116701999
731;964.977;50.4276134771443;15438.913;802.675693553208;3.219;0.131563672797626
732;965.343;21.7648579365992;15448.28;346.610365973117;3.216;0.0971802449060428
733;973.047;30.2735306992788;15566.42;480.693794800777;3.196;0.112089250153621
734;1001.317;60.1092383997623;16023.766;959.844433845408;3.138;0.151248140484437
735;951.625;84.3633048487312;15224.094;1354.24747799063;3.325;0.240676130931169
736;967.825;36.6568548159809;15487.697;586.329806099781;3.216;0.125793481548125
737;983.567;53.5337938222248;15735.055;850.945346085785;3.164;0.176193075913895
738;984.407;62.74390265994;15748.614;1004.26759900141;3.135;0.159640220495958
739;1000.182;64.5022403951986;16004.73;1034.63057732699;3.107;0.182704679743017
740;1003.291;60.7482435054712;16051.046;974.304608140569;3.123;0.166976046186263
741;977.988;48.0361292778653;15651.405;770.873305923256;3.197;0.162668374307964
742;976.718;42.1374384128868;15626.315;670.343602106508;3.186;0.176476627347639
743;984.687;70.4705361197165;15756.489;1127.26785537824;3.149;0.206274089502287
744;968.111;40.7975806758193;15486.882;649.338282866466;3.221;0.155528132503426
745;969.019;38.1497107328456;15506.289;611.072360108885;3.204;0.124835892274627
746;1002.163;44.4965160546289;16033;713.740156821882;3.145;0.128160056179763
747;1004.181;62.0297390692574;16067.083;986.092125098395;3.17;0.173608755539584
748;991.772;79.984892673551;15868.154;1281.77185257909;3.145;0.240509875057135
749;977.858;79.5033651866387;15645.606;1269.11632804246;3.166;0.208096131631515
750;994.981;86.6357523716391;15921.491;1384.9458977697;3.165;0.250289831994829
751;998.209;84.9121864575418;15974.053;1362.94045851641;3.156;0.199258625911148
752;976.488;84.7505974964184;15621.393;1355.8762372654;3.213;0.239960413401879
753;974.502;35.0189156885214;15589.923;561.992371639466;3.183;0.107242715370318
754;974.507;18.4484872279536;15591.927;292.297436152094;3.183;0.066340033162472
755;991.198;32.6189530181523;15861.755;514.693402060818;3.104;0.119264412126992
756;985.529;45.398490382394;15768.964;726.231255815974;3.133;0.113229854720374
757;979.855;32.9108384122935;15676.277;528.668011876126;3.236;0.11774548823628
758;1001.439;37.0407220366974;16022.335;591.167371160618;3.045;0.142776048411493
759;985.176;51.4655772725795;15762.512;825.767430367712;3.118;0.181041431722144
760;981.184;38.5980414529031;15700.743;617.656439989964;3.158;0.154583310871524
761;991.996;36.1288597107613;15866.145;578.601095198572;3.151;0.11886547017533
762;967.33;32.938414351632;15482.285;532.007973647953;3.197;0.150801193629228
763;985.767;42.0783806841493;15771.376;671.941107407498;3.134;0.146369395708255
764;986.004;46.9424192388919;15778.643;753.375869975285;3.142;0.170047052311996
765;994.481;52.4371407401249;15911.009;839.109172640241;3.113;0.136824705371506
766;974.073;39.3359408302377;15581.461;629.377824211271;3.196;0.141647449677005
767;993.908;45.1486931815362;15902.729;723.994457498856;3.147;0.168407244499755
768;999.746;71.8617268370297;16000.228;1147.42590912704;3.121;0.19185671737002
769;1004.757;85.1572869518519;16076.223;1357.39577727388;3.082;0.220172659519748
770;977.964;68.7837249936337;15643.323;1098.82908459003;3.157;0.230002173902774
771;991.938;58.6670329571908;15870.406;941.782489815952;3.108;0.192551291867909
772;980.951;56.0063282942171;15696.209;896.629724149841;3.212;0.197979796949088
773;1004.988;38.5098246685187;16080.311;615.393049773035;3.119;0.111485425056368
774;1020.213;57.2215636014941;16321.2;908.417404038432;3.066;0.166324983090339
775;974.499;69.7163845089502;15593.786;1116.1141263168;3.22;0.159311016568216
776;983.578;73.3635429624301;15731.855;1171.2457428076;3.167;0.147787008901319
777;968.707;60.4076253547525;15507.312;970.48687470568;3.238;0.139125842315504
778;1000.225;99.9093546420973;16003.205;1594.74635993471;3.154;0.267102976396745
779;977.056;91.3346995615567;15628.19;1461.78436892725;3.195;0.204658251727123
780;1012.557;70.6122271352463;16201.398;1131.72419259107;3.075;0.186346451535837
781;986.495;30.7623491463214;15788.415;492.261161381757;3.16;0.0940212741883509
782;982.593;40.7212799528663;15716.586;647.749291581248;3.154;0.0865101150155277
783;988.425;31.9566388251317;15819.085;514.333541590465;3.145;0.109384642432107
784;974.892;41.1461497105131;15598.072;656.835606629228;3.206;0.111999999999985
785;967.735;20.064557433449;15483.379;314.938881990001;3.218;0.133176574516689
786;989.405;46.1109119948841;15829.284;743.062763071904;3.19;0.138996402831148
787;975.504;48.1377810456634;15610.37;768.231321152687;3.201;0.130188325129414
788;947.888;42.0088949628535;15165.821;669.993674678355;3.235;0.0713091859440486
789;952.972;50.9007329613238;15248.559;814.359226391457;3.231;0.141665098030523
790;969.684;79.6321672692654;15512.839;1274.36235603886;3.245;0.20694202086575
791;1006.359;56.7145976711452;16106.26;907.031189562938;3.125;0.142565774293838
792;991.071;48.912420804943;15850.838;781.909035154361;3.152;0.151049660707984
793;966.468;56.9210709315958;15465.777;911.105388460107;3.189;0.115451288429366
794;977.462;30.9233839674716;15640.691;493.965300551543;3.162;0.14005713120009
795;972.434;30.9954345670459;15556.535;491.540210079519;3.164;0.0906862723900285
796;972.782;49.2922421482334;15565.599;793.819442889295;3.222;0.169339894885993
797;976.985;34.3042732760859;15626.759;546.15959227044;3.197;0.143669760214172
798;975.392;92.1405277605899;15609.356;1476.53437483322;3.193;0.263250830957845
799;975.048;67.2410772965436;15603.657;1076.19244803193;3.176;0.186611896726876
800;1003.41;81.3226034998872;16053.175;1299.96389269282;3.145;0.216067119201415
801;993.378;66.0094080870277;15893.435;1056.55797280838;3.17;0.189261723547048
802;1004.48;49.5637542968649;16069.882;794.440165334089;3.091;0.16783622970027
803;997.746;52.6523152767266;15965.417;844.684938933484;3.153;0.183523840413173
804;967.777;49.2740164894231;15482.333;785.851647654279;3.208;0.120233106921502
805;966.117;42.4696922640172;15458.043;683.877484057638;3.221;0.151489273547687
806;1004.225;110.976485639976;16068.781;1777.79398487255;3.152;0.303868392564938
807;1028.892;63.353737821847;16462.166;1013.04490279745;3.068;0.158732479348108
808;1023.279;55.2530448844264;16374.057;884.90009908515;3.06;0.141915467796853
809;1017.715;73.6142748724724;16284.449;1176.76525048502;3.047;0.191209309396799
810;995.377;78.3701242885318;15925.836;1252.79005154254;3.171;0.211018956494423
811;1021.403;76.4787628103399;16338.632;1225.69918145356;3.071;0.214636902698482
812;1000.016;62.0872346299939;16005.35;992.428240549492;3.104;0.181284307097999
813;973.406;65.5425062383163;15571.386;1046.53289586325;3.242;0.224044638409406
814;978.894;51.3011690315152;15666.211;820.908886691455;3.2;0.200149943792149
815;989.903;61.6909679045513;15835.664;986.926774914897;3.12;0.207605394920265
816;1000.889;41.7279101921045;16011.739;667.187149403433;3.143;0.178888233263117
817;1002.605;32.457714106204;16045.161;519.975431024466;3.095;0.133285408053541
818;995.223;46.0310206382618;15923.05;740.673850206698;3.107;0.148192442452377
819;1005.98;35.5332644151915;16090.372;563.538712331328;3.082;0.126317061397109
820;1006.411;59.0690877617074;16102.975;944.209894761227;3.122;0.163572613844735
821;991.457;40.4105226519097;15865.907;651.830713714084;3.128;0.163327891065795
822;984.838;51.9321842020935;15757.902;831.480160374252;3.165;0.21374049686477
823;996.177;47.7185278586818;15939.335;759.3009677361;3.106;0.150079978678051
824;990.805;39.61819108692;15852.597;638.724978313033;3.176;0.148674140320362
825;986.816;36.9852676615956;15788.746;588.823183344583;3.126;0.13093509842665
826;999.984;40.4820452052508;16001.662;644.881032017528;3.1;0.176011363269538
827;992.106;27.696589753985;15874.392;443.450746279637;3.168;0.125761679378097
828;999.749;29.4843373505299;15994.195;473.792380990808;3.144;0.0977957054271955
829;967.534;48.0357090506666;15482.544;768.967540500909;3.18;0.162111073033264
830;974.471;28.0633901907774;15590.428;444.58489686;3.226;0.14752626884726
831;983.74;29.5476019331548;15739.447;472.374462900995;3.16;0.108903627120506
832;1000.11;45.6788535320234;16001.442;735.458035129073;3.128;0.141124058898559
833;1013.449;53.4104554277529;16212.283;856.86353968468;3.136;0.182274518241023
834;1025.128;49.4992516711092;16404.943;791.53297317353;3.061;0.117341382299689
835;1002.156;19.5358947581043;16037.767;314.085127506778;3.12;0.118827606220097
836;974.932;64.9588236962455;15592.191;1034.70489886196;3.209;0.252406418301918
837;987.854;57.8226865858034;15803.774;927.31220050426;3.18;0.1849864859929
838;1004.396;45.9185488011114;16076.95;734.391391493667;3.127;0.1242618203633
839;993.57;28.7162880609596;15898.441;459.795876002528;3.15;0.141633329410851
840;994.266;40.4549883697872;15903.03;647.385288047258;3.141;0.13974619851717
841;985.532;39.6413775744517;15769.698;634.309549254937;3.173;0.147854658364217
842;976.415;21.9694297832278;15625.86;353.061307650634;3.212;0.0943186089803752
843;980.219;29.831945779654;15681.807;473.887623599856;3.179;0.0911537163257789
844;983.969;46.184845014353;15745.881;738.963037714999;3.191;0.164344151097627
845;998.734;42.4552411840965;15977.053;679.335575044461;3.17;0.174011493873243
846;1003.165;45.9425585378035;16052.96;734.974112782238;3.121;0.135532283976931
847;1003.732;58.4159496713023;16055.302;935.742966789474;3.093;0.196369549574265
848;983.5;48.1028385856808;15737.675;767.819106707427;3.187;0.166376080011508
849;990.386;79.4664647760317;15845.671;1272.52630041547;3.162;0.221621298615457
850;978.137;69.631051126635;15649.776;1114.27829325709;3.172;0.215814735363455
851;972.581;50.1691206719869;15565.526;804.702201080677;3.178;0.164426275272539
852;974.658;57.4871263501677;15591.519;920.048078150863;3.186;0.191999999999994
853;968.638;50.3790525516285;15498.711;805.375122045011;3.251;0.176490792960996
854;958.714;51.2092339720108;15340.444;822.078955152147;3.257;0.166135486877424
855;971.986;34.8384437654714;15549.188;553.901713877103;3.202;0.130675169791355
856;965.032;28.8549561774067;15443.885;461.896294036873;3.233;0.135355088563386
857;994.745;43.391641418597;15912.526;686.990270501654;3.145;0.124438739948612
858;1004.044;60.3581250868488;16064.925;968.219329813819;3.093;0.218038987339414
859;950.581;79.817730793351;15210.894;1273.12095299856;3.249;0.30339578111767
860;980.923;64.1349878069658;15691.877;1027.27166126634;3.172;0.225290923030648
861;978.684;41.9255025491656;15659.335;665.025884131537;3.236;0.120847010720168
862;980.078;65.99655094018;15684.36;1061.63618720352;3.17;0.175670145443092
863;974.838;59.5962525331946;15596.594;954.004054385496;3.22;0.150532388541464
864;964.474;53.5001200372464;15434.998;857.632117365061;3.263;0.173841882180339
865;990.424;62.9248952641164;15844.212;1007.52182327529;3.156;0.136029408585062
866;1011.328;67.6438932646524;16180.371;1082.18168661689;3.092;0.179599554565155
867;978.15;39.8992827003239;15650.389;640.435424323882;3.185;0.110566721937492
868;989.987;59.0303117135617;15839.491;942.35880553482;3.14;0.15019986684415
869;998.325;91.248675962995;15970.609;1456.46655418825;3.158;0.248949794135283
870;1000.993;89.1740747134485;16019.872;1429.95851450174;3.194;0.259353041239157
871;956.81;65.143975469724;15309.937;1038.96281167373;3.267;0.2650301869599
872;986.782;36.3288980840277;15786.105;576.95622392433;3.199;0.168668313562437
873;983.205;85.6954834574129;15730.898;1372.48891820516;3.185;0.23031500168248
874;993.106;38.481322794311;15890.288;615.118059250465;3.152;0.160735808082693
875;1011.194;88.8098835941151;16177.945;1422.53180375168;3.087;0.264463608082473
876;992.266;57.7184627653916;15876.46;919.479742310907;3.153;0.174530799574175
877;1027.764;79.2929499009854;16443.807;1267.21226737319;3.026;0.186075253593815
878;1044.593;80.652683532535;16718.691;1291.02545642949;3.031;0.168252786009623
879;1030.469;80.9157742903078;16485.296;1293.61783066103;3;0.208662406772279
880;1020.256;59.5583970905855;16320.688;946.73321831233;3.037;0.19799242409749
881;990.354;34.4334462986237;15846.046;552.406958287181;3.167;0.140288987450905
882;964.074;65.0263849833273;15425.868;1038.02516845019;3.221;0.19253311403496
883;978.897;63.9296418025282;15661.334;1025.75249265311;3.188;0.184217263034708
884;965.941;49.1877882100832;15456.453;788.05829899885;3.245;0.176819116613559
885;968.841;47.8717752856523;15499.476;764.113121981278;3.18;0.163217646104816
886;964.001;72.3753100787829;15425.345;1160.5695469316;3.238;0.181151869987594
887;971.789;77.3193799056858;15551.815;1237.81646107371;3.154;0.214438802458885
888;964.044;77.31052233687;15421.881;1235.36546930412;3.186;0.187573985403087
889;973.691;32.4698039569048;15576.778;515.518472895001;3.213;0.0966488489326319
890;982.314;28.3131228231742;15717.531;451.994048200923;3.143;0.114982607380427
891;971.598;46.8791819041253;15548.58;746.010450570285;3.182;0.206145579627602
892;983.99;26.6824706502183;15743.614;430.523513926813;3.154;0.0720000000000237
893;961.594;34.1947964462409;15381.493;550.30347980096;3.279;0.134643974985867
894;951.19;38.4716953096692;15222.94;618.895390433681;3.302;0.14019985734656
895;961.589;40.1252876500606;15385.828;637.082843369745;3.261;0.138668669857323
896;972.335;27.2456680043004;15554.381;434.826392631612;3.199;0.105966975987806
897;979.184;31.1477014240234;15669.235;498.349807931123;3.157;0.0957131129992065
898;976.428;44.09570995006;15617.257;706.556777790052;3.168;0.152039468559976
899;974.35;25.8739784339406;15593.902;416.058921471336;0.139;0.417
900;820.246;35.7874699301361;13127.251;572.966322962357;4.526;0.245690862670951
901;916.849;43.8392927520557;14665.765;697.026878079332;3.681;0.188438318820773
902;899.649;34.4916408568809;14394.382;554.284896362857;3.719;0.142509648796146
903;898.131;33.1490278741293;14372.795;527.398921808673;3.706;0.141576834263232
904;898.657;27.3072748731874;14378.098;439.413469315599;3.692;0.11487384384619
905;909.41;34.398504618665;14547.758;552.767481329992;3.664;0.116034477634878
906;929.29;33.0309361054158;14873.246;535.341987185765;3.647;0.158243483278148
907;935.937;41.877246100956;14973.879;665.96166671143;3.635;0.188002659555655
908;941.157;42.1218520604218;15054.815;672.493760510131;3.607;0.117562749202288
909;957.621;44.6911104024071;15325.329;713.650973998461;3.568;0.104670912865029
910;948.508;28.8678561032868;15175.918;465.077724080623;3.65;0.0856737999624111
911;946.759;51.3184419970036;15148.743;820.445717693166;3.617;0.220773639730829
912;951.787;35.4773226300998;15227.576;563.873298342777;3.548;0.121474277112461
913;941.489;28.4079370775166;15059.901;460.241971281385;3.605;0.0953152663533101
914;932.048;31.6138576576785;14912.969;505.836620806516;3.646;0.120598507453469
915;927.552;29.6754318586926;14847.728;472.985568105459;3.626;0.132302683268332
916;924.354;32.9159642726743;14786.454;526.992009032422;3.666;0.169717412188628
917;942.09;23.5421035593745;15075.342;376.317110129194;3.638;0.103518114356845
918;930.554;17.3401050746494;14884.078;279.176528662466;3.606;0.114908659377755
919;934.058;19.9659173593398;14947.707;316.504505719844;3.616;0.0721387551875041
920;942.282;46.2578686927971;15074.812;738.119714989403;3.576;0.188584198701812
921;940.109;32.8379117636902;15042.936;524.509089324559;3.593;0.114284732138608
922;934.714;27.6523844179776;14956.144;442.884062734259;3.651;0.116571866245683
923;940.073;39.7697885460807;15039.469;636.282811294603;3.613;0.117647779409563
924;934.769;35.77448376986;14959.411;570.487769447449;3.607;0.135797643573073
925;933.744;36.0315925820655;14939.496;583.079750586399;3.613;0.130999999999992
926;944.759;44.2383886347582;15115.031;703.972399408474;3.581;0.152738338343702
927;944.264;33.7693986324938;15106.219;541.052142781985;3.592;0.0876127844551874
928;944.526;52.4390927076346;15115.192;838.787194129726;3.638;0.107498837203008
929;941.543;36.6809405686364;15064.579;586.269787733454;3.612;0.0949526197637673
930;941.138;38.5852896321869;15056.907;612.801105466573;3.536;0.140726685458014
931;930.279;43.5323639261619;14883.678;700.457262704953;3.528;0.137535449975624
932;935.19;55.7394890539911;14967.857;894.002087548471;3.523;0.128378347083904
933;933.57;51.6019253516755;14935.105;827.224014717181;3.542;0.138838035134461
934;932.559;49.4903512717364;14922.056;789.709969649616;3.599;0.119870763741617
935;949.434;52.5190729544989;15189.045;837.327812033658;3.529;0.0914822387133157
936;928.163;49.1051905708559;14852.292;791.279990089447;3.562;0.099378065990422
937;933.732;50.9995299586195;14938.422;813.202630686859;3.529;0.166340013225921
938;931.326;53.0035931234865;14899.009;847.195565739703;3.587;0.132215732800615
939;935.442;60.3091062444159;14966.88;968.509609090167;3.562;0.170634111478328
940;936.846;56.388953031601;14989.749;900.180491017766;3.536;0.133731073427228
941;938.263;50.1875468717059;15013.803;805.454972286474;3.517;0.148798521498023
942;939.554;53.0316224907399;15032.647;850.196210248558;3.483;0.123048770818735
943;940.548;53.1886636041926;15049.198;847.064554597822;3.54;0.095289033996568
944;946.136;51.4265085729115;15139.888;820.231284294878;3.484;0.118422970744681
945;944.359;49.7718142024155;15106.555;796.842345991405;3.54;0.0852056336165348
946;944.278;45.4773609172763;15107.724;727.06180007205;3.521;0.0768700201639159
947;945.777;41.6382915235467;15134.84;667.57133910916;3.547;0.116193803621378
948;932.183;45.0531064522738;14911.115;719.997895361574;3.599;0.104446158378354
949;935.791;40.0607919167841;14974.923;638.510121596342;3.521;0.0720347138537564
950;954.13;48.9531682325039;15262.586;780.175610246801;3.527;0.0947681381055722
951;958.813;44.9517103234161;15346.097;715.943483468544;3.554;0.0865101150154969
952;966.478;50.4755431471555;15462.639;813.027055975976;3.524;0.156729065587714
953;961.536;48.1410806276716;15386.778;768.044154079706;3.55;0.17291616465791
954;960.539;63.7282498504393;15366.335;1019.00186956889;3.491;0.107466273779234
955;963.286;64.2998320682121;15410.663;1026.85102626469;3.538;0.14441606558828
956;970.01;64.3626804911044;15522.66;1031.25999081702;3.486;0.123060960503326
957;955.05;48.0087115011431;15279.613;766.50277411181;3.516;0.0845221864364423
958;961.624;56.9286058497815;15384.758;911.75138252483;3.465;0.112449988883912
959;954.475;56.9584039892271;15274.611;911.406885210457;3.543;0.156655673373152
960;971.972;60.2951394060913;15547.34;969.437550500346;3.504;0.156089717790764
961;976.388;67.7788046220918;15627.105;1079.50387254746;3.493;0.146017122283657
962;978.014;60.8579219494035;15647.618;975.902677082102;3.472;0.146955775660567
963;962.714;64.3495935029896;15404.05;1028.35588044219;3.484;0.137346277707124
964;950.461;52.736229188294;15208.877;845.290160466219;3.452;0.115134703716964
965;937.302;37.7282201541491;14988.929;603.123030905795;3.542;0.104383906805577
966;945.9;17.450787374786;15143.38;276.191830110963;3.49;0.109726933794765
967;952.526;23.3508373297354;15237.818;372.51599355716;3.516;0.0585149553532721
968;941.446;36.6105632843814;15062.613;585.024393150395;3.466;0.14101063789657
969;937.789;35.4313190412088;15000.785;570.571769442714;3.485;0.112271991164302
970;935.746;24.6616334414473;14972.749;394.782381406508;3.528;0.0752063827078416
971;932.943;27.8762174801402;14926.791;447.904692104323;3.524;0.13610290224679
972;962.328;47.2139817850642;15400.747;757.545058409703;3.435;0.115952576512982
973;999.035;76.0807225583445;15983.265;1216.02722315947;3.416;0.160947196309836
974;1016.185;78.0885616783904;16258.052;1247.73873870134;3.342;0.214932547558527
975;1056.374;76.7394707044539;16902.082;1232.83155762496;3.192;0.178930153970767
976;1101.122;83.0140255378588;17621.743;1323.82044509101;3.145;0.159702849066625
977;1136.359;95.9975880374074;18178.23;1535.94208965702;3.07;0.188732615093417
978;1180.323;99.4597851445506;18886.792;1591.7509339768;2.937;0.247509595773578
979;1220.753;96.8427196076178;19531.358;1546.83559231611;2.914;0.199057780556299
980;1253.465;102.686392209484;20055.46;1643.1967448422;2.818;0.240158281139757
981;1306.636;133.764502331524;20904.498;2137.3030845802;2.699;0.309497980607301
982;1324.171;139.580647114849;21185.727;2236.68316300294;2.691;0.294328048272672
983;1341.011;158.743266972178;21458.467;2538.7818816946;2.623;0.341087965193729
984;1355.781;167.836042639837;21693.517;2685.96614708766;2.587;0.349057301886093
985;1354.816;177.172321043665;21678.965;2836.94268592529;2.621;0.386431106408375
986;1377.193;159.294878954096;22030.889;2545.36571867165;2.542;0.297583601698746
987;1388.878;166.586190231962;22226.852;2666.72223780732;2.532;0.285720142797109
988;1434.832;158.333257011912;22952.235;2533.70146453459;2.458;0.263696795581594
989;1472.584;120.868238110764;23560.651;1933.50384067087;2.397;0.222578076189009
990;1481.256;108.546615626649;23701.6;1734.13039085303;2.39;0.177482393492994
991;1512.357;88.9342471773424;24197.932;1418.74888119645;2.354;0.159260792412947
992;1532.116;95.403897635262;24518.533;1530.85685083261;2.319;0.155977562488968
993;1553.858;79.1902637702402;24854.933;1268.99115984352;2.288;0.127812362469374
994;1569.875;68.1757985285111;25122.095;1089.26145927635;2.267;0.10863240768757
995;1591.669;70.2909863993902;25466.606;1123.27995085116;2.242;0.105242576935383
996;1604.968;69.0112925252076;25681.092;1102.69679530503;2.234;0.0894650769853684
997;1590.214;107.345297726544;25439.815;1720.70395882757;2.251;0.115624391890296
998;1613.972;79.5106232902277;25825.865;1272.12411295644;2.219;0.104446158378376
999;1639.895;51.5463545267686;26238.69;824.604024717248;2.181;0.0620403094769825
1000;1656.621;57.8995292640681;26503.743;925.7832801691;2.18;0.0756306816047514
1001;1662.062;56.6766170126654;26595.174;904.070223801073;2.152;0.0713862731902989
1002;1678.158;57.4497353866827;26850.032;919.754605368194;2.14;0.0707106781186666
1003;1680.295;43.5884400386121;26882.613;701.254184501491;2.136;0.04923413450036
1004;1687.896;44.5275706051916;27005.376;709.934348193001;2.137;0.069000000000021
1005;1710.001;50.0232594799717;27358.021;802.555498398166;2.088;0.073457470688823
1006;1711.279;45.5350885471879;27385.581;725.629235373728;2.073;0.0440567815438261
1007;1721.032;47.0713534540805;27538.722;754.498508769787;2.067;0.0667907179179799
1008;1721.799;36.3243533872078;27545.175;585.601697252536;2.056;0.0593632883186203
1009;1729.845;43.9410660430576;27678.627;700.786821209505;2.05;0.0913236004546446
1010;1739.547;46.8058150340254;27827.732;745.29373511118;2.01;0.087177978870824
1011;1746.22;43.2627484101541;27942.834;694.939997283356;2.013;0.0691447756522528
1012;1749.254;41.7656632175475;27985.37;667.13130314785;2.013;0.0549636243346568
1013;1761.103;41.2076461472913;28179.924;664.53119663711;1.973;0.0626178888178065
1014;1766.043;37.0109297505416;28255.987;590.889121833259;1.954;0.0473708771292954
1015;1766.323;43.4694368608401;28263.355;690.96799523928;1.966;0.0845221864364659
1016;1781.237;40.8205720317555;28496.904;658.809844328241;1.927;0.0760328876210744
1017;1775.806;42.7482446891204;28419.869;680.517881256165;1.94;0.0788669766125123
1018;1783.983;45.0350414788174;28536.72;718.191962778837;1.935;0.0765832879941774
1019;1790.568;35.8958774234538;28652.589;577.106406816859;1.921;0.0664003012041352
1020;1793.782;42.0627107543055;28697.096;674.915580293869;1.924;0.087315519811774
1021;1795.329;39.7292986220441;28727.651;633.201475258054;1.887;0.0667907179179832
1022;1796.665;46.7495059332138;28747.436;749.86899158729;1.886;0.0811418511004013
1023;1802.215;37.688509190482;28835.859;605.801664069063;1.871;0.0790506166958864
1024;1815.579;37.2651291289729;29049.043;594.405597467808;1.835;0.058523499553583
1025;1813.982;48.6473223929149;29022.622;783.33508606209;1.84;0.089777502749856
1026;1815.801;38.6855969192645;29051.897;612.8586349406;1.845;0.0548178802946542
1027;1818.046;37.3155107696579;29091.72;598.157049009841;1.831;0.0537494186015081
1028;1826.096;41.6787728226137;29215.845;663.434485194507;1.79;0.0698569967862983
1029;1822.904;36.8274232603903;29166.191;598.809931271176;1.824;0.0467332857821747
1030;1834.165;41.5922666489788;29346.734;665.043892599303;1.774;0.0675573830162199
1031;1821.428;41.2221034882998;29140.463;657.16581245613;1.808;0.08459314393023
1032;1831.78;44.8153420158773;29311.095;714.282975287172;1.769;0.0942814934120037
1033;1840.938;40.8896225954654;29455.503;654.853895507458;1.715;0.0807774721070114
1034;1841.731;45.1958481389684;29467.977;722.991087137879;1.734;0.082486362509204
1035;1836.187;50.2915647102032;29376.497;805.713827398514;1.765;0.126035709225603
1036;1845.027;47.1898607859914;29517.648;755.26868135504;1.706;0.0756571212775216
1037;1846.173;43.9650445354002;29541.766;699.664333751728;1.703;0.094345111161095
1038;1849.087;44.4005389719479;29585.887;714.670077491271;1.721;0.0615548535860481
1039;1846.818;44.3243544340957;29547.482;710.321924760894;1.691;0.0995439601382288
1040;1858.775;44.6078182048761;29744.824;711.956455721809;1.644;0.0987117014340311
1041;1856.889;45.9385214063109;29706.235;735.916279847589;1.61;0.10714476188783
1042;1853.023;46.8849257331268;29652.151;750.564348972656;1.661;0.120037494142454
1043;1866.766;40.5557084021427;29867.531;649.11817984806;1.537;0.0928493403315272
1044;1863.013;44.385514314934;29806.217;706.622590468732;1.622;0.115827457884563
1045;1859.713;46.6637718257033;29759.215;748.469131444146;1.631;0.0910439454329611
1046;1871.592;38.0325018372444;29941.448;610.029942425666;1.49;0.113225438837746
1047;1862.69;41.0313204759574;29803.57;654.045822920794;1.563;0.0971648084442066
1048;1876.603;42.1085343012574;30025.216;672.217952902299;1.515;0.114564392373894
1049;1867.704;47.6533088462833;29883.048;763.751774542038;1.543;0.139574352944946
1050;1873.991;43.5551499710313;29984.978;691.893564817541;1.453;0.126415980002528
1051;1875.342;51.3656530767332;30006.059;826.747156517014;1.464;0.10983624174197
1052;1874.656;44.7800643590327;29991.797;718.826528448374;1.48;0.14
1053;1874.565;46.3833244280762;29992.644;739.471366169101;1.5;0.0967470929795828
1054;1879.626;51.001735303799;30071.709;816.340764612943;1.404;0.130552671362939
1055;1867.77;55.5888057076231;29887.806;890.007550723013;1.544;0.161938259839976
1056;1879.932;53.9554176705193;30077.804;858.440850789446;1.378;0.130061523903113
1057;1885.895;46.5969621863921;30171.316;746.603507977343;1.387;0.109731490466504
1058;1880.717;42.511042341969;30093.777;685.004083200192;1.401;0.116657618696763
1059;1855.095;89.4067133105784;29684.624;1437.23008401713;1.43;0.211234466884549
1060;1889.309;46.5980210845952;30228.247;743.18914736473;1.329;0.113881517376615
1061;1889.043;53.2956653115307;30225.555;857.657614811906;1.346;0.141364776376578
1062;1891.709;57.2811165132264;30266.36;915.501696503068;1.31;0.15251229458637
1063;1888.975;54.0911734481793;30226.9;861.711886595424;1.308;0.14427751037497
1064;1888.553;42.3947010957779;30215.947;680.839613581027;1.312;0.0713862731902989
1065;1885.068;51.2887579884718;30156.187;820.980257887609;1.308;0.0918477000256372
1066;1891.953;44.8180934556433;30271.655;717.931347807757;1.272;0.0821948903521339
1067;1893.598;49.289456235591;30302.273;790.553661556916;1.272;0.082437855382104
1068;1896.268;41.7644180613043;30335.387;664.480556014297;1.27;0.096332756630337
1069;1894.03;47.2531641268484;30306.164;759.011475225477;1.277;0.169885255393162
1070;1892.581;55.9113415059898;30281.992;894.085916182654;1.244;0.0895767827062349
1071;1898.725;53.0697792062543;30377.6;844.698495263369;1.249;0.0880284045067273
1072;1902.164;47.8704015441694;30437.646;770.755590498067;1.228;0.0686731388535555
1073;1876.663;54.917703529918;30024.516;877.977140490414;1.341;0.181132548151899
1074;1894.863;52.3806723992761;30318.122;841.018247492804;1.247;0.0795047168412068
1075;1893.774;48.370267355058;30301.701;774.448574799495;1.251;0.0804300938703947
1076;1904.207;58.0384352046036;30465.677;924.710422013697;1.223;0.0783645327938585
1077;1904.142;55.677542474514;30465.561;890.416855528375;1.211;0.076478755219997
1078;1902.62;52.3446043064598;30441.7133333333;840.982701579104;1.21222222222222;0.0659592092429137
1079;1884;50.4665564507802;30143.968;813.92676175196;1.244;0.0859302042357611
