iteration;usage_avg;usage_std;reads_avg;reads_std
0;42630758.4;20624339.6366178;102764.7;53807.3640834598
1;157786112;95477192.5503172;244.7;160.765077053445
2;548472832;123158628.04668;558.5;79.9965624261444
3;767153356.8;57822276.4246379;533;73.7427962583465
4;786427904;1831.77291168966;582.9;54.5297166689875
5;786428313.6;1228.77499974568;597.5;36.0229093772286
6;786404966.4;48987.8861760742;607.4;16.057397049336
7;786354176;55621.2068908973;624;24.0873410736846
8;786350899.2;53304.6837716912;615.1;16.9260154791372
9;786350489.6;52819.3455468733;622.3;9.25256721132586
10;786356224;57991.3174190758;621.4;17.3562668797195
11;786355814.4;50638.2242974613;604.2;13.5114766032414
12;786353356.8;55403.6059476276;615.3;21.4198506063898
13;786352128;52939.9091801261;605.6;8.35703296630852
14;786350489.6;52340.7261699721;624;21.5220816837036
15;786367283.2;53837.085210847;608.4;10.7721864075952
16;786345164.8;47478.2779805671;608.8;20.1682919455284
17;786346393.6;45072.7525673771;604.6;8.34505841800738
18;786336563.2;60699.6234584697;619.1;22.1831016767261
19;786349670.4;43980.0565711323;627.8;19.5130725412481
20;786343526.4;36963.9893950856;609.9;9.21357693841389
21;786354995.2;44335.296999118;617;18.1659021245849
22;786343936;37596.2823694046;605.4;11.6120626935969
23;786344345.6;37772.1387268447;615.8;18.1758080975797
24;786356224;44238.6965449933;604.9;18.822592807582
25;786346803.2;46261.2311120229;614.3;34.4849242423422
26;786354176;42170.9010574828;597.3;22.9043663959539
27;786338201.6;37827.6174243105;619.1;22.9976085713266
28;786338611.2;36763.7386564533;598.3;31.3051114037319
29;786343526.4;46456.6578221034;614.5;26.9007434841497
