time;transactions_avg;transactions_std;queries_avg;queries_std;latencies_avg;latencies_std
0;539.367;28.9214806156257;8651.036;463.540072015346;6.092;0.51475819566082
1;675.227;52.7828663583162;10796.927;843.176014175565;4.645;0.286714143355354
2;699.1;51.2885761159344;11188.08;825.87350576223;4.506;0.281893596947497
3;725.479;57.4326122425217;11606.845;918.189359241895;4.385;0.261811000532834
4;735.87;40.3927773246655;11775.023;646.131052559011;4.272;0.172267234261186
5;741.062;55.0801871456499;11858.988;876.001945726148;4.297;0.339972057675342
6;768.493;61.6091168659324;12293.087;985.299141023181;4.102;0.230338880782203
7;798.706;61.9379541476784;12780.413;989.856126626986;3.953;0.282242803274057
8;815.614;57.8145841808113;13051.097;927.068733169785;3.851;0.213468967299696
9;846.583;50.8395057115979;13546.346;815.340862268014;3.78;0.14477568856682
10;885.804;68.3684341198472;14169.163;1091.36624987265;3.558;0.198685681416642
11;869.638;83.8178895940479;13916;1341.75549054217;3.596;0.285944050471425
12;884.528;71.3895267949037;14148.935;1144.76879816186;3.545;0.204169047605172
13;901.171;89.2541596173528;14421.257;1428.98773691762;3.499;0.274934537663057
14;902.285;82.425598966582;14439.161;1318.78986971732;3.52;0.285797130846335
15;883.818;66.2101056939193;14142.183;1055.47557222375;3.543;0.258768236072354
16;877.299;71.4123770014696;14035.383;1145.80542647566;3.573;0.221632578832625
17;871.162;66.5044204245116;13936.064;1059.56885944424;3.602;0.213532198977109
18;867.645;69.2629182535644;13886.207;1105.58801751873;3.622;0.170751281107933
19;864.176;65.0427699594653;13825.508;1042.3249266596;3.631;0.226382419812133
20;877.575;39.5019567236852;14041.702;635.207795367749;3.557;0.151528875136057
21;898.712;40.752296327935;14376.974;653.601873347938;3.449;0.16306133815223
22;881.93;50.9200526315517;14110.48;813.369030661976;3.558;0.193380454027785
23;866.514;54.8492208148869;13868.633;877.971314042206;3.592;0.217430448649678
24;894.617;27.2426570106552;14311.174;435.248602414681;3.516;0.116464586892305
25;887.677;30.1812710302243;14202.52;486.940985233373;3.53;0.174585222742348
26;887.555;74.5863359134913;14199.893;1194.48308996026;3.504;0.274415742988622
27;864.953;66.1679040094231;13841.448;1056.6324363827;3.584;0.181780086918223
28;884.27;60.8031783708707;14144.499;969.190255785203;3.52;0.230347563477455
29;865.021;60.695235471986;13842.723;971.544295604148;3.586;0.230789947788024
30;887.323;69.1463144426367;14191.859;1112.56694882105;3.471;0.220519840377232
31;868.949;57.9022704995255;13906.699;926.023549349076;3.63;0.215406592285377
32;878.493;57.8231661274306;14058.803;922.288780643582;3.555;0.260969346858977
33;885;50.0048479649713;14159.677;803.785965740258;3.564;0.208144180797844
34;869.87;45.225449030384;13916.414;728.178846468391;3.571;0.178518906561733
35;885.851;22.3154159495159;14174.111;353.108164460996;3.471;0.0981274681218278
36;880.715;29.3910490625991;14090.679;468.420614479125;3.474;0.167523132730972
37;892.606;25.4432805274749;14277.576;410.212798318067;3.449;0.163061338152236
38;887.38;33.6635512089821;14204.377;540.501397112817;3.49;0.137113092008023
39;879.687;58.5887030151742;14073.389;934.690659763437;3.526;0.206504237244665
40;872.122;52.371751316909;13953.855;842.095390502134;3.531;0.195266484579402
41;868.068;40.7967037393964;13889.18;648.741159215332;3.575;0.162003086390362
42;879.25;35.8213405667616;14069.6;579.216364288871;3.525;0.157368993133973
43;886.973;38.105722155604;14188.98;607.342392608926;3.478;0.14253420642076
44;902.607;47.9545464059462;14446.297;766.943124867126;3.467;0.16155803910669
45;897.792;40.0152942760651;14360.483;638.186204944105;3.454;0.118844436133968
46;888.208;36.4757055586332;14214.428;582.318362870329;3.502;0.101666120217113
47;888.298;40.2330189769546;14208.279;646.86691596414;3.505;0.154094127078213
48;908.6;77.809157430215;14543.21;1238.00232788149;3.442;0.286907650647386
49;875.86;46.8644142180401;14010.755;748.933368307898;3.57;0.155434873821798
50;879.353;68.5995519008684;14070.932;1101.14771182435;3.503;0.232939906413647
51;885.008;76.7893272271606;14155.329;1224.22397889808;3.565;0.212849712238469
52;878.288;66.3218342327758;14054.039;1063.09962722642;3.552;0.235745625622203
53;899.099;84.1092202377366;14387.101;1349.0223577721;3.45;0.276405499221701
54;854.007;77.9828505570298;13663.207;1248.58843314402;3.638;0.349365138501247
55;903.183;43.8264078039727;14451.85;699.986241721925;3.509;0.149763146334455
56;883.302;37.0002612963726;14134.943;589.005519058206;3.563;0.172107524530443
57;888.896;54.6430175228254;14219.522;875.203218467569;3.511;0.195573515589403
58;881.774;48.7057126423578;14110.585;778.690294677539;3.508;0.200688813838731
59;883.423;52.5775902928229;14137.679;844.543037393005;3.511;0.166700329933677
60;881.612;41.5987881554298;14101.986;665.285181154689;3.551;0.223537468895024
61;884.233;40.4438534390623;14149.12;650.753863545966;3.523;0.145742924356534
62;866.238;57.6681646664777;13860.824;919.759090655766;3.59;0.208758233370555
63;872.398;37.0157290351019;13951.898;589.22282351922;3.544;0.152197240448055
64;889.017;39.4895406531896;14231.43;633.006077727589;3.445;0.208386659841741
65;881.177;36.0450598695572;14096.047;581.223686200915;3.517;0.111986606342003
66;886.92;42.1357171530265;14189.308;673.530436191245;3.517;0.145124084837755
67;879.187;39.755807387095;14067.495;636.757982662925;3.477;0.0985951317256356
68;883.256;40.2125326732826;14133.197;645.728684325673;3.516;0.14506550244629
69;881.349;33.7678943524767;14102.362;536.058006074008;3.557;0.159502351079848
70;896.382;36.334545765704;14342.113;585.059082077248;3.488;0.172034880184212
71;894.752;58.817787751669;14316.323;942.402838886254;3.486;0.271742525196188
72;889.495;51.2603958724453;14233.191;818.043795275636;3.505;0.170249816446289
73;871.279;31.9389468987274;13935.07;513.52070242587;3.541;0.097821265581658
74;867.192;31.0884125680319;13877.493;497.003120997277;3.612;0.132649915190327
75;891.615;38.7661827499181;14262.54;621.001727533846;3.479;0.148084435373877
76;874.502;39.4109961305195;13996.822;633.650305575549;3.549;0.169908799065837
77;891.29;44.4967787598156;14257.341;708.41110202267;3.505;0.13958868148958
78;865.705;47.32261409728;13854.486;762.375130237086;3.596;0.2011069367277
79;877.79;52.0017997765429;14038.162;831.143670851169;3.569;0.160900590427753
80;874.314;55.9879323068823;13994.095;896.248833419029;3.588;0.171219157806595
81;868.875;34.5806299103997;13901.885;554.298640414189;3.569;0.172652830848488
82;892.621;72.6758104805188;14284.436;1161.37743546359;3.471;0.226735528755419
83;887.709;40.6972838037118;14202.358;651.441019829166;3.527;0.0908900434591115
84;863.503;49.6182559246092;13817.363;791.873976413506;3.6;0.150399468084165
85;868.49;46.9402081375864;13894.033;752.363076261029;3.569;0.169201063826428
86;879.003;45.6334870572046;14064.333;731.654465195851;3.506;0.20795191751941
87;893.993;35.9490322679266;14304.371;577.374228164912;3.53;0.155627761019672
88;895.208;28.8115215842567;14322.429;461.657242712601;3.494;0.161752897964743
89;869.993;53.9531897203476;13916.399;859.669357374691;3.552;0.201881153156982
90;883.916;49.7990689069604;14145.049;795.944818419606;3.492;0.166240789218529
91;873.393;57.2440005677444;13977.785;917.796211228343;3.552;0.20018990983562
92;864.29;56.7816727474611;13826.538;908.299740953382;3.538;0.161851784049478
93;881.499;43.270722538454;14102.052;692.851173771099;3.483;0.131000000000013
94;889.904;41.2213010954316;14239.459;656.704390276883;3.471;0.132018938035419
95;900.684;48.5247081804734;14410.26;777.019138515927;3.48;0.145120639469357
96;900.766;40.3165495051302;14409.768;643.96555979025;3.435;0.121511316345436
97;895.423;46.6523993059314;14330.574;746.959210830153;3.439;0.117426572801889
98;880.019;53.5758756251377;14077.117;857.734485421372;3.572;0.21502557987364
99;878.406;36.8952829505354;14056.81;589.474549017968;3.526;0.165239220525876
100;881.813;26.0945722517214;14107.012;412.523764789452;3.502;0.106939235082341
101;881.063;36.585776758188;14098.604;584.451549047434;3.518;0.155164428913305
102;868.356;36.652031103338;13897.094;589.696909983418;3.575;0.148205937802756
103;877.373;63.2649972812743;14034.663;1010.77450575338;3.496;0.235762592452661
104;887.217;54.1401699387797;14194.078;868.154195057493;3.513;0.216889372722581
105;892.784;57.3909637835086;14285.85;915.073901398134;3.521;0.220065899221121
106;877.584;37.1404992427411;14041.255;590.89127088238;3.53;0.0998999499499224
107;887.894;41.2236968744925;14209.614;665.969411327523;3.505;0.152200525623267
108;877.126;40.5512880683226;14026.598;648.809180341977;3.549;0.14334922392534
109;857.796;44.1074062261676;13730.952;703.731317575096;3.607;0.156272198423143
110;874.297;58.3838587368137;13984.776;932.411115658726;3.554;0.223123284307131
111;882.81;45.356090439982;14128.445;729.752773523328;3.555;0.127534309109335
112;878.285;43.1140805885933;14053.274;691.018799052542;3.553;0.140146352075244
113;872.001;37.4081978849569;13949.422;599.325710608176;3.587;0.0918749149659539
114;885.259;41.2819375635397;14165.151;661.172020164991;3.479;0.149963328850745
115;879.144;37.0406277484587;14065.521;590.365320195088;3.506;0.18869022232219
116;885.806;37.6757673312669;14172.573;601.358527569862;3.466;0.131240237732179
117;889.929;33.9300702769722;14241.636;541.78092707655;3.46;0.122392810246345
118;881.763;41.138320590419;14107;657.902832521657;3.516;0.115342966842346
119;874.991;46.9602741580593;14000.441;752.716808267829;3.499;0.156041661103685
120;871.306;37.6061016857603;13940.68;605.543671141939;3.567;0.119837389824701
121;894.395;46.0511574773127;14304.451;735.254301931696;3.497;0.108448144290255
122;902.604;51.0536328188316;14447.871;818.347028300974;3.46;0.147037410205692
123;886.215;39.7370658831293;14178.412;636.644933865035;3.523;0.11916794871103
124;899.741;40.5260991090925;14395.171;642.527032185354;3.454;0.149077161228678
125;919.847;43.3661640106668;14718.756;696.209507004949;3.393;0.151726728034324
126;889.407;31.8617915535213;14227.527;512.145585513559;3.47;0.0985900603509195
127;891.664;41.3159708103277;14269.526;661.277574611422;3.508;0.106564534438071
128;920.534;52.2337006538872;14724.338;836.472474679248;3.42;0.178885438199973
129;873.694;42.8545808986664;13984.417;684.753172465037;3.563;0.141424891727018
130;873.316;50.2169641057679;13972.242;804.10355876344;3.532;0.177865117434534
131;872.374;43.5854811147;13954.471;695.723873752366;3.568;0.111874930167559
132;880.595;48.6453254177618;14092.015;779.442396681698;3.512;0.155679157243334
133;888.105;50.6864724063519;14208.105;811.779517655474;3.521;0.211208427862129
134;878.183;61.3649276134179;14053.144;984.515196776588;3.538;0.180709711969227
135;900.817;53.4342418398562;14413.792;855.599659791871;3.449;0.156617368130089
136;901.788;51.9831070252605;14426.495;833.284006437746;3.467;0.165169609795497
137;905.845;63.019579219477;14492.692;1006.45774761586;3.451;0.218423899791207
138;898.913;55.2954334552162;14385.789;885.224885466389;3.423;0.166616325730704
139;864.773;66.7310452563134;13834.428;1064.25235919683;3.61;0.246373699895096
140;890.102;48.9341126005159;14240.138;786.140758793275;3.523;0.173496397657117
141;897.823;43.3517471504903;14366.447;688.011425225713;3.464;0.100915806492346
142;900.399;42.7198032415878;14408.078;687.680830339217;3.447;0.11109005356016
143;866.893;39.4203850945166;13869.296;626.321160606948;3.576;0.189957890070411
144;874.891;55.0803840672899;13999.464;882.590203992801;3.566;0.23682060721144
145;876.979;57.1754584502834;14029.766;914.750874503031;3.549;0.28168954542191
146;873.134;69.5960733375102;13969.832;1114.77293470733;3.536;0.258889938004547
147;882.441;46.453530640843;14118.461;748.314533835219;3.521;0.222910295859117
148;882.469;34.2108843644801;14118.496;546.803130590827;3.544;0.178392824967833
149;893.688;34.3034359211978;14302.096;546.355005673015;3.473;0.150269757436403
150;879.92;44.7312365132048;14077.895;716.358599896001;3.559;0.193103599137871
151;878.875;58.0140997086054;14059.892;930.752084959302;3.521;0.227791571398068
152;871.321;51.484721704599;13941.815;824.493455901896;3.611;0.220565183109222
153;878.606;51.9446378753396;14059.567;828.667975464845;3.557;0.140360250783448
154;896.965;41.810208382643;14349.842;668.307107755099;3.48;0.149666295470943
155;893.084;33.8372135968636;14289.748;542.303110700987;3.462;0.100776981498763
156;888.484;35.7815380329004;14216.274;571.327109337567;3.464;0.100915806492337
157;898.833;32.2919398766931;14382.348;517.856337159172;3.427;0.111897274318918
158;886.629;31.0283600759031;14181.182;495.255920828794;3.522;0.0802246844805311
159;866.955;59.5625149317904;13874.8;952.149326019827;3.632;0.267387359461896
160;884.759;40.0691366141069;14156.242;640.029776491651;3.545;0.155322245670078
161;887.67;39.3634927312084;14202.248;632.954251092447;3.485;0.132079521501248
162;883.602;40.103119030816;14137.55;637.848504678042;3.489;0.114057003292207
163;869.07;63.6754857068242;13904.009;1019.81116827039;3.631;0.324451845425478
164;890.108;65.3981450501463;14243.625;1047.73311813887;3.537;0.174014367222936
165;893.54;66.3583072418247;14297.33;1058.59136871597;3.464;0.197342342136706
166;886.973;56.0805627735639;14189.769;897.282741742533;3.501;0.220474488320079
167;903.84;58.4467855403539;14458.558;937.417647900856;3.5;0.178885438199963
168;905.305;52.2884647412798;14487.667;839.47920148207;3.444;0.181670030549891
169;867.576;44.8267039163039;13884.728;713.638872354867;3.568;0.133176574516689
170;879.806;37.4200102084442;14076.216;598.92918713651;3.556;0.189007936341304
171;888.592;25.4873720889388;14214.763;406.879763911854;3.503;0.0544150714415776
172;904.996;40.05239723163;14483.344;640.169804430003;3.41;0.148189068422736
173;896.008;37.0214834386709;14333.814;591.576338103571;3.479;0.14842169652714
174;898.186;27.1216390360164;14372.366;431.005840034765;3.47;0.0882043082847917
175;903.506;31.970691015365;14456.686;514.707508206359;3.479;0.106437775249195
176;908.891;35.0984057900008;14538.625;561.875915701155;3.477;0.12108261642365
177;907.003;38.9780833417938;14512.139;623.034262275364;3.484;0.121424873893271
178;888.322;30.8358803344434;14212.36;494.9116342136;3.464;0.111642285895621
179;899.078;24.3949420167329;14387.655;388.656721059732;1.554;1.63997073144614
180;192.976;15.2340166732218;3075.199;238.722197394802;4.39;0.437721372564791
181;198.294;19.0699911903493;3173.095;304.756585269293;3.974;0.244630333360351
182;199.244;11.3820307502661;3187.776;186.912597766965;3.925;0.350321281112068
183;202.375;15.5376280364798;3235.826;248.701968315494;3.841;0.256298653917653
184;206.891;13.2230983131791;3309.061;211.85663654698;3.991;0.542484101149522
185;203.822;9.13742939781183;3263.955;152.912465499069;4.01;0.377730062346118
186;196.291;16.8077312270274;3143.609;263.604907255163;3.935;0.211246301742776
187;195.891;10.947316977232;3133.457;182.562267736249;3.884;0.277676070268925
188;203.218;15.3396954337435;3250.773;249.744813361555;3.831;0.311655258258222
189;204.002;15.1681915863425;3260.05;250.843648913027;3.943;0.198345657880379
190;199.102;13.3268051685315;3189.225;213.505417694724;3.782;0.284984210088909
191;194.2;11.2235538043888;3109.087;186.947310387184;3.91;0.259769128265847
192;192.302;13.2234207374642;3073.336;215.398744713141;3.958;0.256585268478147
193;196.095;12.263242841924;3137.534;196.716078305769;3.951;0.423189083034986
194;194.602;19.225964111066;3113.94;304.849705363154;4.146;0.494089060797747
195;197.9;18.0808771911098;3164.097;289.350043582162;4.066;0.225308677152021
196;195.598;12.366361469729;3132.58;201.500851611113;3.991;0.18689301752608
197;202.097;12.8878571143537;3235.587;210.46191527447;4.053;0.436624552676556
198;192.101;13.4312273824847;3067.828;219.35116775618;4.069;0.456649756377907
199;204.104;12.4797165031907;3266.046;196.854723346936;4.133;0.447013422617267
200;203.561;8.36460094684763;3256.193;137.322253262161;4.434;0.564680440603357
201;198.235;13.9218111249938;3172.054;223.242442210257;4.196;0.309295974755566
202;205.694;11.0569048110217;3289.391;176.572975760724;4.199;0.337533702021002
203;196.007;5.57840846478643;3138.537;87.5780028374783;4.194;0.456447149185967
204;190.292;9.65593061284098;3048.687;151.487757792514;4.03;0.226495033058117
205;206.209;12.731482592377;3295.941;202.64858210459;3.938;0.249070271208737
206;198.106;11.5647007743388;3173.895;183.786841272711;4.093;0.312571591799384
207;200.362;13.1545078205157;3200.977;213.223718289033;4.039;0.250697028303096
208;193.216;11.4150498903856;3090.156;180.962163901736;4.069;0.278188784820668
209;196.397;16.7124444950465;3142.939;266.98389095412;4.191;0.431218042294143
210;200.3;13.0239341214546;3208.507;208.305091058764;3.998;0.307662152368471
211;190.389;9.21847324669291;3045.337;150.700354017513;4.177;0.438521379182357
212;197.021;8.61425034463185;3149.456;139.825009079206;3.884;0.288277643947643
213;193.501;9.6999561339214;3094.819;154.397276948134;3.881;0.235730778643771
214;201.595;12.8747071811362;3228.311;207.566661988382;4.179;0.270830205110133
215;194.998;12.2356068913644;3118.673;193.594673069797;4.032;0.288506499060245
216;194.101;9.98718824294389;3109.431;158.365099213817;4.038;0.256819002412205
217;196.801;16.1992743355994;3150.447;257.854180732055;4.121;0.47162379074851
218;196.998;12.7921114754371;3148.177;203.980117464916;4.066;0.244303090442986
219;198.497;17.8243401280384;3176.153;283.769217923652;4.084;0.286712399452839
220;191.289;15.0404318089611;3057.323;240.250386099584;4.201;0.256337667930418
221;194.517;10.5213070005581;3114.287;170.840434561028;4.27;0.822070556582584
222;200.798;14.5500280412101;3213.352;231.553377682125;4.35;0.419237402911529
223;191.156;12.2152439189726;3061.287;195.531872954261;4.251;0.339954408707998
224;186.94;9.80049590582004;2992.033;148.930598001211;4.134;0.387896893516816
225;195.002;6.39891678333127;3114.915;103.399646058377;3.971;0.211445028317057
226;204.498;11.1550013895119;3273.36;177.426012748982;4.281;0.194496786605851
227;191.4;16.4721012624376;3062.102;263.328324105097;4.301;0.39652112175772
228;192.481;13.6885415220177;3080.506;218.848192690733;4.144;0.390415163639938
229;191.919;13.3109281795069;3067.908;213.828304104017;4.037;0.233154455243722
230;193.799;6.5949760424125;3103.689;108.58420791717;4.13;0.192665513260672
231;189.894;14.3678447931486;3040.714;225.618901699303;4.226;0.319098730802873
232;200.702;18.4675194869262;3211.445;301.937539741252;4.198;0.330962233494994
233;198.407;9.05938965935391;3167.904;145.948773218557;4.172;0.287221169136271
234;183.891;16.0360939445988;2949.88;258.561744888915;4.249;0.414353713631237
235;197.407;11.1019124928998;3152.436;171.884037141317;4.497;0.384084626091691
236;189.097;10.6891899131785;3025.933;171.687081054459;4.444;0.442610438195928
237;202.798;5.56950410718913;3246.157;91.0691721769765;4.391;0.240351825455928
238;205.998;9.85353824775635;3295.45;155.791517548293;4.304;0.349805660331558
239;194.304;14.7842424222546;3109.176;235.776169414976;4.104;0.25931448089143
240;196.196;11.5146812374464;3140.545;189.582481271345;4.266;0.51049387851374
241;198.998;9.59294824337135;3185.964;152.738518075849;4.214;0.241047713119201
242;197.208;12.1286798951908;3152.418;195.313158891048;4.43;0.585440005465971
243;193.999;13.1343865102256;3103.096;213.222588493801;4.058;0.223060529901636
244;191.806;18.0254426852715;3070.169;291.333915411519;4.361;0.450742720407103
245;200.693;17.7917396844714;3212.159;284.312625201556;4.354;0.355054925328447
246;201.105;20.0194716463748;3218.097;319.614659865595;4.494;0.60284658081472
247;199.303;11.6502489672966;3185.728;189.805189749907;4.485;0.338533602468058
248;198.097;9.7088290231111;3171.973;156.677601657037;4.676;0.727065334065654
249;199.588;13.8998329486362;3191.52;219.867091352932;4.228;0.209465987692507
250;198.917;14.5018626734641;3180.78;233.078197092732;4.325;0.39563240514397
251;195.793;5.66967909144758;3135.611;95.2942060620804;4.377;0.765898818382684
252;196.398;9.91804799343105;3140.86;159.22193052467;4.204;0.311390430167653
253;193.799;10.8202490267089;3102.279;170.305840090707;4.082;0.255921863075438
254;201.807;11.6864400481929;3228.731;187.391175216447;4.375;0.353050987819042
255;191.993;11.0762882320747;3071.091;177.652270936792;4.267;0.238539304937362
256;199.801;13.6283010313098;3199.629;220.079728755285;4.528;0.555496174604286
257;200.701;13.3286409284666;3210.809;213.762990129253;4.629;0.500008999919007
258;193.301;11.03201926213;3095.318;177.358867655376;4.455;0.45537347309653
259;201.702;14.077192049553;3223.033;224.768602658378;4.327;0.342141783475803
260;197.503;11.0267438983597;3160.256;176.287788981535;4.344;0.230833273164849
261;204.196;9.84874022400844;3270.599;159.783386836684;4.673;0.698270005083992
262;193.594;14.728941713511;3091.504;234.895205749291;4.85;1.17538078936148
263;198.104;16.9572870471667;3176.35;269.845075589679;4.328;0.529373214282701
264;195.085;9.92938190422808;3116.253;159.715951992909;4.423;0.472547352124627
265;196.196;10.5546607714319;3139.611;167.406470690352;4.535;0.461307923192303
266;201.101;13.310776423635;3218.037;211.295464317146;4.524;0.660290845006962
267;188.521;13.7718643981123;3015.918;221.032448875721;4.514;0.491817039151755
268;196.397;9.80115508498892;3141.052;157.430994966033;4.853;1.23661675550673
269;195.308;9.35870375639762;3126.005;149.948545258031;4.282;0.213485362495879
270;196.188;11.981881154477;3141.503;197.320268348177;4.475;0.410493605309506
271;194.315;11.2519458317218;3107.351;179.814592035786;4.388;0.401666528354064
272;190.801;12.623726430813;3054.302;204.255515705205;4.431;0.523936064801802
273;197.297;16.8145151877774;3159.354;275.102190074888;4.483;0.409976828613522
274;192.203;13.287170541541;3068.152;216.033246645042;4.416;0.261541583691774
275;194.496;15.8984296079834;3115.233;258.098602671529;4.773;0.944934389256742
276;196.801;14.8323446899;3150.013;236.771414915313;4.395;0.303850292084762
277;198.807;15.8897111679225;3175.402;252.687950278605;4.28;0.414463508647024
278;189.496;12.3790170853747;3033.925;200.162287619315;4.264;0.304341912986037
279;192.196;14.9682224729591;3081.138;240.136084368842;4.321;0.342299576394714
280;200.603;15.0599635125719;3205.754;237.250516846645;4.858;1.37545483386406
281;196.801;12.8008026701455;3149.218;204.017103439888;4.303;0.332807752313554
282;193.402;15.215204763657;3091.02;237.833042658088;4.272;0.413250529340254
283;191.929;13.9653639050332;3072.352;223.69164234722;4.231;0.372570798641013
284;191.068;9.50353071231944;3056.508;155.026256279373;4.412;0.41734398282471
285;200.403;18.6587170244904;3207.051;299.415610863902;4.319;0.222820555604718
286;196.001;10.0139966546832;3135.004;156.586839881258;4.436;0.414154560520575
287;194.19;14.8688970673685;3114.025;236.757243532271;4.366;0.318910645792822
288;191.193;15.3428491812961;3052.475;250.362444478005;4.568;0.643129846920509
289;193.223;12.9606458558201;3097.986;211.384815973145;4.722;1.20502946022079
290;195.195;13.1251066662333;3117.35;205.878622251062;4.584;0.348057466519546
291;198.003;11.6631942880155;3169.446;188.416863268655;4.526;0.446636317376903
292;194.1;10.2944674461577;3106.326;161.10770733891;4.346;0.270007407305782
293;197.599;13.201034391289;3161.476;210.146146726508;4.454;0.445201078165811
294;195.807;18.2969085093632;3133.804;291.106265174761;4.462;0.523484479235057
295;203.193;12.3804224887515;3252.079;197.233380514053;4.298;0.32862744864057
296;192.804;10.3484155308916;3079.475;163.322137522759;4.504;0.386346994293988
297;196.201;10.5931925782556;3143.999;174.371472176505;4.252;0.33795857734343
298;190.463;14.4570889531746;3041.617;235.767648122048;4.43;0.338526217596219
299;194.14;10.7106143614636;3108.038;172.41072772888;4.515;0.330613066892406
300;186.5;16.2620441519508;2984.008;257.639708344809;4.193;0.461606975683867
301;191.5;14.6482121776005;3064.118;234.281664361512;4.292;0.373839537769886
302;202.281;10.9139208811498;3236.513;175.36393489255;4.463;0.358832830159131
303;201.42;11.6205946491558;3224.915;187.883170414485;4.341;0.294260089036905
304;197.696;11.8360349779814;3160.23;186.075221026329;4.393;0.474469177081092
305;190.891;12.4744165795436;3059.755;201.810636947118;4.214;0.342613484848443
306;206.003;14.2310175672719;3290.161;229.008712299336;4.681;0.421650329064275
307;194.596;17.2783067457433;3116.941;274.242723456791;4.195;0.389955125623445
308;197.697;13.9200826506167;3162.864;226.033779077377;4.496;0.480129149292142
309;198.791;11.0725412169024;3178.57;174.700164853954;4.397;0.181165670037119
310;196.505;12.5521306956232;3144.864;201.544444190354;4.316;0.465600687284709
311;201.31;10.0984642396753;3221.356;163.134550613911;4.504;0.465450319583092
312;198.8;11.4348616082571;3185.086;178.28270029366;4.494;0.356600616937192
313;202.4;9.88129950967976;3234.321;157.21517671331;4.373;0.220410979762819
314;204.098;13.0543676982073;3264.682;211.138882956218;4.791;0.621296225644417
315;199.502;15.052113339993;3191.619;241.102847533992;4.472;0.481825694624107
316;198.797;13.9564673538828;3184.822;221.885340606358;4.469;0.426203003274266
317;200.905;9.20235649168214;3211.582;146.684803766428;4.449;0.472259462583864
318;196.198;10.7093807477367;3143.966;175.482111863299;4.344;0.441660503101657
319;198.7;13.1801411221582;3177.603;211.088833008755;4.313;0.337492222132597
320;194.906;16.2404219157015;3116.7;260.427861988692;4.391;0.335274514390819
321;189.79;9.73193916955867;3038.842;163.1495780442;4.287;0.287090578041135
322;194.11;22.6898307618195;3100.266;362.263955540712;4.448;0.37602659480414
323;195.201;7.14840184936489;3124.914;111.443109091603;4.448;0.376823566142042
324;201.785;13.6898117225912;3230.628;217.286472096177;4.926;1.54617075383025
325;198.715;15.1887348057702;3179.039;238.087258938826;4.61;0.270702789051026
326;194.095;7.65160669402222;3106.099;119.763369312168;4.557;0.339176944971202
327;193.803;10.7346821564496;3101.269;174.706612092955;4.332;0.314318309998008
328;206.698;9.34927355466725;3304.354;151.282764464418;4.84;0.564074463169534
329;197.501;17.1465171098972;3158.431;274.931359231723;4.713;0.512328995861059
330;197.496;12.9131794690539;3164.748;203.593913504308;4.451;0.406459100033453
331;206.903;12.8131448520655;3312.056;200.033300387717;4.687;0.491183265187236
332;192.2;17.7119750451497;3069.71;281.948914486291;4.445;0.207665596572986
333;204.199;16.9807128531164;3273.861;277.253859249964;4.611;0.272706802262052
334;203.488;15.2439796641166;3250.231;240.511004008129;4.521;0.383287098661044
335;190.409;14.2682622978414;3045.242;227.657502832656;4.596;0.755303912342575
336;193.402;13.2343687420295;3101.848;211.794680140919;4.404;0.413114996096718
337;199.601;15.5058327412624;3189.02;251.814540604796;4.585;0.481170447970376
338;202.396;10.6490987412077;3241.046;169.954305400011;4.547;0.489286214806832
339;197.3;11.9162108071315;3155.277;191.385374104184;4.553;0.756875815441347
340;201.808;11.9141628325286;3226.826;194.164304144716;4.609;0.247969756220394
341;196.295;16.7291698837686;3141.041;263.488819210607;4.687;0.41825948883438
342;186.704;16.7082148657478;2987.372;267.015463402405;4.676;0.449070150421955
343;194.288;9.07732978358774;3109.503;145.957827405725;4.422;0.427686801292729
344;197.006;14.3843207695049;3156.428;231.26409270788;4.435;0.294558992393726
345;186.402;11.5771531906599;2975.741;185.135638570743;4.547;0.292200273784953
346;197.988;11.7396241847855;3170.091;187.578703292791;4.411;0.310723349621491
347;190.014;10.4520181783235;3035.924;169.167567116159;4.405;0.331066458584977
348;191.491;14.9875651458132;3068.859;237.655967038498;4.538;0.39450728763865
349;198.004;14.4763304742605;3165.946;229.210016282012;4.343;0.228606649072152
350;199.7;7.15164596439218;3191.879;113.339835490437;4.484;0.510337143464984
351;196.101;11.54928002085;3142.713;181.815529537479;4.439;0.564578603916231
352;202.3;15.5360895980936;3234.906;251.261758459187;4.48;0.282878065604254
353;203.001;18.0839732636387;3250.805;287.822212667819;4.388;0.308862428922653
354;202.6;6.24724739385301;3238.812;99.3572695679433;4.808;0.453911885722333
355;204.778;10.7706776017103;3276.849;175.686137782677;4.703;0.585013675053847
356;192.026;11.1834665466484;3072.61;176.399794047509;4.622;0.510309709882152
357;198.497;15.2089151815635;3179.527;237.403107774506;4.744;0.532863960124903
358;202.893;10.5548766454183;3242.691;168.080978962528;4.548;0.405383768791991
359;188.663;12.7718487698537;3021.107;208.689314486879;1.322;2.03429987956545
360;761.592;43.9276780173941;12192.587;705.030344652604;427.347;29.2448699945818
361;776.79;35.5840275966624;12432.01;571.245776299507;856.173;56.8653631044417
362;799.94;35.3756520787966;12798.015;567.968385321698;1278.812;78.5879379803257
363;818.88;36.7528635619082;13101.766;582.550684150365;1691.133;113.601462671044
364;832.394;41.4942148256884;13321.874;662.532766830466;2068.433;130.388428478142
365;836.196;40.9484608257756;13374.318;653.868039145548;2441.656;162.658637286806
366;846.07;51.5887402443575;13541.631;827.619448641098;2823.608;166.144234194274
367;884.237;47.1447490289258;14146.687;751.155793162131;3174.427;190.131833107983
368;891.931;39.752741150766;14268.99;637.107580162084;3524.71;223.798271038898
369;912.834;37.4090355930194;14604.55;599.773653706131;3847.71;210.096507062821
370;865.243;60.5626947963841;13846.478;968.159352873228;4217.98;233.41877113891
371;919.485;48.1388905667768;14714.44;771.975006486571;4542.005;262.872847827632
372;925.106;70.7630680793293;14802.803;1129.04483131584;4846.306;281.403898736333
373;905.19;78.715479036846;14478.829;1261.85729317896;5200.903;334.235121166211
374;931.709;90.3934352096424;14909.737;1443.59024043564;5492.912;400.512844433237
375;952.614;61.9998174513464;15237.814;992.528401852597;5796.95;408.062460439595
376;960.503;51.3442752505073;15368.977;818.971420429911;6077.301;460.561078934175
377;971.34;62.091530662399;15543.243;993.457154567347;6380.763;494.858946853533
378;971.335;60.1585425770961;15536.859;965.016197661454;6649.427;498.812011063285
379;948.111;80.5458782868479;15176.457;1290.60644536632;6984.188;566.071761878306
380;962.318;50.1611594363647;15397.19;801.425781117671;7252.716;579.405789256562
381;950.803;63.8139373569767;15208.35;1017.47254179168;7533.274;614.729485549541
382;971.786;55.0764371033576;15551.57;885.351436029741;7826.191;669.656671712456
383;949.986;90.236264904969;15198.756;1449.54239911222;8143.488;707.528494278494
384;989.607;41.1955995344162;15836.714;662.958744254905;8394.948;711.612255034991
385;977.932;64.9645556900066;15645.101;1037.19490677935;8716.525;714.877311896939
386;984.734;52.4037504764694;15759.048;836.738536256147;9003.606;740.141260992785
387;974.633;29.7401546902571;15590.997;475.827992389114;9264.021;728.769390581826
388;986.121;53.4421929658569;15773.263;857.434832987877;9536.79;771.124963841796
389;975.502;47.3951822024113;15610.847;757.712568709848;9799.528;808.40533643463
390;995.617;61.804330277094;15931.871;989.836992766432;10085.327;829.072560552436
391;981.187;55.4145195864719;15696.29;886.336456014266;10397.999;846.92836244219
392;971.985;29.6092337793456;15553.167;477.71772131772;10626.325;879.340502413596
393;975.307;55.3241094008753;15604.899;883.378553831262;10935.07;885.15229583389
394;987.653;55.7569570636695;15799.335;894.53157145232;11233.064;895.504503151173
395;965.153;55.8120567709169;15444.247;895.385491395214;11535.876;859.136920033122
396;970.413;42.2133159204478;15524.615;675.03957333256;11831.294;891.524654277183
397;982.533;52.6673029592362;15723.156;846.945517305522;12046.265;907.721184684468
398;996.524;58.266071980185;15947.675;929.915269433182;12394.936;887.501021894619
399;953.114;37.9100841993256;15248.345;609.987290101182;12667.271;927.714316537727
400;939.861;48.035032101584;15036.783;766.110076373465;12919.933;934.70199545149
401;940.11;55.2952005150539;15041.865;887.508295783741;13276.614;996.939424320217
402;927.335;55.3756728627304;14836.182;881.695826153196;13634.78;952.536874215383
403;933.68;52.1741773294017;14938.084;837.001548005699;13907.139;964.219012117574
404;946.915;52.1593798371841;15151.719;834.301037880812;14185.352;981.809162697112
405;959.583;40.3294173154054;15354.333;641.715945883314;14550.429;1043.90619722708
406;961.133;45.6171301267419;15378.332;733.701861545966;14836.904;1008.4111908562
407;978.485;74.7315996416512;15657.759;1192.59521003942;15082.461;1059.10598629648
408;969.544;70.0012703027624;15510.098;1121.78317647214;15376.34;970.441317916752
409;958.79;71.2777293409359;15340.042;1139.99863685708;15685.735;1017.95203007064
410;971.262;73.536806267338;15538.486;1176.27268079471;15969.658;1018.16470963982
411;1000.814;78.0098950390269;16016.225;1250.04609890393;16230.867;1041.284174921
412;992.977;54.8757123051702;15883.838;874.953385087471;16525.776;1060.20483362603
413;974.919;55.8274431529918;15598.273;892.865835969213;16796.564;1091.40681095729
414;994.56;53.1566545222745;15912.554;855.358200126736;17070.069;1096.64502187764
415;984.612;36.6547876272594;15759.499;583.134624258395;17346.786;1079.80380387549
416;941.832;54.4746869288848;15068.388;868.205942882193;17661.971;1099.42380591332
417;958.798;45.8070775754125;15337.677;733.552020787223;17982.884;1119.40067584576
418;942.066;54.9165430812943;15077.075;878.598291954252;18282.195;1211.19148964357
419;948.84;40.4082899910403;15177.163;651.049462607114;18580.328;1224.58175092401
420;965.667;50.3962165345811;15452.156;807.114758261837;18778.569;1187.23526648645
421;943.2;49.5964216451124;15089.684;795.057884209695;19121.694;1240.93491347612
422;965.525;36.7747786533111;15449.298;584.095683973078;19397.209;1230.98371538737
423;967.695;64.931133249006;15483.734;1040.45525471495;19749.649;1253.35033503366
424;963.201;28.7369940842817;15411.319;459.097613159619;20069.873;1234.30306046814
425;973.669;39.2314604494952;15579.388;622.330972839977;20328.767;1307.60611738439
426;964.925;34.2404057364986;15441.895;544.452995680078;20620.879;1284.14331833683
427;968.399;35.1335279896537;15487.903;562.539539891187;20883.113;1317.98952812264
428;970.603;60.3231390181219;15532.247;966.963329936081;21145.236;1294.36765820375
429;970.804;58.7605471723993;15534.946;941.095635609857;21488.673;1282.46157283602
430;964.967;94.4528514180484;15432.562;1510.87286774766;21806.951;1393.59129801715
431;967.007;83.6398724353398;15478.745;1340.52830975144;22039.339;1343.15646973426
432;954.344;71.5450349360456;15267.585;1145.96296382779;22359.711;1377.17559646868
433;956.418;77.8230578684739;15303.895;1240.65789292014;22648.142;1458.80319026111
434;961.395;67.7829077644194;15382.947;1083.97264745057;22930.517;1401.98962660966
435;967.111;54.6022397800659;15468.609;874.985342739502;23219.585;1396.28952297334
436;963.37;50.6643551227116;15418.214;812.850227387601;23556.959;1429.37339080771
437;983.73;45.8744970544647;15736.696;731.038801517411;23730.741;1491.15538440135
438;988.566;53.478316764835;15818.94;854.30740553969;24071.031;1447.48928854385
439;986.201;50.4710490182273;15783.016;801.516257242505;24376.145;1469.06728548594
440;992.956;48.1215511387574;15885.202;771.50631010766;24643.016;1505.23311509677
441;991.034;54.7575533054582;15856.939;878.993472893312;24952.876;1486.22985963277
442;948.821;55.1434452043011;15178.238;881.937889953733;25270.002;1522.9371044453
443;988.441;81.9739906860704;15817.664;1308.49771650698;25546.66;1560.42992317511
444;951.634;74.4696236327274;15226.522;1190.94683668749;25776.228;1562.526913079
445;968.304;62.3486250369674;15492.954;997.873752287359;26108.508;1654.94333411019
446;961.199;67.5530836379815;15379.513;1081.41343990213;26339.587;1596.54097296657
447;972.082;55.6082910724655;15549.901;891.11252255195;26721.427;1619.82488702356
448;986.087;51.4963676486006;15781.069;825.399220249793;26920.314;1718.13620301296
449;983.228;55.1636289234127;15729.849;882.920681946616;27255.754;1645.52874508594
450;976.513;63.2128040906283;15620.695;1009.64289760537;27509.736;1771.64959204233
451;976.69;59.3663473695298;15630.017;949.579132774654;27751.899;1691.23990121707
452;977.104;74.9064554227462;15633.67;1199.1910445213;28156.739;1755.98319988229
453;978.342;81.0627126119032;15654.29;1302.39717176445;28311.504;1799.41278920211
454;994.131;52.0938450203075;15904.887;827.077533173844;28668.335;1787.88803847586
455;986.639;55.5955723866521;15786.222;895.779596528108;28984.22;1866.63457361099
456;991.157;40.3505150029119;15856.915;643.566105870253;29241.683;1817.90403110312
457;1014.706;56.9565845534985;16233.776;909.636725349231;29406.855;1930.86907249175
458;1003.695;53.6006076924492;16064.706;860.495017942565;29666.183;1854.41985112353
459;1005.029;56.2215448827246;16078.176;896.485446666052;29943.157;1997.70424303028
460;986.902;63.7040777030787;15789.977;1021.90436345143;30203.211;1854.76824981695
461;1002.65;59.8750485594786;16046.198;958.726415280175;30488.201;2048.74394938188
462;1008.645;49.1869869477741;16132.804;782.992434359438;30751.992;1888.46733625342
463;986.707;40.0548231927201;15790.733;642.25449457446;30975.479;1939.24914495508
464;977.635;61.6419270058937;15645.954;981.700413957321;31315.776;2001.74909896921
465;989.459;41.0650290271431;15825.065;657.509431844927;31606.184;2123.86899154443
466;979.599;28.6350468656858;15676.357;461.343687765366;31884.771;2038.12054786497
467;979.898;32.1304222816959;15675.482;512.79848051263;32180.457;2162.45973378956
468;975.609;42.434325127189;15612.751;678.488802979803;32401.496;2009.23271385978
469;977.883;52.9095392249798;15644.544;842.091784014081;32765.163;2201.74900428761
470;975.677;43.4115450197296;15612.129;692.426723595341;33051.898;2082.59940517029
471;976.242;48.1970681266012;15617.872;775.721375118696;33239.259;2219.52949867064
472;972.723;70.0848756936911;15565.761;1126.43042919171;33591.862;2119.83490454234
473;967.425;75.0208104794938;15482.488;1195.7150637823;33840.86;2219.5726769268
474;967.865;65.9455239193671;15480.828;1054.09160841742;34082.098;2200.45066946666
475;978.371;61.4843702822136;15655.524;986.593844499375;34328.994;2214.3324896962
476;952.477;68.3483138124156;15240.007;1089.78683234886;34640.778;2268.04799860048
477;961.445;50.6453943118235;15380.895;809.243847159197;34952.74;2254.56387371925
478;965.892;40.273257082087;15453.054;643.515734340713;35264.482;2220.59015570546
479;966.305;55.3707130620521;15460.08;884.136027000386;35587.816;2295.52823618964
480;961.598;55.9492945085134;15387.263;896.809242671471;35843.545;2304.70071937882
481;971.058;63.2979373755571;15535.536;1010.4699641375;36169.332;2338.51538393391
482;997.033;37.5761288719281;15953.534;601.629008180232;36301.924;2372.02081104366
483;985.505;41.3364118544394;15770.601;659.883560462735;36762.575;2415.23675385772
484;1004.699;53.2301073547708;16073.487;850.571777700682;36961.517;2415.12182014082
485;1007.373;50.3777788414702;16116.877;808.792468697055;37293.081;2412.87575662087
486;995.916;64.8446547064618;15938.546;1039.77862728758;37430.535;2459.1204311348
487;1001.226;71.0270265743929;16016.606;1140.20442889154;37828.187;2357.13729848752
488;990.698;67.4982875042033;15855.643;1075.03445995979;38038.104;2439.04036753068
489;969.58;56.1144509017076;15506.99;898.767777237206;38185.824;2609.95651655025
490;970.715;68.6222598360031;15532.93;1094.6291106672;38585.477;2408.86242908987
491;982.599;68.4566294013977;15720.472;1100.64340739227;38879.647;2657.37900330384
492;990.695;45.051898350679;15853.819;716.234568454408;39149.105;2510.04718484032
493;974.486;34.4444132480139;15590.072;549.611495127327;39360.407;2502.98411229098
494;966.207;55.896855018865;15456.822;896.224714508578;39715.369;2527.50695664112
495;970.873;69.3869959070155;15535.975;1106.43791863123;39929.145;2508.65124028923
496;968.526;50.0711140678908;15501.634;804.430735566468;40301.456;2698.47370893702
497;967.233;37.4900330888135;15469.654;593.989016113929;40584.679;2602.08919341153
498;960.954;43.911777964459;15376.992;707.358351852811;40803.73;2594.76630081785
499;962.918;55.8377221598449;15407.18;890.99568974267;41246.898;2635.89098477836
500;939.805;72.2337356433954;15039.173;1156.23197739079;41395.936;2639.70270765934
501;960.981;53.2208909076168;15372.891;858.635496336488;41779.286;2797.42383459209
502;971.043;45.2793953250248;15538.077;720.55740984398;41996.338;2683.78588480818
503;975.761;30.4921591396944;15613.7;485.968802537756;42227.448;2742.85547296888
504;982.368;40.0596202677957;15718.303;644.648901527833;42694.294;2884.85640287064
505;966.696;57.4370701202645;15460.935;915.734262428232;42918.149;2804.71595230411
506;959.866;62.4319469822937;15360.945;994.365439858551;43149.259;2785.83947182685
507;964.774;61.5724680681204;15437.489;989.040775503681;43549.398;2952.53033814994
508;975.504;45.3178587755386;15605.26;722.778805984239;43778.762;2887.70746692519
509;944.969;74.4409570666578;15119.496;1191.93750984018;43933.265;2836.45470816379
510;992.086;63.2705106981121;15875.072;1017.74638163738;44408.163;2847.23265648258
511;964.778;40.9086721368445;15440.132;655.380652976557;44652.152;2904.87077077717
512;973.799;31.9292597627958;15577.579;511.64100888116;44816.806;2963.59755313432
513;975.174;50.4659659968974;15602.573;802.371570371885;45300.332;2960.39190257219
514;992.398;33.043893475198;15875.283;529.178976926512;45463.465;2957.65047595972
515;976.879;90.9224274258;15631.571;1456.18610539619;45721.135;3143.71020756441
516;972.121;34.599998684975;15553.332;557.768581901124;46123.425;3014.18110193213
517;978.965;32.4092617163691;15665.324;517.57365665577;46289.52;3011.3898867333
518;971.33;46.237261597111;15543.088;740.281732015623;46551.871;3200.82930796207
519;956.617;41.7476020988061;15304.456;667.365418915263;46959.891;3042.93817005036
520;969.892;46.907974332734;15518.669;752.301339417179;47130.582;3066.10472132583
521;978.792;47.9801287618114;15654.892;762.891593777266;47486.119;3303.78752489772
522;974.408;36.2259917186534;15597.335;579.512668528435;47813.134;3098.22759098222
523;977.701;39.929381024506;15643.993;641.359053293001;47986.928;3121.81497824842
524;977.038;24.5284548229252;15629.413;386.586876731629;48437.343;3382.46734285802
525;979.042;42.4997980701076;15666.371;680.222018923905;48684.899;3196.68168303156
526;963.316;31.6355051168731;15410.963;508.611151137073;48945.672;3160.07273737106
527;974.901;32.3723411108921;15601.81;517.154494459808;49407.455;3460.46887539607
528;986.746;28.8919473902399;15785.838;465.446346914455;49482.645;3289.20724555103
529;983.66;31.6615994542314;15735.572;505.670706701643;49751.228;3301.54618563433
530;982.29;29.5037004458766;15719.251;469.281168308614;49926.657;3246.5409457424
531;984.858;25.5214505073693;15757.832;411.712773442728;50381.725;3348.96911786392
532;971.847;50.5001338711101;15551.044;802.887825093905;50565.165;3377.9195757161
533;974.112;37.9172788580586;15583.401;607.301634847961;50740.48;3275.94925027545
534;981.476;29.4828286295594;15701.908;473.628127074358;51196.847;3276.19175366494
535;979.714;38.2879650020768;15678.025;617.553077107575;51483.916;3439.2963233377
536;987.695;33.953800450023;15801.602;537.234502276245;51483.916;3439.2963233377
537;992.785;39.5165014266244;15883.786;633.272957202542;52127.077;3335.71785266085
538;973.808;55.8918678879146;15582.423;894.648718168785;52419.36;3501.78520444646
539;965.56;61.4563606146686;15449.656;986.696868862969;16379.998;25053.3607331511
540;939.469;44.5358366823888;15030.708;707.278563888389;53074.205;3396.32740075896
541;1008.451;47.3015332626788;16138.997;757.379532797845;53267.826;3433.98729321823
542;1037.559;61.0695627051675;16600.435;975.355279313629;53371.799;3565.41248783774
543;1075.846;59.4380782327284;17210.344;954.321848133;53371.799;3565.41248783774
544;1092.613;90.0501370404274;17482.688;1441.86318495758;53751.378;3506.8156776078
545;1131.927;107.706162502432;18112.247;1721.99429433463;54050.636;3637.55870786778
546;1168.837;82.5885219688547;18702.002;1324.14617096304;54251.52;3735.30130781445
547;1206.41;108.466888588173;19302.366;1732.4850978418;54251.52;3735.30130781445
548;1216.861;127.183226366531;19468.179;2036.76123394691;54351.816;3772.68799088198
549;1250.6;165.899671006303;20009.404;2655.88313150336;54351.816;3772.68799088198
550;1290.007;159.697702679155;20643.414;2553.6047981518;54351.816;3772.68799088198
551;1338.742;110.000669343421;21416.786;1759.87479909907;54435.585;3593.66482431869
552;1325.091;136.420300208583;21202.163;2182.9443005677;54435.585;3593.66482431869
553;1342.653;140.3034274029;21478.952;2246.39741231067;54537.703;3656.38445664583
554;1355.399;97.5908208234741;21689.593;1556.5635295872;54537.703;3656.38445664583
555;1380.94;145.785245412559;22094.261;2333.28647839677;54532.333;3573.32953152683
556;1409.15;151.87863062327;22547.808;2432.82848935887;54448.564;3755.4814224416
557;1483.167;96.1712154493252;23730.91;1540.64064335586;54448.564;3755.4814224416
558;1537.224;42.609896784674;24592.476;681.274906366096;54348.268;3720.53071116696
559;1531.302;70.3354829087021;24500.655;1125.35350154747;54259.85;3842.10883558255
560;1560.381;57.2232278799386;24971.999;918.581987189456;54062.71;3808.49998949988
561;1586.193;45.2178480359204;25375.389;724.135838768592;53883.689;3989.26032326417
562;1573.198;81.9729324594468;25170.262;1309.22820269642;53777.827;3855.33805058409
563;1597.599;47.1599509011691;25560.391;757.330112413978;53677.531;3803.65548734498
564;1594.154;131.026192434949;25507.17;2093.82167981903;53492.186;3895.7726265561
565;1650.592;36.5253160972025;26411.777;581.360233762903;53119.255;4007.25758387277
566;1635.684;47.6181833336859;26171.436;762.180534193795;53119.255;4007.25758387277
567;1646.484;63.3602118367667;26343.53;1017.6948383675;52719.637;3735.77754158354
568;1657.606;59.8237625362942;26518.289;959.051430241877;52537.599;3826.25011236445
569;1672.889;53.2608374793414;26761.9;853.559987862572;52250.686;3768.13592013664
570;1672.766;50.2255626549012;26770.555;803.825445432717;52250.686;3768.13592013664
571;1690.818;43.1526126207942;27052.294;683.119471647329;51888.687;3889.38436399409
572;1699.111;43.0807027449592;27186.491;693.130747989782;51510.019;3795.11569376341
573;1702.47;40.1775701106957;27240.62;643.0261745374;51318.249;3700.89339454806
574;1679.08;88.3258502365085;26867.142;1413.73321851612;51235.976;3823.03470224961
575;1682.537;122.002801693236;26918.385;1947.10104264389;51047.629;3765.27837280193
576;1686.355;148.167009705264;26981.476;2371.20851771069;50589.138;3704.01707935277
577;1679.645;152.401068057282;26874.008;2443.83382678039;50413.311;3767.91496310757
578;1689.275;144.905164245445;27030.494;2313.18685579102;50413.311;3767.91496310757
579;1690.07;117.697362672239;27035.828;1882.25240743002;49951.321;3615.59401898074
580;1751.166;51.0751713066185;28021.878;819.44634824728;49702.076;3838.04744383713
581;1757.547;36.4428646102335;28122.724;583.231773846084;49605.328;3733.86069656279
582;1764.504;46.6430981389497;28231.448;747.968655664132;49078.721;3796.46529127662
583;1767.092;40.0558389751067;28271.764;637.746848180281;48133.21;5341.52159299948
584;1774.059;34.6168908049263;28381.741;549.608980793544;46310.993;8055.11888779557
585;1776.115;33.2707563034043;28425.317;540.768191798535;44551.175;10795.5818481768
586;1778.367;33.5217428097209;28449.567;533.616372632056;42747.389;13934.4383223512
587;1727.344;218.136627286659;27633.613;3496.4338666048;40071.299;16858.0806784636
588;1532.158;542.101243363267;24515.826;8677.9973654331;37635.118;19233.2058622154
589;1468.611;642.874940426986;23499.472;10284.0536830763;34264.02;19166.3086783376
590;1439.403;629.525041202493;23027.042;10073.6475490676;29280.622;17924.3239358698
591;1382.213;621.385419736414;22111.515;9940.43744490075;24409.703;17342.3622835801
592;1323.58;734.659741717212;21179.867;11756.3640039428;18589.333;15128.7998555286
593;1282.771;723.439354230193;20523.114;11575.1991895433;12743.475;12204.3831743233
594;958.145;753.725992974237;15325.809;12059.3740204178;7277.428;9773.90223215354
595;521.496;647.285638403943;8343.454;10351.0159372423;3582.915;7188.4149830046
596;517.595;644.11310525792;8278.915;10308.5684072341;2000.688;4090.22811111997
597;278.657;244.231465214865;4455.627;3904.32365864576;400.813;1194.01569634616
598;192.79;13.9057815314347;3083.942;222.761160115492;2.844;0.2267245024253
599;194.6;9.33014362161734;3115.614;147.107262648725;2.807;0.307995129831624
600;204.705;15.8703429389538;3281.179;252.137148450999;2.924;0.177268158449281
601;195.126;10.6079811462878;3119.488;175.748215797488;2.827;0.119503138034121
602;196.689;9.64804482783877;3144;151.261449153452;2.916;0.265525893275973
603;196.994;12.4901795023128;3155.111;202.363464412431;2.748;0.312147401078401
604;188.81;8.39830220937572;3017.579;137.648758763011;2.788;0.224223103180739
605;201.689;11.210526704843;3226.927;180.368557905749;2.922;0.164608626748419
606;183.552;15.1387309904099;2937.745;243.933909666122;2.922;0.236803716187058
607;192.543;14.7909438846883;3079.38;235.811012889562;2.826;0.236693895147301
608;187.59;8.71071753646108;3002.233;143.191259722791;2.932;0.229556093362819
609;193.211;12.5188277805874;3090.496;204.208622501599;2.874;0.327603418785583
610;196.36;13.2643650432273;3143.455;214.067240662846;3.124;0.309909664257185
611;203.116;10.3655267111714;3248.657;164.939032618116;2.95;0.254322629744191
612;194.11;14.8574910398764;3105.947;241.814215795921;2.9;0.31717503054308
613;204.802;13.1337289449724;3277.165;210.306839653411;3.228;0.345624073235647
614;192.226;4.93663083489019;3074.219;76.9835133583692;2.909;0.20709659581944
615;190.471;6.83558256478532;3048.636;110.026362041102;3.095;0.250529439387874
616;194.702;10.6077460376835;3114.965;170.641985879789;3.052;0.193483849455188
617;193.319;13.1031808733605;3093.589;210.843365390042;3.112;0.262213653343994
618;201.276;15.30574545718;3220.627;245.163195119086;2.955;0.190486219974034
619;203.544;13.5456732575394;3259.81;212.248931257608;3.101;0.245293701509032
620;194.163;9.41973041015464;3105.808;153.928884865712;3.215;0.372860563750043
621;190.608;12.6611396011578;3050.737;208.185453576851;3.21;0.284850838159208
622;198.328;12.8401493760779;3168.621;202.901101448466;3.205;0.268039176241089
623;190.475;13.9922566085672;3046.898;222.158005383555;3.124;0.262038165159196
624;195.604;13.9976599472916;3129.067;224.111493237185;3.09;0.261572169773464
625;188.434;11.2344302926319;3016.995;178.243340254272;3.09;0.364335010670125
626;190.933;9.02594931295318;3056.038;143.432040688272;3.159;0.388856014483512
627;200.652;14.8230764688035;3211.103;235.963026682157;3.193;0.26355454843352
628;193.591;12.2914803420906;3093.762;194.119531464515;3.045;0.280330162487026
629;191.499;14.9140104934925;3069.096;235.217289764164;3.026;0.311615147257
630;195.824;23.6907033243;3130.259;376.339757252673;3.116;0.237116005364456
631;199.482;16.2959380214825;3191.918;256.4736279932;3.129;0.233985042256977
632;194.099;13.1587046854928;3108.467;211.797096063653;3.094;0.432023147528001
633;199.486;16.0979074416522;3187.58;257.08706770276;3.061;0.35135309874825
634;189.925;16.3047712342123;3038.504;260.323533519344;3.085;0.36715800413446
635;192.052;15.6445612274677;3074.029;249.23180332574;3.285;0.378503632743462
636;196.617;14.2813228028774;3146.439;230.572595832644;3.252;0.400419779731223
637;192.713;13.6536691405642;3080.623;216.913420426211;3.437;0.275428756668583
638;191;11.3794709894615;3058.915;182.473310774483;3.328;0.197017765696384
639;200.471;9.69308253343542;3207.515;153.806658519711;3.439;0.412854695988794
640;192.333;11.5813143036533;3078.836;188.209653960682;3.478;0.374961331339642
641;199.187;10.1191907285115;3184.275;162.418153803699;3.454;0.335028357008777
642;195.024;10.7867179438414;3123.17;174.061798048857;3.436;0.256444925861285
643;190.809;11.0678023563851;3052.544;170.863668999587;3.556;0.243441984875245
644;196.949;11.1606751139883;3149.682;176.819699626483;3.5;0.202435174809121
645;193.735;11.7726974394148;3099.352;187.857937484688;3.532;0.20870074269154
646;189.634;10.002068985965;3037.544;156.481110054847;3.562;0.270916961447597
647;189.681;11.6482466062496;3032.589;191.799809199592;3.588;0.245552438391486
648;187.997;15.7751418694094;3008.465;253.640088521121;3.633;0.283480158035799
649;191.442;18.7680599956412;3065.785;294.804139022846;3.628;0.350622303911199
650;197.172;15.1457035491914;3153.07;245.060527666113;3.604;0.248604102942812
651;194.674;15.6842380752139;3112.777;247.313017370709;3.752;0.262442374627279
652;190.577;11.2426509774163;3051.023;179.534168895505;3.856;0.35878127041416
653;193.005;14.4653615578733;3085.589;229.691685110706;3.832;0.223239781401078
654;192.52;10.8251503453761;3080.721;175.405632261328;3.659;0.314688735101846
655;195.483;16.1760489922605;3128.615;257.634067438681;3.7;0.285762138849777
656;198.611;11.2594781850669;3175.193;179.046459671794;3.746;0.27052541470258
657;191.494;13.8540176122305;3065.392;217.170225896653;3.824;0.213831709528774
658;197.677;14.7985519899752;3161.815;237.676565536024;3.739;0.124535135604381
659;188.605;12.5853218075659;3018.854;202.176815050575;3.867;0.209334660293033
660;186.321;12.6655512710661;2982.05;199.791528699287;4.036;0.572646487809017
661;183.775;8.2420340329316;2943.023;133.108384487979;4.01;0.71320403812654
662;201.222;7.45521937973611;3216.754;117.366626193319;3.873;0.220773639730829
663;192.225;12.4483069129905;3074.089;198.741168480509;3.999;0.197253643819318
664;189.288;12.8034829636319;3033.217;204.325778992769;3.81;0.192509740013317
665;193.173;10.9778659583728;3091.973;178.185536845724;3.8;0.268439937416179
666;203.019;10.7386725902225;3248.425;169.902440844734;4.045;0.245652193151215
667;196.587;15.1714073506708;3143.91;237.515583151925;3.832;0.243589819163281
668;195.59;9.61174489882042;3123.709;148.471735993755;3.855;0.340624426605028
669;202.113;14.7257203898485;3235.198;237.57983705693;3.952;0.253092868330987
670;198.907;14.4102463892887;3184.419;233.865020918045;3.868;0.357793236381017
671;206.39;10.8592946363933;3305.146;172.654861860305;4.171;0.515314467097519
672;191.924;10.2863095422992;3067.191;166.851805531138;4.147;0.431579656610455
673;198.668;19.1206578338716;3179.39;308.360744713069;4.208;0.53739743207425
674;195.112;14.3025492832573;3118.385;225.467015115301;4.217;0.466241353807227
675;191.239;18.7340515906191;3061.595;298.795154420219;4.15;0.289205809070287
676;191.747;13.9028508227626;3067.65;221.175775391432;4.142;0.365754015699073
677;192.333;15.5515903045311;3079.431;245.445255177199;4.132;0.427499707602245
678;193.259;10.0985468756651;3091.063;159.897564212215;4.102;0.345999999999995
679;198.054;10.5250047030878;3171.966;168.99415144909;4.203;0.394209335252221
680;189.797;13.4107024797357;3030.959;214.649735217632;4.137;0.2055748039036
681;200.276;12.0604180690395;3208.603;194.913552327689;4.086;0.201156655370874
682;189.01;7.448199782498;3022.173;124.623745574435;4.065;0.216298404987176
683;191.244;17.5100435179353;3059.722;284.145132909233;4.006;0.198806438527529
684;199.242;10.6955755338361;3186.763;171.526807353836;4.066;0.227824493854356
685;190.81;18.0904101667152;3057.891;291.707809749763;3.998;0.312211466797746
686;193.693;14.9499512039336;3100.393;236.397227058622;4.155;0.239968747965221
687;202.764;8.26236067961234;3239.702;134.555713427563;4.079;0.320544848656153
688;194.659;13.0988468576435;3112.932;209.369420919104;3.845;0.206555077400672
689;200.87;9.83597478646607;3216.107;157.66863632632;4.116;0.420171393600282
690;192.383;17.3072141316854;3076.335;272.820098572304;4.078;0.468994669479298
691;197.414;13.4323707512862;3159.528;212.457482607702;3.908;0.316632278834604
692;194.017;14.9551830814605;3105.243;238.761473611205;3.954;0.373609421722734
693;202.702;14.4428603815179;3241.528;228.251998405271;4.065;0.214534379529242
694;199.104;12.4052031019241;3186.677;200.802742065444;3.928;0.205416649763359
695;196.52;12.1260636646859;3143.602;193.880082411777;4.093;0.405463931811452
696;197.45;10.3635495849641;3158.285;164.686245403191;3.913;0.298095622242256
697;202.107;9.90183018436436;3239.115;158.916457753758;4.211;0.175695759766693
698;203.466;13.244226062703;3253.788;207.633645192693;4.157;0.287334300075716
699;205.934;10.4041234133391;3294.552;170.010952341295;3.943;0.201099477871018
700;191.118;13.7176446957922;3055.395;216.988476986677;4.169;0.34057157837965
701;199.309;13.9843744586591;3192.377;224.980117301516;4.123;0.325670078453635
702;202.774;9.55620029091054;3243.686;152.737711400936;4.145;0.336132414384562
703;196.515;16.3654698985391;3141.157;259.519410759581;4.205;0.21233228675828
704;190.441;18.0098136858766;3047.138;289.23161451681;4.045;0.252675681457477
705;194.336;8.98278820856899;3110.683;144.165134554096;4.213;0.24843711477958
706;195.611;9.23524710010563;3127.173;146.917217782678;4.057;0.324408692855164
707;184.098;8.46325327518961;2950.66;128.853073847694;4.055;0.377842559805003
708;198.887;16.5628675355447;3177.866;263.592295570267;4.042;0.328901200970748
709;191.246;13.1645084982308;3062.445;214.217686116236;3.877;0.295230418486985
710;194.963;9.00602581608451;3117.497;146.12122549786;3.945;0.353899703305891
711;183.205;10.5024847060113;2934.675;166.425011897253;4.02;0.477556279405889
712;196.206;14.800739981501;3135.36;238.332019040657;4.024;0.513014619674725
713;186.198;11.7755023672028;2980.745;191.563378924575;3.895;0.398327754493703
714;202.517;9.93420761812459;3241.859;160.272414248366;3.982;0.355606524124627
715;203.172;13.4815338889907;3248.263;221.154955271191;3.966;0.236144023849849
716;195.521;13.7335701476344;3127.753;218.482486668845;3.876;0.354378328908527
717;200.902;14.9254070631256;3216.937;235.56777814676;3.917;0.235671381376707
718;195.176;11.9609859125411;3122.831;192.497381408167;4.029;0.327366766792226
719;195.986;16.2634819150147;3137.002;258.61419105687;1.575;1.77684129848448
720;1085.665;106.366939060028;17384.872;1703.03703956665;2.967;0.269445727373808
721;1084.44;103.784005318739;17348.464;1656.17922643173;2.981;0.249417320970299
722;1046.585;71.6511430823012;16747.555;1148.63529741384;3;0.15433729296576
723;990.669;73.1745083276973;15851.127;1170.29472932296;3.16;0.207797978815968
724;989.059;75.5557045430727;15825.246;1208.38995483414;3.153;0.256400078003107
725;998.048;54.9973226257383;15967.786;877.137097724217;3.128;0.137098504732924
726;990.91;52.0729724521299;15854.948;831.076233131463;3.181;0.181022098098542
727;960.782;59.2201335358169;15375.398;948.564272337952;3.254;0.206794584068346
728;1002.428;43.611038465047;16032.666;701.866974564266;3.165;0.113247516529059
729;1018.554;49.9616117033848;16300.637;797.067828331488;3.106;0.129166559139753
730;999.563;57.6459329094426;15994.008;925.756654373095;3.116;0.132151428293456
731;1006.192;44.6252000107557;16095.577;713.682914886546;3.116;0.118253963992759
732;1002.851;56.4813281447971;16045.893;900.884840277025;3.105;0.144308696896613
733;969.213;73.657525487894;15507.093;1179.60979038026;3.24;0.192093727122988
734;975.094;75.4303579734339;15604.093;1207.85091468319;3.253;0.220683030611779
735;994.718;59.6756809429086;15911.285;954.743819296597;3.144;0.139942845476294
736;1010.082;61.7063028871448;16166.12;985.473605095568;3.135;0.177777951388796
737;993.119;45.543648613172;15889.222;725.619936740897;3.183;0.081859635963029
738;1001.4;49.1217904803923;16025.195;784.390279634448;3.139;0.126447617612984
739;1005.14;49.4774791192906;16079.247;793.767569204644;3.138;0.13731715115018
740;993.36;45.2457982579602;15889.56;723.098326370578;3.198;0.161666323023687
741;992.367;62.1741238860687;15883.056;992.908763172082;3.176;0.211811236717977
742;983.408;53.8346653746445;15733.55;857.108991307399;3.243;0.163832231261132
743;997.932;62.5966704865355;15966.517;1008.77914528451;3.162;0.128358871917764
744;988.006;55.5473812524061;15806.7;884.317122405743;3.163;0.142972025235708
745;1001.724;50.6112053205616;16030.791;813.373043743765;3.139;0.163428883616081
746;1017.049;66.1425957231753;16271.599;1058.74104329103;3.081;0.169319225134061
747;1026.704;96.3749177120275;16424.072;1536.96660571269;3.112;0.234512259807459
748;1023.493;89.832581622704;16376.307;1441.7886643545;3.104;0.182329372290917
749;998.935;93.2632941998102;15983.46;1493.23438686634;3.161;0.244476992782543
750;990.572;112.795569398805;15850.135;1801.94317653053;3.201;0.304547204879643
751;983.617;78.4342597402453;15736.454;1255.13297502854;3.233;0.251755834093273
752;1003.885;56.6438514315537;16061.273;907.222357782777;3.187;0.179947214482477
753;1019.491;54.6601334520844;16316.57;871.087465126151;3.151;0.13292479076531
754;1003.392;67.3769102586336;16053.887;1079.76134818807;3.174;0.149211259628761
755;989.982;66.7784246295136;15832.995;1070.27880544511;3.185;0.125876924017075
756;1001.844;79.4223721881938;16035.408;1273.30391097965;3.196;0.231136323411098
757;981.769;71.9243746514357;15706.397;1149.66320100328;3.19;0.192613602842579
758;988.671;70.3284462291038;15821.138;1125.72159803211;3.179;0.237000000000001
759;998.845;37.9112472097652;15977.134;605.296606189039;3.2;0.0769415362466835
760;976.985;37.9035178446559;15635.935;606.874502895758;3.23;0.0985900603509555
761;992.254;27.3849959649482;15875.13;440.320637604055;3.179;0.0858428797280277
762;978.708;33.7424556901265;15656.512;537.757890091811;3.19;0.0719722168617814
763;979.498;51.6981105650894;15678.064;828.947725519492;3.23;0.122474487139147
764;994.369;58.8164187026043;15907.672;937.761136652603;3.173;0.154987096237072
765;990.902;53.501245929414;15854.254;858.985201982045;3.19;0.163890207151005
766;963.929;46.6011644596989;15419.361;744.171082822389;3.249;0.15933926069867
767;984.465;47.8849586509151;15753.037;767.65736067651;3.196;0.132755414202214
768;983.85;54.7299291064782;15744.711;880.617436534746;3.215;0.140445719051879
769;989.847;47.4870352938561;15835.629;755.226816320156;3.178;0.119230868486308
770;988.481;36.7679921806956;15814.902;590.669174221966;3.194;0.0841665016500183
771;985.211;27.9702375570884;15765.272;450.685173015634;3.184;0.0788923316932613
772;974.41;41.7636377725926;15589.768;658.960625087698;3.211;0.0900499861188177
773;964.979;47.9125024289078;15437.264;772.832290438241;3.273;0.154081147451598
774;964.878;63.3369575840189;15439.616;1013.07588706078;3.295;0.217036863228343
775;991.922;48.5058826947855;15870.722;781.386750397045;3.162;0.0960000000000018
776;969.917;71.2634835031228;15513.244;1136.50790139971;3.267;0.192823753723433
777;979.573;68.4125424246186;15678.546;1094.88695661426;3.204;0.178672885463912
778;969.531;56.7320948758251;15516.093;905.039584129365;3.251;0.178182490722292
779;984.689;73.955057223966;15751.235;1182.36226145166;3.245;0.202101459668156
780;1013.889;67.8519864779233;16224.439;1083.91984965173;3.139;0.144391828023605
781;997.793;40.9820011834454;15964.981;653.487723196877;3.196;0.0691664658631552
782;981.399;44.9664947377493;15699.209;721.557777485029;3.208;0.113999999999982
783;1007.993;39.2488084022998;16127.101;627.121701608954;3.138;0.0868101376568325
784;997.815;55.9630662580261;15967.147;897.347393488707;3.178;0.113912246927186
785;992.857;42.5174752425396;15882.93;676.306890309382;3.17;0.090221948549115
786;985.019;33.4263158155389;15761.721;537.489578214316;3.201;0.0911537163257886
787;985.934;31.0792706478146;15775.953;494.945290957494;3.229;0.131715602720398
788;989.217;32.9364852557165;15826.783;530.280324923473;3.206;0.0819999999999902
789;999.135;45.9273335280858;15987.07;733.294610385186;3.132;0.11737120600897
790;992.14;38.1799025666646;15871.633;609.75932821164;3.188;0.111785508899859
791;1003.198;41.6437500232641;16054.086;662.172573461033;3.144;0.0867409937688165
792;982.392;53.8403279707684;15721.357;861.47852107929;3.228;0.195489130132595
793;994.097;26.138273489267;15900.547;419.154848261294;3.176;0.0893532316147373
794;1004.209;57.9343909003968;16071.057;924.988845565707;3.151;0.163856644662345
795;1004.991;52.6524262403924;16079.639;846.083420313286;3.168;0.114087685575607
796;990.005;56.8277408049988;15838.675;908.532521853234;3.215;0.162249807395885
797;983.179;40.294006613884;15728.376;646.16038837423;3.206;0.0862786184404791
798;984.789;50.4865402756011;15756.035;811.768549196747;3.19;0.154337292965754
799;986.04;43.9557108917594;15778.75;696.896727327653;3.201;0.136047785722523
800;990.077;59.2945788500094;15840.73;947.268016265714;3.193;0.180280337252851
801;991.194;64.9652467400873;15861.202;1043.92431083678;3.163;0.141354165131416
802;991.224;60.204209188398;15855.897;963.360736619944;3.157;0.165653252307336
803;975.903;59.8761540264561;15616.425;960.486026584982;3.211;0.189707669850217
804;1015.258;66.1555311066273;16245.525;1060.44985403602;3.106;0.206601064856895
805;992.524;55.1928718586025;15877.389;885.38798555716;3.204;0.153310143173886
806;1003.918;57.993951029395;16064.103;928.085505619508;3.167;0.146222433299408
807;1000.791;62.5522873202909;16015.642;1001.42803192039;3.127;0.150136604464075
808;997.196;51.9692624923629;15954.84;831.06129074812;3.13;0.138636214604996
809;989.399;43.57172717486;15829.97;694.082046461364;3.156;0.134996296245496
810;986.408;57.32828704924;15782.048;919.723739932839;3.195;0.129634100452009
811;994.092;57.9912255086893;15904.682;926.145584374315;3.174;0.177831380807772
812;983.352;58.1072008962735;15731.027;930.082545649065;3.221;0.174439101121274
813;998.564;69.753855692715;15981.618;1117.06264652259;3.178;0.207836474181021
814;977.257;66.4414531824797;15634.388;1062.58241223728;3.277;0.232079727679949
815;982.349;43.9561998926234;15713.488;703.328277034267;3.238;0.136073509545373
816;982.766;41.0855688046322;15727.049;655.916866293953;3.229;0.08525843066818
817;1004.219;49.7378705716268;16069.917;796.997466056876;3.178;0.110616454472197
818;992.189;49.2421340825127;15868.208;788.455557958734;3.201;0.137145907704177
819;1009.199;51.0999615361885;16151.285;815.509229172159;3.164;0.123790145003549
820;1007.482;46.793606785543;16122.12;749.867945187647;3.155;0.135369863706805
821;993.667;60.2021429934184;15896.362;963.472420921325;3.21;0.182647200909294
822;997.244;66.0115072089675;15955.627;1052.40055446628;3.21;0.170117606378647
823;1018.598;59.0750481675609;16295.954;942.870225483823;3.081;0.128565158577263
824;1023.94;60.7436426303209;16385.732;975.9311381322;3.128;0.199889969733351
825;996.675;67.0703344631598;15950.412;1073.15463960046;3.176;0.183695400051287
826;994.844;45.4225664620557;15910.989;724.065215466803;3.185;0.118088949525353
827;997.792;39.5568615539696;15966.653;638.695190745223;3.18;0.135793961574144
828;1008.669;57.3144834138849;16136.227;923.031830545966;3.182;0.176056809013455
829;985.13;76.8451999802183;15765.19;1225.10928803108;3.238;0.248628236529958
830;989.865;45.1180516534132;15839.65;722.81187213548;3.243;0.128999999999972
831;997.21;41.4679772836826;15952.522;666.671273414428;3.185;0.118088949525361
832;995.424;54.6615724618319;15926.369;871.585489512651;3.208;0.145313454297945
833;987.914;61.736312361523;15810.111;991.869283902407;3.259;0.140602275941738
834;976.378;85.1826903543201;15619.663;1361.38394353723;3.27;0.221088217686961
835;983.211;77.3749461324535;15728.599;1239.60122768133;3.245;0.173910896725878
836;996.497;59.3899678481138;15943.465;947.169512202001;3.213;0.145811522178471
837;994.169;31.4046975626276;15910.113;501.296618541296;3.171;0.0693469537903293
838;1001.069;39.7678876607742;16016.719;639.756141001347;3.16;0.0946572765295849
839;999.443;47.4854847400754;15987.874;754.664957795178;3.19;0.123288280059373
840;993.354;49.6609269345616;15897.644;796.136126189488;3.204;0.179454729667406
841;1008.433;44.1719716675642;16135.828;702.583508186753;3.138;0.11487384384619
842;1005.51;44.3603013966255;16088.586;710.566309828988;3.177;0.167334993351659
843;1005.399;33.2652315338416;16085.889;538.562563393551;3.124;0.0498397431774988
844;998.43;39.0137724399986;15971.971;620.972365221614;3.224;0.0643739077577117
845;988.41;42.2134488048492;15814.255;673.090835493273;3.191;0.136047785722523
846;987.826;46.6469103371287;15806.155;741.326712755596;3.216;0.103749698794735
847;994.95;44.2624847924286;15919.706;712.753621880668;3.198;0.168095211115602
848;1007.183;61.2526667256196;16116.721;980.32092859886;3.159;0.156872559741987
849;1027.401;73.849618475655;16436.749;1177.18800723969;3.087;0.218542901966638
850;1021.901;63.4114567645361;16354.198;1020.26536853701;3.12;0.143735868870646
851;1011.686;78.4919033021869;16180.388;1254.53424628264;3.189;0.219747582466786
852;1017.39;58.940776716972;16280.548;943.939670061596;3.166;0.113683771928978
853;991.994;59.8466574171015;15872.784;957.781594375253;3.217;0.213497072579458
854;982.518;62.8742746757379;15719.068;1004.37560504825;3.2;0.215916650585353
855;1004.12;50.8251392521459;16066.013;814.559831099527;3.237;0.150535710049148
856;1019.617;32.5679486765785;16316.881;518.43019205002;3.15;0.111713920350152
857;999.983;64.8367676631107;15998.625;1034.55315013053;3.182;0.174573766643216
858;1004.489;56.7495461567743;16068.906;906.499652291192;3.195;0.204560504496841
859;999.07;54.8720867108227;15991.519;877.62206672862;3.246;0.179788764943755
860;996.411;65.8782356245214;15938.883;1057.56716270932;3.217;0.186978608402131
861;1012.226;77.3605244553082;16194.828;1236.45487844724;3.198;0.253211374152114
862;998.393;59.0954204740082;15972.472;945.23596647398;3.195;0.111825757319148
863;998.797;80.2084059248165;15984.764;1282.9186375854;3.158;0.243589819163281
864;984.479;72.6045941315019;15752.802;1160.43516910512;3.186;0.173792980295521
865;1000.025;77.8611732829661;15993.397;1246.39974937456;3.186;0.238503668734886
866;1006.707;65.395534258849;16110.031;1044.30224083311;3.17;0.187029409452094
867;1025.997;56.7077488620407;16415.53;907.576909853889;3.094;0.170011764298829
868;991.507;61.630604256328;15866.208;986.281962694208;3.194;0.198252364424739
869;1007.6;44.9362753240634;16117.103;716.447057444606;3.145;0.124438739948612
870;992.8;51.6982903005498;15888.096;826.242974568619;3.209;0.168133875230414
871;994.102;36.9625848122107;15906.815;595.112218396706;3.172;0.11151681487561
872;1006.665;40.4680780986663;16106.146;644.333739132075;3.174;0.130169120762172
873;1016.138;40.058064805977;16255.913;641.187807651482;3.12;0.0721110255092697
874;1054.312;79.5722989236843;16873.184;1273.08867202722;3.015;0.199562020434752
875;1073.058;65.2719951893639;17170.444;1043.85684502424;3.013;0.164866612751038
876;1029.213;45.8084400629421;16463.395;730.720543864081;3.122;0.134372616257925
877;1000.506;57.2342249357861;16011.497;915.407491449038;3.164;0.15226293048539
878;995.802;47.8710314908738;15933.551;764.751891693537;3.194;0.0999199679743621
879;1004.466;57.1166443692215;16068.677;912.699809412197;3.141;0.176886969559663
880;1014.576;54.9867309812141;16233.515;881.92091119615;3.133;0.160502336431584
881;1007.044;61.7744002318087;16112.905;990.850812133223;3.117;0.170120545496415
882;1009.119;65.7171725578658;16143.596;1049.89503472679;3.151;0.175524927004689
883;1001.18;69.6828168202176;16018.191;1116.90603387617;3.162;0.204147005856076
884;1006.188;62.4472175200791;16098.828;996.448234237972;3.146;0.17448209077152
885;1035.353;78.5466205574733;16568.326;1255.2066032267;3.064;0.225086649981741
886;1011.287;80.0754760273069;16184.172;1280.7929843406;3.226;0.256873509728038
887;1035.677;68.7111772639652;16567.54;1102.58373418981;3.107;0.176354756102578
888;1014.076;45.468985077743;16225.452;727.973725278592;3.139;0.124935983607597
889;996.445;43.2589126654846;15942.434;690.567687373259;3.193;0.0870689382041613
890;989.589;53.344923554168;15831.824;855.329100162051;3.178;0.141689802032466
891;1006.377;41.1528774328158;16100.947;655.738968020768;3.185;0.127925759720239
892;999.623;43.2955508222276;15997.485;693.485379849412;3.171;0.0999449848666712
893;992.366;45.9593155301512;15877.05;733.312055526165;3.223;0.105834776893041
894;1003.632;45.2759101068053;16059.714;723.565855761562;3.161;0.106437775249195
895;1009.983;48.3876678607273;16157.927;780.200023609969;3.133;0.133345416119181
896;1005.786;42.8536563667532;16093.481;682.625272875969;3.146;0.161629205281722
897;997.527;41.8136700254838;15955.71;669.372559730372;3.191;0.137437258412702
898;995.95;45.0726240638366;15937.612;722.067105701395;3.177;0.136458784986522
899;995.357;38.4246236285994;15927.9;613.58502939692;1.367;1.40644978580822
900;835.832;55.4069838197312;13371.001;883.952178847359;4.451;0.28748739102785
901;914.133;47.2960780720733;14627.211;760.78037020481;3.759;0.127471565456765
902;912.808;57.9055786258977;14610.829;924.720083727524;3.754;0.16310732662882
903;916.521;54.1688645718154;14658.627;864.730058712553;3.658;0.113736537664887
904;906.001;34.8338910976098;14495.621;557.140228155266;3.677;0.0867236991830575
905;920.353;45.1178341789624;14726.937;718.648840714989;3.64;0.128140547837145
906;911.773;41.0031845226695;14588.077;660.133152766195;3.697;0.0947681381055909
907;916.274;51.7358207048067;14661.278;827.565688181927;3.68;0.149398795175849
908;910.687;43.803115197441;14572.517;698.888720184455;3.659;0.109585582993388
909;909.887;36.982561850146;14555.09;595.293225662765;3.711;0.0805543294925975
910;926.804;38.7782754129176;14826.26;622.409125993545;3.665;0.117579760163044
911;917.919;32.1183425630869;14689.097;512.252790017812;3.761;0.143906219462532
912;918.988;30.2349237802995;14705.184;490.809443678491;3.653;0.136312141792295
913;927.72;29.1286607999782;14841.722;461.932124749925;3.69;0.0757627876995111
914;927.253;30.9364493922615;14838.446;498.222524585158;3.704;0.095833188405703
915;918.324;35.8369753746078;14689.491;574.473407521199;3.717;0.0809999999999975
916;904.173;30.9988377362723;14471.058;491.225292809739;3.685;0.113600176056201
917;895.407;41.9279100480829;14325.192;672.982301057005;3.725;0.110204355630794
918;905.13;42.4931095590782;14479.166;678.008104423508;3.703;0.0860290648560008
919;906.209;46.0264361970423;14502.644;737.416819894965;3.752;0.129676520619587
920;909.537;39.0794575320609;14553.969;622.196455847341;3.685;0.11119802156513
921;911.472;33.9885541910778;14582.262;546.294118086628;3.671;0.0937496666660654
922;915.129;40.2597288739052;14640.482;644.682082623697;3.679;0.162631485266536
923;917.23;27.4010758912805;14675.798;436.40895625087;3.685;0.127062976511642
924;922.589;30.818706153896;14762.409;495.46371922566;3.68;0.145670861877015
925;924.577;36.1358329224626;14795.125;577.943668902857;3.691;0.0868849814409681
926;928.067;23.6033582568225;14845.464;379.031552860627;3.651;0.0990403957989071
927;928.384;25.1699476360269;14856.439;400.867428071825;3.667;0.147516100816141
928;924.174;23.4158092749359;14782.979;375.852790210603;3.678;0.0967264183147794
929;936.869;29.5233089100804;14994.496;468.049215963479;3.631;0.0972059668950513
930;924.126;42.975852801313;14781.608;690.231782704868;3.604;0.103653268158786
931;933.657;34.3762924266144;14941.206;552.753162002696;3.617;0.0504083326445573
932;931.151;32.2286693644006;14896.422;515.638512289382;3.643;0.0734914961066743
933;914.791;27.9105512127583;14637.028;442.13974523445;3.677;0.10030453628823
934;909.655;29.5697576080676;14556.987;475.986980159148;3.65;0.0673795221116953
935;920.503;24.1518537797777;14726.733;388.70122510863;3.679;0.144391828023617
936;915.106;20.7253372469529;14643.176;333.457360998319;3.717;0.0688549199404153
937;923.854;34.7730646334238;14778.853;554.885851955985;3.665;0.108926580778056
938;910.294;28.9209340098159;14568.987;462.708409390768;3.677;0.0952942810456028
939;910.662;21.0665938395404;14563.504;337.058039815068;3.645;0.0892468486838337
940;919.594;27.8312070165817;14717.897;443.348405163404;3.599;0.0867698104181294
941;916.476;23.646486504341;14663.424;380.013152356548;3.625;0.094472218138454
942;921.034;33.1838277478644;14739.557;529.547525498007;3.651;0.120950403058448
943;931.152;19.1109695201432;14895.122;307.37356043761;3.586;0.105090437243349
944;938.596;28.2258701194445;15016.841;451.238569948358;3.607;0.113318136235989
945;937.17;28.1955574514885;14997.212;449.794249514157;3.586;0.0936162379077535
946;933.974;27.8754057190235;14940.093;449.105939730305;3.612;0.0832826512546364
947;928.953;20.2832448340922;14866.44;326.587892947724;3.618;0.0919565114605849
948;924.886;23.1213906156183;14794.262;370.968260631676;3.614;0.121753850041792
949;923.798;21.9042825949608;14784.679;354.190523686064;3.63;0.0784856674813911
950;930.239;25.0429504851117;14880.537;396.986957091746;3.601;0.148690954667728
951;929.585;15.5015104102859;14877.478;247.792018386427;3.657;0.0891122887148505
952;921.469;22.5215565403461;14744.011;362.721062180037;3.624;0.0452106182218261
953;928.274;11.4851296901781;14850.087;184.449764112191;3.606;0.146095858941988
954;933.436;11.9464983991118;14935.771;195.196530319867;3.612;0.0357211421989936
955;933.392;27.9023887149468;14933.088;445.542834861059;3.629;0.180357977367236
956;937.431;21.2416536314909;14998.576;343.482193809202;3.657;0.120503111992997
957;950.196;18.4151862330973;15206.106;291.942144412154;3.562;0.104766406829676
958;939.029;22.0390931982221;15020.773;351.090814293182;3.685;0.115520560940463
959;933.627;26.9573010703949;14934.346;432.642147188692;3.62;0.108811764069881
960;936.037;16.6547326907397;14981.807;264.435411624364;3.65;0.0964365076099185
961;944.47;33.0257157378917;15108.934;525.772351406998;3.579;0.0873441469132388
962;939.134;27.5692430799239;15030.745;443.464248373027;3.618;0.108793382151643
963;924.216;34.0024570288689;14782.777;539.701731700981;3.592;0.113472463620036
964;933.606;33.3727721953087;14938.411;535.987929219519;3.617;0.0769480344128358
965;948.754;29.7155939533473;15180.759;473.794190433915;3.566;0.0685857127978921
966;942.845;38.2137873679124;15083.018;612.648814016643;3.574;0.122081939696268
967;942.784;32.4966161930754;15088.419;517.691481279062;3.548;0.102936873859669
968;938.617;30.0949158663048;15018.758;480.583203135453;3.548;0.106658333007805
969;937.53;31.5461138652621;14999.082;508.953929129245;3.6;0.123207142650088
970;933.159;38.7283961583701;14927.938;621.200097227956;3.58;0.091760557975612
971;933.744;43.6105001576433;14945.807;691.221038193341;3.623;0.180224859550509
972;954.417;51.9299755536266;15268.87;831.706732063604;3.601;0.180856296545076
973;1011.623;68.5719549159869;16186.849;1099.29323272229;3.371;0.20911480100653
974;1026.583;85.0209402500368;16423.843;1359.70666909482;3.311;0.236957802150505
975;1061.307;95.7139064138541;16982.082;1528.59301805809;3.248;0.240158281139753
976;1096.574;100.045761449449;17541.191;1602.31195587159;3.137;0.277202092344199
977;1116.493;110.829359201433;17864.979;1773.25520681288;3.099;0.221605505346779
978;1133.688;132.136951289184;18139.602;2111.97372113761;3.087;0.323853361878488
979;1185.044;133.952975047218;18959.411;2144.62645209112;2.965;0.318786762585905
980;1226.769;140.287567692225;19628.61;2246.3283530063;2.869;0.3010132887432
981;1277.142;136.798676660265;20438.087;2189.23948536493;2.796;0.279971427113549
982;1271.208;164.442223336952;20337.329;2626.80664051029;2.745;0.311745088173017
983;1285.758;158.531289138767;20575.055;2539.69967056441;2.703;0.286846648925865
984;1291.059;184.429752179522;20653.132;2949.3911667488;2.685;0.326105811049114
985;1347.218;176.385072202836;21554.085;2821.49880151754;2.603;0.302226736077401
986;1382.736;160.782471320724;22123.168;2571.09674145797;2.543;0.271773803005365
987;1413.672;157.925132629356;22622.031;2527.22569380518;2.482;0.280741874325865
988;1451.434;160.501120569297;23222.549;2567.40301859857;2.454;0.268372874933367
989;1471.414;162.239771893331;23540.719;2593.07005512942;2.4;0.20430369551234
990;1470.78;147.785910221507;23536.277;2367.6960446774;2.398;0.179153565412465
991;1493.304;172.958861652127;23889.462;2765.34614894698;2.347;0.194115944734069
992;1532.755;162.142298999987;24528.001;2594.82822980812;2.299;0.175068557999432
993;1553.447;160.056711577488;24850.964;2563.09848488193;2.297;0.211851362988301
994;1605.25;81.8261017035449;25682.11;1310.66157081064;2.256;0.139082709205711
995;1618.764;78.4334451876258;25906.322;1255.34636133457;2.235;0.118764472802268
996;1632.891;71.2191668653846;26120.84;1139.85742637394;2.205;0.0830963296421725
997;1656.484;63.2347839721183;26509.235;1011.0479228329;2.194;0.0856971411425182
998;1669.232;58.2069550483458;26708.518;929.780242012082;2.158;0.0574108003776348
999;1676.41;57.7897762584414;26820.56;922.318465921717;2.161;0.0754254598925341
1000;1693.611;45.1932212726637;27097.21;726.219277188295;2.124;0.0581721582890002
1001;1696.69;48.6770946133777;27144.45;778.352352408616;2.133;0.0728079665970711
1002;1705.219;42.4178215965967;27284.918;676.614815560803;2.122;0.0746726188103751
1003;1715.965;36.5858071524982;27453.327;580.797438872552;2.108;0.0530659966457046
1004;1722.665;40.5423179529702;27563.82;652.857909272485;2.115;0.0531507290636782
1005;1738.126;31.2049265982018;27813.619;504.665279119979;2.074;0.071860976892891
1006;1749.254;45.6221117880307;27984.586;724.076103489155;2.052;0.0931450481775573
1007;1760.733;33.0576892870845;28174.129;531.792177216611;2.031;0.0626817357768545
1008;1761.567;32.0607903988787;28183.28;508.330655853094;2.033;0.0660378679243782
1009;1774.067;26.8167809589664;28384.481;434.210067788647;1.991;0.0656429737290994
1010;1738.414;96.2237139378953;27814.723;1539.99621976196;2.035;0.0818840643837382
1011;1790.821;28.5225971643281;28652.751;461.527516199171;1.941;0.106249705881946
1012;1795.4;39.9029953762832;28728.212;631.76768880342;1.945;0.113951744172702
1013;1805.506;29.6161037950769;28886.212;474.76481703689;1.93;0.106018866245584
1014;1810.394;30.0079060248956;28969.107;479.616126210291;1.909;0.113265175583666
1015;1811.833;40.1915210087865;28983.627;647.123632500784;1.91;0.117217746096736
1016;1818.383;34.8973408872507;29100.228;556.336338123261;1.888;0.110797111875714
1017;1823.971;28.6823093386762;29183.14;457.937070829436;1.867;0.0904488805900855
1018;1825.266;29.4596202283701;29206.561;472.717180255899;1.86;0.0894427190999867
1019;1805.845;39.7207417478532;28891.326;633.86915714811;1.935;0.0960468635614941
1020;1829.602;30.1724847501727;29272.035;480.474828253407;1.84;0.04449719092258
1021;1820.105;29.2484756012972;29122.363;465.999306459407;1.876;0.0772269383052289
1022;1824.607;28.9699820676245;29194.128;466.002086385699;1.882;0.0672011904656405
1023;1833.466;33.7300922619558;29333.458;541.221109396129;1.835;0.0671192967781959
1024;1835.502;35.8542362350693;29371.237;574.939171079017;1.818;0.0552810998443325
1025;1842.027;28.5484073286104;29472.724;454.191114118498;1.809;0.0776466354712156
1026;1849.185;34.1283513372704;29584.575;546.589192396903;1.779;0.0950210502993986
1027;1842.96;37.5913920998056;29484.374;601.808355877532;1.812;0.0774338427304245
1028;1848.325;31.1749419406056;29577.503;501.634111022005;1.775;0.0774919350642291
1029;1851.82;32.5114007695674;29627.608;516.02456202782;1.771;0.0829999999999955
1030;1856.489;31.5990770276513;29702.588;508.149528776606;1.76;0.0569209978830339
1031;1852.991;41.9001886511196;29652.246;672.099677461526;1.728;0.122865780427264
1032;1859.812;42.8381268964755;29754.978;682.607010464881;1.741;0.116400171821176
1033;1858.705;41.0217520956974;29736.797;657.962430508553;1.759;0.0986356933366421
1034;1873.81;37.2471290168763;29982.66;598.795094869766;1.691;0.0900499861188226
1035;1865.595;41.5411656673284;29850.622;665.551543080034;1.7;0.0948683298050532
1036;1871.897;32.3013625254697;29945.943;514.548093321653;1.665;0.100324473584469
1037;1875.735;43.785115564528;30013.96;703.414995489927;1.644;0.117064085013298
1038;1878.521;35.2582822752432;30060.931;562.010668892789;1.641;0.0863075894692944
1039;1880.865;37.7440085974058;30090.25;603.175363555216;1.609;0.124374434672087
1040;1882.375;39.6035600041238;30117.914;636.337420135014;1.615;0.0943663075467154
1041;1880.229;36.9780741656524;30085.775;590.495992607356;1.632;0.0898665677546363
1042;1882.482;35.6750046391014;30117.616;571.097702818001;1.623;0.0887749964798662
1043;1886.517;35.124903145759;30185.359;564.75066499177;1.609;0.086307589469297
1044;1891.395;35.1848047458114;30261.114;560.912213331472;1.553;0.0504083326445133
1045;1889.605;37.8089378983306;30234.898;601.210570579101;1.522;0.0698283610003835
1046;1888.455;37.3146245458861;30214.481;600.425847618666;1.571;0.129031004026166
1047;1888.914;34.0042242081729;30219.929;544.452281700879;1.563;0.0796303962064734
1048;1898.129;35.8595865703868;30372.552;569.877842450275;1.499;0.129185912544673
1049;1891.188;40.8559180046291;30260.005;657.972020594364;1.526;0.0827284715197808
1050;1891.586;48.8930230605555;30259.553;778.662735336185;1.496;0.163780340700583
1051;1899.668;36.6490457720099;30395.996;589.74100174928;1.451;0.161891939268143
1052;1905.664;41.0538804986863;30493.645;652.912542033744;1.424;0.130092274943597
1053;1907.09;33.9059481507508;30513.948;548.246066083245;1.385;0.137713470655558
1054;1910.689;32.231599541451;30572.515;512.493519944302;1.403;0.120834597694533
1055;1921.413;20.4905295441426;30737.407;328.333464455498;1.332;0.118642319599711
1056;1909.088;23.7417938665056;30549.209;376.798773736063;1.413;0.117222011584854
1057;1921.6;20.1257317879393;30747.296;323.367830100419;1.333;0.0970618359603787
1058;1918.299;22.3495639554749;30690.356;352.676907953906;1.352;0.136660162446853
1059;1921.499;20.4424237555225;30744.38;330.560179272015;1.326;0.131544669219245
1060;1924.051;21.3828288352924;30784.406;339.821946324851;1.288;0.106658333007788
1061;1921.167;21.1965789928547;30738.769;336.243100760631;1.347;0.137189649755366
1062;1916.497;23.1934413358646;30664.934;373.357681404834;1.347;0.127440182046323
1063;1923.006;26.0073355805658;30765.501;415.976954613153;1.262;0.110616454472199
1064;1856.764;201.586186044581;29709.022;3222.56651153022;1.314;0.269636792741643
1065;1899.124;70.8477301259603;30390.283;1140.65729242421;1.325;0.212238073869887
1066;1935.682;19.9070850704008;30970.412;324.284414482171;1.191;0.0294788059459675
1067;1930.818;23.8049246165517;30888.802;377.410820613588;1.266;0.0937229961108782
1068;1933.498;22.184313286631;30937.177;354.690374637836;1.215;0.0374833296279869
1069;1937.406;17.7095291862705;31002.782;283.258755691877;1.199;0.0528109837060366
1070;1897.211;117.951770690397;30354.867;1887.37449405812;1.286;0.268559118258903
1071;1937.287;18.3953445469422;30993.193;297.423299223183;1.187;0.0272213151776384
1072;1939.098;26.830778147502;31026.263;424.37548619286;1.204;0.0880000000000011
1073;1935.083;27.0918319978532;30963.831;438.528224529594;1.183;0.0303479818109935
1074;1942.567;21.6846752569536;31080.068;345.494562933314;1.171;0.0181383571472055
1075;1939.547;30.4058728044522;31029.848;486.121352787883;1.192;0.0729109045342304
1076;1938.573;22.2955668463675;31019.352;354.952310171198;1.198;0.0683812839891159
1077;1943.211;26.1451649258199;31091.494;420.009356543368;1.165;0.0196214168703619
1078;1940.60555555556;23.6861361752679;31051.0455555556;374.947021830846;1.17333333333333;0.0205480466765711
1079;1947.89;42;31160.225;666.995000000058;1.32;0.18
