time;transactions_avg;transactions_std;queries_avg;queries_std;latencies_avg;latencies_std
0;267.654;24.5393056951498;4297.415;394.456768461385;11.267;1.29953876433141
1;352.132;23.2688022038102;5637.991;376.808422555812;8.535;0.502279802500559
2;372.832;19.2452335917232;5967.275;304.910133031034;8.113;0.474806276285396
3;379.039;22.8866002062347;6062.335;364.08192661131;8.028;0.51737413928413
4;381.963;26.5526887715721;6111.477;424.910847638655;8.018;0.539032466554642
5;394.088;27.7321855611851;6304.531;445.965865564828;7.866;0.673857551712517
6;401.031;26.7907347603614;6418.412;429.475859852441;7.902;0.71072920300208
7;406.096;26.3444526228958;6496.426;416.121822143473;7.59;0.44997777722904
8;413.515;24.0312455981791;6616.328;383.623756897313;7.514;0.516975821484903
9;426.889;26.0302199183936;6833.029;416.047485593885;7.5;0.688520152210518
10;431.286;26.7284070606525;6895.965;426.166784704081;7.11;0.551126119867337
11;446.912;28.0258073211116;7154.598;452.091778465395;7.023;0.550437099040386
12;450.151;30.7239819847626;7200.502;489.422523364012;7.021;0.533693732397131
13;449.206;35.7909452794974;7186.878;573.791024342491;7.071;0.548150526771616
14;450.511;42.464625383959;7205.164;680.915540580484;7.095;0.676435510599492
15;450.533;38.8561212809511;7207.133;618.424460044237;7.071;0.685353193616256
16;461.816;46.3119229140837;7393.157;744.259727219609;6.929;0.989327549399082
17;474.409;44.7474661740753;7586.852;715.500838459333;6.825;0.915633660368597
18;470.071;35.3708791097979;7522.048;568.171739068381;6.844;0.655182417346506
19;483.611;39.829603425091;7740.667;638.156095920898;6.528;0.702307624905209
20;488.696;44.2568896783314;7819.641;704.949810418436;6.541;0.744492444555353
21;480.599;39.3077812780112;7687.761;627.042664376988;6.571;0.660930404808244
22;485.403;32.9340231523584;7767.06;524.965059370623;6.676;0.508865404601256
23;496.314;38.2307803216215;7938.531;611.902409317862;6.365;0.566502427179262
24;501.799;33.92773952093;8028.964;545.502630721434;6.235;0.472657381196986
25;499.159;29.3107555173872;7988.627;463.790153734452;6.344;0.40880802340464
26;498.781;28.7436805054612;7979.792;462.552275484613;6.397;0.661937308209774
27;484.687;41.6551708794962;7755.412;668.637896365432;6.67;0.5913543776789
28;474.662;57.0291218238546;7598.003;910.195747716376;7.133;1.94473674310946
29;475.94;82.7881356234095;7615.517;1329.53071826904;7.929;4.93041874489379
30;500.565;20.4957699294277;8003.329;324.914682261365;6.627;0.651782939328732
31;496.036;30.247424088673;7938.658;482.905385200869;6.735;1.04250899276697
32;508.203;23.7939488315865;8129.341;375.845808715499;6.292;0.493817780157817
33;514.216;12.5174032450805;8229.261;200.972505455329;6.231;0.428776165382361
34;523.623;12.1487440091549;8375.791;194.440864503799;6.085;0.384141900864744
35;510.809;9.30735671391689;8176.561;144.179952590547;6.33;0.394664414407989
36;494.689;45.7544586789091;7912.033;737.792749693989;7.075;2.48541445236001
37;492.277;42.2566489561117;7880.621;673.413235858187;6.607;0.50523360933335
38;495.292;30.4468690672783;7920.179;484.673911995498;6.456;0.534438022599459
39;498.634;39.8001724116865;7979.152;637.068884121642;6.49;0.659909084647276
40;512.111;21.226232567272;8194.266;347.744626391289;6.292;0.303440274189182
41;507.792;32.2417753233273;8122.388;520.9123547162;6.195;0.389621611310287
42;519.564;14.9768322418323;8314.839;239.596666481411;6.051;0.371952954014346
43;521.058;7.76946690578159;8336.238;122.304676999652;6.267;0.267845104491402
44;513.02;29.0173510162457;8209.323;464.389968583524;6.223;0.576004340261419
45;509.643;26.3640368873956;8159.007;424.66671402524;6.168;0.6259520748428
46;506.577;35.4178359163865;8100.929;567.451272506261;6.308;0.404494746566633
47;512.486;27.4567034437844;8201.683;434.597977469955;6.318;1.09228018383563
48;464.537;62.4923414587731;7428.824;999.195970570335;7.366;2.3898920477712
49;478.26;55.164608038126;7654.342;881.704832172323;7.087;1.58766526698798
50;512.713;27.5409716785757;8203.396;439.447917464619;6.18;0.605309838016855
51;509.52;34.18298992189;8152.44;545.56781824079;6.489;1.26155816354221
52;491.744;38.3319465198417;7870.313;614.083795536901;6.606;0.529475211884378
53;505.917;31.0110538518125;8094.98;495.393445758011;6.397;0.521326193471999
54;494.343;31.9082362564897;7907.517;509.84259325892;6.734;0.632932855838596
55;507.07;23.9668124705805;8110.103;383.854847697668;6.46;0.623217458035324
56;503.869;36.8873806199358;8064.197;588.043077657577;6.52;0.759591995745084
57;514.528;20.597771141559;8233.251;326.639818866294;6.468;0.773069207768615
58;519.458;17.5951287576997;8313.133;281.114416494458;6.253;0.554058661154221
59;519.007;18.8885081729627;8301.533;302.578908156212;6.245;0.477058696598225
60;524.794;15.6430509811866;8398.487;247.895618478835;6.134;0.573745588218337
61;517.879;11.2183719407054;8281.359;178.911476459706;6.242;0.452101758457101
62;523.22;9.17783852549013;8374.332;140.973008891732;6.11;0.452526242332987
63;512.521;23.022732874272;8200.647;371.186224233841;6.383;0.483053827228391
64;491.106;40.2356263030671;7857.49;644.28410903886;6.613;0.755341644555636
65;519.897;11.5044783019503;8318.158;183.45954800994;6.148;0.359048743209038
66;509.033;29.2572264748378;8148.419;469.070346695468;6.564;0.845318874744915
67;504.905;23.4698271190901;8076.595;376.34719035087;6.216;0.653501338942771
68;522.032;15.8234293375323;8351.611;255.060112736224;6.111;0.44865242671805
69;519.182;13.1087770596654;8305.702;209.594468333437;6.423;0.814175042604479
70;517.589;16.0616539932844;8282.623;255.458036047024;6.126;0.515620015127427
71;506.372;28.9655532659054;8100.738;466.952117926447;6.454;0.886997181506227
72;508.951;23.9144297234938;8142.203;378.202700018156;6.202;0.498453608673871
73;496.491;30.0922067818231;7945.658;487.55712581809;6.455;0.548894343202763
74;488.911;38.7661624229181;7819.452;615.931527376212;6.694;0.828350167501642
75;500.983;30.3141053141929;8017.024;485.312806882327;6.353;0.689420771372608
76;508.772;20.5500826275691;8141.153;330.300701635638;6.258;0.306848496818855
77;507.294;14.8179311646395;8113.101;239.477951655243;6.54;0.414921679356467
78;514.095;12.1912733133162;8228.241;195.246868884063;6.377;0.405587228595766
79;508.924;15.3438223399529;8145.098;238.893730675349;6.512;0.515883707825704
80;522.319;13.5326903829172;8356.202;216.554384338011;6.079;0.47270392424856
81;509.036;16.0443168754562;8145.887;255.884166686809;6.466;0.515251394952025
82;514.293;10.6383457830717;8228.083;168.224529962082;6.317;0.381786589602097
83;506.21;42.3164400676625;8098.065;680.3172096199;6.013;0.431255144896844
84;494.685;56.2354271345032;7915.088;897.263126588842;6.781;1.70391578430391
85;516.362;14.9654119889861;8260.202;238.434462810999;6.375;0.6905396440466
86;512.378;30.7087276844868;8201.133;488.351106173606;6.274;0.552651789104136
87;512.413;22.2306666791653;8196.213;355.011826677714;6.332;0.582628526593059
88;522.607;10.173879348601;8363.715;164.107938458145;6.018;0.341168580030472
89;510.02;22.4071359169321;8159.62;356.35794813642;6.473;0.486991786378389
90;490.084;44.988465010488;7838.75;718.656733593996;6.704;0.901345660665212
91;501.297;37.418907800737;8024.673;602.439775447299;6.472;0.582388186693385
92;520.494;11.1956171781631;8322.498;180.211651332515;6.129;0.396798437496923
93;500.753;39.0019709886567;8015.456;624.674890614306;6.557;0.632740863229171
94;513.753;21.1507342898558;8220.613;335.808558052025;6.269;0.492878281120215
95;501.07;32.57933209874;8017.313;524.554222441315;6.601;0.868682335494394
96;513.531;24.4189469265177;8214.008;388.898453681714;6.156;0.264204466275644
97;501.87;30.610820309165;8035.713;489.473481795487;6.595;0.66074579075466
98;508.491;23.0693382869991;8130.747;371.781551883631;6.483;0.42692036728179
99;495.04;40.8129376546207;7922.652;651.514930079115;6.516;0.565777341363197
100;503.87;34.8057722224349;8064.414;558.541521486092;6.782;1.58465011911147
101;511.681;18.3747905838395;8184.697;293.815902634622;6.359;0.465606056661621
102;502.292;38.1014112074595;8035.061;607.906931371085;6.396;0.746179603044727
103;492.459;46.2263006198859;7878.239;741.542847979138;6.872;1.48787633894756
104;506.751;29.2383462083622;8112.005;466.265803276398;6.484;0.438889507735142
105;510.489;34.310204735619;8166.231;553.301811752833;6.335;0.446346278129442
106;504.092;37.8626551631032;8065.07;611.680126340592;6.461;0.767638586836294
107;520.808;14.3882047525055;8333.137;232.498259522508;6.337;0.477285030144469
108;521.004;18.2107101454052;8335.47;288.324931353546;6.336;0.710087318574273
109;522.879;14.235262870776;8364.671;229.166192858004;6.087;0.565385709051785
110;516.51;22.818577080966;8265.764;359.234316879683;6.245;0.485700525015153
111;525.807;15.3003934916694;8411.816;245.311029723463;6.07;0.291719042916291
112;513.089;15.2107458397033;8211.015;236.99498202492;6.397;0.52811078383233
113;500.415;49.5367712411704;8009.141;793.403772330974;6.95;1.76810067586662
114;498.069;54.4782331670179;7963.208;869.643666679626;6.853;1.64555188310791
115;509.454;33.3403245935011;8153.939;529.06345794148;6.534;0.619486884445494
116;493.779;61.0749708882452;7904.559;975.596779263335;7.118;2.24138260901614
117;520.602;24.1350623782102;8324.934;390.20706921323;6.073;0.385902837512244
118;513.515;13.8592238238671;8219.841;222.633853555617;6.413;0.426779802708587
119;496.955;36.585340575153;7946.476;582.64701492757;6.585;0.802598903562679
120;523.912;18.2480512932201;8385.196;292.864071821727;6.161;0.517077363650756
121;519.583;24.7367742642407;8312.299;399.507045656305;6.182;0.673079490104982
122;517.476;32.3113615312019;8280.195;515.97272376067;6.299;0.612118452589048
123;516.394;32.9800000606426;8264.509;525.716674121104;6.191;0.744626752138281
124;508.764;41.071856349574;8137.033;659.701121085157;6.274;0.668254442559121
125;515.415;31.4355490647133;8246.538;501.806529148405;6.377;0.69631961052379
126;509.813;41.4242745380043;8158.112;669.926530849477;6.14;0.785926205187226
127;501.663;43.7718978455354;8025.015;695.665819675637;6.419;0.746772388348688
128;520.641;20.6581700302806;8329.871;331.449819835481;6.151;0.669797730662034
129;517.383;11.4796455084673;8281.135;189.036216543286;6.179;0.291940062341567
130;521.23;12.9752302484365;8337.789;203.802882288264;6.37;0.451929197994575
131;524.856;12.438920531945;8400.711;200.017368268377;6.227;0.376405366592974
132;523.357;10.5869769528393;8369.018;174.60275586603;6.231;0.423991745202655
133;515.447;25.6477691232594;8250.65;406.293110204951;5.98;0.434234959440158
134;487.081;72.5224330052434;7792.189;1164.63704674417;7.579;3.39815082066703
135;503.242;64.3302447997831;8050.681;1024.67191499963;6.912;2.54920301270809
136;523.589;12.439734281726;8382.751;198.181959191534;6.136;0.488184391393243
137;510.101;35.4054050817108;8155.414;567.756613615392;6.654;1.64381385807518
138;527.66;14.3607757450626;8446.073;230.398611716709;5.848;0.375067993835774
139;487.761;51.4415082302221;7803.284;824.451772285077;6.655;0.716648449380871
140;524.643;12.879799726706;8393.581;206.443501348464;6.076;0.420552018185625
141;519.746;11.1563893800884;8314.443;177.059064159399;6.283;0.35372446904335
142;516.066;15.1445410627074;8257.356;246.752982482452;6.277;0.435431969428081
143;520.743;12.227786430908;8335.694;194.241377579572;6.204;0.519214791776983
144;519.234;20.6999532366602;8303.836;333.837322784584;6.128;0.531202409633082
145;520.689;7.7248177324858;8331.914;124.316964425619;6.08;0.303710388363646
146;486.643;45.2266549835396;7785.604;724.541931032275;6.431;0.509695006842325
147;470.444;93.3117160060828;7531.617;1490.68539378401;9.827;10.2515170096918
148;483.815;91.209340557862;7740.936;1460.00893528226;7.424;3.76899774475921
149;476.164;95.8013763157919;7617.903;1532.40985456274;7.816;4.49678596332981
150;499.244;46.1989502478147;7986.201;736.392425238759;6.651;0.888396870773412
151;500.859;39.3602727251719;8013.534;630.995393900791;6.996;1.922145676061
152;481.862;91.1930837070444;7712.2;1458.19627458035;8.342;6.30542908928488
153;505.852;37.0759166575815;8093.931;591.472364788925;6.634;0.709636526681092
154;497.297;45.4290046225972;7956.958;725.327476203671;6.4;0.584876055245892
155;500.683;27.5232599994967;8006.298;440.838396372166;6.561;0.783344751689831
156;510.087;18.2453325812359;8161.512;298.288123223186;6.309;0.397780089999476
157;501.27;36.0019574467819;8022.321;573.907800860903;6.359;0.747963234390564
158;497.313;39.7875407759774;7956.605;639.610555013744;6.669;0.826358880874412
159;502.277;40.7497528949577;8033.524;648.672233924039;6.492;0.812512153755262
160;500.185;28.946106560294;8005.65;459.703640925344;6.527;0.574335267940252
161;499.771;37.9266696270577;7996.768;607.467481858919;6.65;0.874185335040571
162;512;21.3952962120183;8191.298;342.704819861028;6.231;0.430916465222665
163;516.957;23.3533376843632;8270.333;367.014100847628;6.07;0.478497648897053
164;497.643;32.1211905289946;7963.971;519.693497716691;6.476;0.739583666666588
165;516.755;27.0086320460722;8267.992;434.942362383881;6.442;1.01234183949889
166;511.281;27.1641600091014;8179.304;430.019655462378;6.366;0.713501226347926
167;509.692;29.9968894387393;8156.669;487.757604214433;6.599;1.05094671606128
168;519.208;26.180452555294;8307.134;416.247485787013;6.087;0.422209663555907
169;503.729;45.3420353424943;8057.892;731.150660901029;6.8;1.27918724196265
170;504.394;35.551519292429;8070.403;564.063260832509;6.53;0.597678843527177
171;514.73;18.4146707817431;8239.394;294.879778764127;6.162;0.571923071750037
172;508.735;29.7577805792036;8136.843;474.784551476771;6.353;0.557082579156808
173;510.41;32.1030191726577;8168.442;514.457113660602;6.143;0.594054711285071
174;504.903;40.7838512281519;8074.441;655.005022292946;6.544;0.726363545340769
175;502.554;35.9760198465594;8040.546;578.662755397307;6.306;0.53498037347178
176;476.81;70.2607487862178;7634.846;1126.08843433542;7.666;3.51700213249864
177;514.194;21.49696592545;8225.707;343.091077909384;6.301;0.57280799575426
178;513.137;24.7912807454544;8213.974;396.614007170712;6.362;0.520399846272086
179;506.731;23.8557475045311;8099.612;385.476078448468;2.784;3.15317998217672
180;192.685;11.7370790659349;3071.836;189.82699840644;10.823;4.55724927999336
181;197.94;15.2534710803802;3170.527;242.792555118561;27.986;55.1798180859633
182;191.242;8.08497223248095;3061.564;138.408980936942;10.076;4.28564394227985
183;192.188;15.7941646186178;3070.224;253.549500539838;12.919;8.50717514807354
184;196.385;15.6152062106137;3148.585;250.000502649491;9.399;3.8327182260114
185;197.283;16.0668279694528;3150.04;257.156672011447;10.473;4.7650646375469
186;189.928;11.1991328235715;3039.746;182.762263785499;14.062;12.3093182589451
187;186.264;12.6936859894986;2984.529;202.332708648412;12.772;11.1112859741796
188;190.053;9.23014848201294;3040.575;149.614794672853;12.645;6.45439423958593
189;193.971;15.6888702270113;3100.065;254.270813946471;10.155;5.6417094040725
190;190.511;14.0766362814416;3052.412;222.19177094573;13.532;9.57026206537731
191;193.846;10.8395656739556;3100.336;175.215301112656;13.444;9.41806264578868
192;187.137;11.935355922636;2990.969;190.355131606686;10.237;2.61213724754271
193;191.195;15.6548965183421;3059.509;246.89468671682;10.626;4.19251046510322
194;192.749;13.3565769941257;3086.666;206.291046979746;16.501;16.8891364196042
195;196.395;15.9780019088745;3139.404;253.73075348487;10.038;3.23721114541513
196;187.967;12.3373368682225;3007.45;194.042681129695;12.696;6.58842348365677
197;192.112;9.17344079394383;3075.37;144.405574130652;9.235;1.54736711868902
198;200.889;15.6031679155229;3214.411;249.341962431112;13.991;9.46380837718093
199;189.193;9.23867853104497;3027.09;143.779533244485;12.264;7.32939042485799
200;198.071;14.8417495262519;3170.93;239.309790689801;9.676;2.59322656164092
201;188.039;7.61641181922238;3004.191;118.140544391001;18.141;17.4438650820281
202;194.885;6.79574020986679;3119.175;110.323172928442;10.721;3.92228619557522
203;190.642;12.0320412233337;3052.582;196.556999407304;11.001;4.52330951848312
204;187.237;15.5335598302516;2994.804;245.657931408701;13.756;9.26846826611604
205;202.055;12.2701566819663;3232.389;196.323271593053;12.56;4.56479791447552
206;194.346;12.0972643188451;3110.624;192.128374281354;13.545;6.52939545440465
207;192.077;13.6794400835709;3074.517;214.680334546512;15.07;13.6664230872602
208;190.715;9.34835627262852;3046.333;146.469815596937;13.963;8.36319801272217
209;191.405;7.95031100020622;3069.283;132.605941801262;9.512;2.9817840297379
210;195.704;9.17849028980203;3125.886;150.264313807368;14.058;7.99889842415817
211;195.781;12.912843567549;3130.399;198.205182094221;11.823;5.48068617966765
212;194.806;9.97790178344161;3120.602;161.988823367539;9.633;2.23384444400231
213;191.305;15.3245021126296;3061.291;253.106948006177;10.53;4.01670511738165
214;194.241;9.28304739834969;3105.345;154.129644342019;11.446;4.22843517154987
215;199.751;13.4792955676471;3199.826;214.583235514801;12.104;5.61661321438462
216;194.365;14.0490755923655;3106.82;222.552406277709;12.306;9.22023665639879
217;197.564;8.89573178552575;3162.62;139.078925722046;10.984;4.56472386897608
218;185.344;15.9866282874158;2964.914;256.80374102415;13.033;9.18125051395506
219;193.423;11.5172696851293;3097.757;180.635401350347;11.14;6.12591870661046
220;196.524;14.3129711800172;3139.458;229.704035523979;13.56;6.78708037376898
221;194.273;12.3872588170267;3117.466;201.114090913595;11.329;4.05188462323399
222;196.507;12.6474242832286;3132.934;200.273879934454;12.608;9.37436803203288
223;191.7;14.0378424268122;3070.199;226.113457735267;10.137;4.90496697236587
224;184.93;12.4789286399109;2960.485;192.606729853869;8.864;1.74802860388495
225;193.329;11.8199749999739;3092.096;183.409771124661;10.34;3.73085244950802
226;191.813;13.731049522888;3069.726;220.881935893359;10.848;3.114571559621
227;197.186;9.61834933863406;3156.47;153.269383309247;10.056;3.4473386836805
228;194.327;20.3531265657146;3109.421;320.748079540624;23.399;35.296006133839
229;186.249;6.76089705586539;2978.881;106.338299163552;10.214;3.53062374092737
230;197.795;13.7730129238299;3166.221;221.767076341369;12.414;7.72214503878295
231;194.998;14.5363205798442;3118.267;229.671408845334;10.604;4.31665425995643
232;194.683;13.0923680440171;3111.931;206.333759111308;8.283;1.46855745546436
233;186.279;13.405138156692;2991.437;207.832459305559;13.796;7.46602866321849
234;184.536;17.983719415071;2943.136;288.071280005486;68.609;120.677702700209
235;198.58;18.6703829633998;3181.462;297.551860683146;16.819;16.3768687177983
236;188.742;14.1939992954768;3017.511;224.348734761309;9.731;2.27079919852021
237;196.488;9.96212908970789;3139.201;164.312583233903;11.909;5.88226563494033
238;187.215;10.6582092773605;2998.833;170.903564564925;9.448;2.25976016426523
239;186.153;16.0102667373158;2981.461;252.807689457812;10.614;3.97319820799315
240;184.711;12.3186610067814;2951.403;195.617054167061;10.17;2.8537519163375
241;194.438;9.72752774347129;3109.801;159.162931139757;9.692;2.56525164457603
242;190.798;13.9666630230703;3055.695;221.68728137852;10.644;5.96944587043052
243;187.402;7.93375926027567;2999.022;124.343679437278;9.182;2.57374357697109
244;192.496;9.94857999917526;3077.047;161.11367242107;9.251;2.26500088300203
245;188.498;14.3569138745068;3018.255;236.540382736225;10.156;3.96262337347369
246;192.536;14.5964325778594;3083.881;234.1848310822;10.622;5.83275200912914
247;199.642;13.1338515295399;3194.661;204.02402267625;9.882;3.19124051114923
248;192.997;9.66968774056333;3087.359;150.11302065112;8.896;2.16753408277701
249;195.815;11.8899068541347;3130.526;185.040563725907;9.882;3.08146004355078
250;197.878;13.1139252704906;3168.044;204.661999364792;10.087;2.47080978628464
251;193.44;10.6120761399454;3092.938;174.499053051869;10.391;3.05837358738267
252;194.883;10.6287196312633;3116.724;175.415352532204;11.316;4.69753382105972
253;191.697;9.50290276704948;3070.652;151.894642749502;10.653;4.29999313952941
254;194.387;13.082262075039;3113.08;214.071889934199;10.02;4.1605576549304
255;199.167;12.9366139696602;3187.778;203.650647570774;9.685;2.5314116615043
256;191.138;6.72282053902929;3052.587;109.833016898382;8.718;2.17014193084231
257;189.817;14.3568938492976;3032.976;235.640413817329;8.852;1.12541370171151
258;193.397;10.5459442915274;3100.14;163.237905218116;9.208;1.37137011780189
259;195.162;14.4068635032058;3119.185;233.22734291887;8.399;1.13077362898151
260;196.92;10.773798772949;3152.724;173.033531559636;9.113;2.42706015582639
261;192.631;9.10327023656861;3081.313;145.146281113213;8.905;4.02806467177477
262;191.402;14.0705087328073;3065.56;221.899628796448;8.655;1.39749955277274
263;192.872;9.67488790632724;3081.944;156.568335764299;9.411;2.58496208869686
264;200.593;12.4523813385236;3207.884;200.950752633574;9.607;2.81290970349209
265;193.275;12.7011119591948;3093.279;201.431422744815;10.239;4.05365625084318
266;185.817;13.1923470618386;2974.797;212.988567488966;8.54;1.04191170451243
267;189.149;7.71738096766003;3023.585;123.736208221347;9.251;4.24896563883494
268;181.824;25.2028741218139;2911.885;395.324227723272;41.302;98.8862057923146
269;197.557;17.2701835832744;3157.004;280.291288740839;10.382;4.66845113501255
270;196.515;13.4272270033692;3149.928;215.030455833579;9.515;3.88746511238364
271;194.106;12.509864267849;3106.034;198.92574354266;9.666;3.21647695468194
272;193.956;5.35830420935521;3102.897;82.6970784308583;8.688;1.77574097210151
273;188.415;14.6723292288574;3014.539;228.874770756849;9.333;2.96393674021562
274;193.04;18.1698514028047;3086.748;287.072710677965;9.589;2.41786041780744
275;193.565;11.7154250883187;3094.042;185.422392811663;7.857;0.916602967483746
276;191.579;14.8439499123378;3066.282;241.859788216223;10.032;2.96516711164818
277;188.304;12.4866682505782;3013.566;200.947300514331;9.428;2.84147778453395
278;188.962;7.47990213839683;3026.089;120.941603714334;8.722;1.80256372980263
279;188.659;11.2840759036796;3021.261;180.790516203147;10.559;2.83441157914654
280;194.295;13.2752568713373;3110.533;214.328330327561;13.371;9.6656716786781
281;199.585;21.7543950731801;3188.157;345.41083723734;10.796;6.27931397526832
282;191.417;7.44426900373788;3067.076;125.020893949771;12.251;5.58910627918274
283;192.095;13.6272251394037;3068.303;217.924904958099;10.667;3.47083289715884
284;187.661;11.2970911742802;3001.498;178.80792945504;10.549;2.99619575461951
285;192.938;13.7462720764573;3090.934;220.752256667969;10.396;2.8102106682596
286;182.801;11.1458265283471;2926.206;180.96613888792;8.845;1.88186210972005
287;200.772;9.92389923366823;3206.344;162.977237502664;13.705;7.42505925902278
288;188.734;11.9855714924243;3021.411;195.447756213788;8.823;2.46527503536623
289;182.284;17.102803395935;2918.261;274.192718118119;8.609;2.3427439040578
290;192.219;13.3276182793479;3075.29;218.438984478504;10.805;3.79919794167137
291;186.29;11.8403226307394;2979.724;190.221968878472;10.713;4.81472751046204
292;187.205;8.82888129946291;2991.98;141.299734465419;10.485;3.0490596911179
293;191.514;16.4475099635172;3069.204;270.60576033041;11.459;3.66213994817238
294;190.398;10.5742184581183;3039.655;169.703646469375;11.159;3.58346885015065
295;192.401;11.8801586268873;3081.317;195.510551277927;8.895;1.7741829105253
296;183.674;10.5977942988147;2942.86;168.824383961566;12.596;9.12439937749329
297;190.824;10.5728210048215;3050.507;165.849727346779;9.053;1.54313998068872
298;195.77;12.7821179778626;3133.632;200.14518774131;11.723;4.77302639841852
299;189.203;9.06134211913499;3029.954;151.561992874207;10.839;4.08037608560779
300;192.933;7.19640194819526;3079.72;114.946973165879;12.624;7.7310480531426
301;197.771;11.9805270752163;3171.043;186.633259846687;11.353;4.8890102270296
302;186.687;11.8188984681311;2989.068;194.015637400699;13.107;9.03678266862715
303;197.661;18.1133213133317;3159.37;292.073150803017;12.139;5.78267490007868
304;193.679;12.9993210976573;3098.751;207.914675453671;12.437;4.87759377152301
305;193.281;9.12395467985254;3092.78;144.478791800048;13.016;7.46975930000425
306;195.77;8.22619109916657;3128.818;123.830461583565;14.038;6.72004136892028
307;198.023;14.3555139580582;3170.061;231.096440320914;12.233;7.71756444741474
308;196.925;10.07384757677;3148.511;161.114594152729;10.212;3.20133971955492
309;194.61;11.0195934589261;3117.656;179.996558533772;10.591;3.89658940613454
310;197.399;11.3443787401513;3156.888;184.072724801914;10.41;2.30708040605437
311;195.781;9.73117819177048;3131.499;154.675655579659;10.973;5.43842633488769
312;190.375;6.73191985989169;3046.685;99.35883707552;10.499;3.10121089253859
313;195.424;13.8447002134386;3130.2;219.608946265861;10.239;2.1050199523995
314;194.117;16.9311452949879;3100.866;259.60638810322;10.007;3.69435799564688
315;191.973;16.488009613049;3072.06;261.166587640913;10.57;3.46203697265064
316;195.926;18.352475146421;3136.59;292.63044041932;11.593;5.59813013425018
317;193.679;10.1533663875584;3097.259;164.855505607171;13.276;6.82446950319217
318;199.22;10.8193761372824;3189.709;171.902836477475;18.172;14.113174554295
319;189.698;13.3782523522318;3034.055;216.350115518797;10.301;3.25839669162612
320;194.705;12.7849194365863;3118.691;207.653446224709;9.993;2.81124901067124
321;185.091;13.000235728632;2957.285;206.38108989198;12.023;4.61012592018916
322;182.486;11.2947290361481;2917.662;181.152827789133;13.353;9.7694114971169
323;198.591;11.3436594183712;3180.358;185.626158652283;12.904;5.88221930907034
324;190.231;9.59556611149069;3037.391;150.68977990892;12.642;3.57751254365376
325;186.195;8.14238079433788;2984.913;123.552405970099;11.44;7.25517746164765
326;204.702;19.5342114250871;3270.926;308.850727284227;11.961;4.8249941968877
327;188.878;13.5898195720181;3027.461;215.088316532999;9.195;1.75340953573317
328;194.433;11.9070886869966;3109.59;186.528473912164;10.38;2.94510441241054
329;196.06;13.96437682104;3136.662;220.762433615862;11.148;6.35679762144431
330;193.298;12.7836440814034;3091.061;205.001516845599;11.838;4.14711417735273
331;194.829;12.2493848416968;3115.651;194.777882597076;11.383;4.62877748439045
332;191.764;14.8139766436968;3070.342;229.250592967608;11.431;4.00468338324018
333;196.203;13.4061225192079;3141.264;221.312054041335;13.532;5.39812893510335
334;189.352;10.8939770515639;3029.343;172.905644040328;13.911;6.034910852697
335;190.658;11.4775727399136;3049.058;193.834217711952;10.65;2.41209037973289
336;189.7;16.1567471973787;3037.259;256.716210140683;14.71;15.5822848132102
337;180.208;27.8895538867154;2884.149;446.191713267962;34.129;65.8974913710681
338;194.374;11.785613433335;3108.3;183.728191631011;47.755;103.221295210824
339;194.963;13.9296145316371;3120.212;219.679338618816;15.053;7.77878274539147
340;194.434;21.5153955111214;3110.748;338.399178155029;10.11;3.90214043827231
341;192.489;16.6002406307857;3079.825;259.162081533938;14.717;10.6029977364894
342;194.142;10.430069798424;3107.262;160.591754445865;14.028;8.01415098435261
343;186.984;11.4315197589826;2988.355;180.045104251674;11.183;4.90426559231858
344;192.245;13.9978364399647;3074.632;225.551028230851;9.447;3.67190972111244
345;188.471;9.94836614726245;3019.656;156.95724578368;11.274;5.34880023930601
346;198.598;14.455416839372;3175.077;233.200765052345;11.807;4.3149925840029
347;192.806;14.1822693529636;3088.42;228.273036340246;9.347;2.20330229428465
348;191.16;10.2511150612989;3055.554;164.742158308069;12.613;8.34968508388191
349;201.575;9.83574221907043;3226.923;157.199833654485;13.082;6.36674767836766
350;196.083;11.6309845241065;3138.235;182.308698489687;12.585;8.15727313506174
351;196.078;16.3648976776514;3133.93;257.836247568103;13.401;10.9796151571902
352;197.476;11.5506079493678;3166.119;186.886603770849;11.984;4.16023124357288
353;183.745;29.0869734589214;2934.807;462.099897642277;60.084;147.399969959291
354;192.787;15.3879550623204;3088.899;251.302153928295;25.088;32.7132746144436
355;188.599;13.3242271445664;3010.771;207.589774625344;10.474;1.96893981624629
356;187.928;12.3306989258516;3007.062;195.935950698176;12.073;5.49190504287901
357;199.282;6.70887144011662;3194.61;109.2187697239;19.664;15.7882552550939
358;198.265;16.0561142559462;3167.551;256.578313793271;11.316;4.85053440354772
359;199.387;15.0922192205123;3193.471;241.693772259449;4.568;4.89559761418358
360;485.606;41.2363657952549;7780.335;656.483019007342;6.775;0.667611413922803
361;514.689;29.7324722988187;8235.525;475.28792806573;6.193;0.759250288113221
362;501.078;35.9092193733033;8012.335;576.778803030224;6.907;1.31148046115831
363;516.663;12.7195731453581;8269.804;203.263318195906;6.356;0.445515431831492
364;518.71;20.9307864161853;8293.561;333.850374313173;6.343;0.56096434824326
365;520.195;18.0959289620644;8323.904;285.961483986908;6.07;0.313910815360032
366;518.314;16.8319976235717;8297.716;270.425682441586;6.353;0.645833569892432
367;494.801;39.9130834313755;7914.527;638.052445462759;6.477;0.513654553177529
368;503.131;32.7601521516619;8052.402;521.533553854413;6.302;0.491463121709056
369;519.926;23.3818460349038;8317.097;374.049243791523;6.276;0.710382995291971
370;525.77;11.183225831577;8413.62;184.062050081004;6.147;0.486786400796079
371;527.868;8.12227529698746;8445.694;121.636400982632;6.015;0.282851551171294
372;513.303;26.3412281604334;8215.639;428.897313082007;6.342;0.659784813405093
373;513.93;20.140970681672;8219.226;318.919055912338;6.472;0.703047651301109
374;515.819;26.2024073130677;8256.114;423.170462891753;6.246;0.469940421755772
375;530.426;17.4163051190532;8482.135;281.472634131616;6.085;0.651141305708672
376;526.585;13.4662691566775;8424.99;213.172448454297;6.248;0.497369078250759
377;529.979;9.66966747101466;8484.261;159.497101694639;6.073;0.402841159764003
378;506.598;37.1947143556719;8101.857;596.061951965576;6.301;0.463259106764234
379;520.096;24.480974735497;8322.763;392.671617386587;6.218;0.579962067725112
380;505.203;35.7011151226405;8084.758;573.142567740343;6.335;0.617418010751232
381;516.745;26.6148553443376;8268.019;426.671145296959;6.096;0.391999999999999
382;503.559;31.1724751824424;8055.644;501.94150271122;6.546;0.632853853587059
383;510.347;30.8866990952415;8165.465;494.668753111632;6.5;0.666603330324717
384;514.709;23.9618114715866;8233.754;382.768295871052;6.413;0.698584998407508
385;518.739;33.6355878349124;8299.917;536.471953731973;6.067;0.458258660583734
386;513.597;30.1038133963115;8224.046;482.728670377049;6.248;0.504436319073079
387;526.467;15.1136600795433;8421.574;238.73369645692;6.104;0.647166130139693
388;514.163;50.8677917841927;8222.927;816.492292125898;6.527;1.69489262196754
389;496.556;69.2229442020494;7945.484;1105.83844994828;7.327;3.37178009365973
390;512.626;29.4005204715828;8199.715;471.402797642316;6.449;0.839529034637876
391;513.715;41.8530080758847;8219.513;667.227479530773;6.737;1.95812691110663
392;526.458;10.2194635867016;8423.226;167.452312148802;5.929;0.296898972716312
393;534.447;8.54501849033027;8554.032;134.527027306649;5.833;0.287125408140744
394;520.49;20.2104552150605;8327.142;326.003329301976;6.111;0.439737421650698
395;492.929;47.9383404906765;7889.767;768.049877170101;6.532;0.851302531418763
396;500.148;37.6595315424924;8000.607;601.961562561111;6.41;0.546955208403747
397;509.48;26.5631180398678;8151.151;425.933569549295;6.464;0.347223271109519
398;503.657;39.2384915739628;8060.811;625.642857442616;6.238;0.679555737228375
399;521.432;22.3140636370881;8339.046;347.541474537917;6.158;0.6532044090482
400;505.826;34.5110947957295;8095.117;548.146585888345;6.426;0.582995711819556
401;509.964;30.3257808473241;8160.335;487.729263367486;6.408;0.789794910087418
402;516.469;22.310397777716;8260.005;356.05520260908;6.296;0.669808927978709
403;526.739;11.248969241669;8431.599;184.256519746319;5.933;0.379764400648615
404;514.654;18.14942599643;8231.557;295.973177874262;6.29;0.451730007858667
405;524.225;20.025632199757;8390.818;314.811677572451;6.102;0.944180067571861
406;523.253;16.8594199485056;8370.652;276.381411596378;6.075;0.385622872765607
407;511.995;24.2501155667358;8191.738;382.742162004633;6.221;0.817966380727219
408;502.079;56.0002274013239;8033.15;895.932524657959;6.872;2.17260580870069
409;489.073;56.0514765282773;7821.056;897.662479122302;7.121;2.42859815531511
410;491.367;57.2037813522848;7865.968;913.923422249384;6.775;1.0924490834817
411;503.774;45.707497896953;8057.572;729.781766965967;6.67;1.50283066245003
412;520.016;28.8875018649928;8322.151;464.164619600621;6.131;0.569094895426051
413;528.555;16.7327978832015;8457.061;271.321118251064;5.997;0.51209471780131
414;524.853;14.393577769272;8401.05;227.501687510226;6.12;0.70509573818029
415;514.322;29.5882722712906;8226.644;474.169192909055;6.209;0.430359152336735
416;516.145;31.9432259641988;8260.214;509.055709077086;6.074;0.531379337197074
417;510.462;23.2071410561494;8168.982;371.053319990576;6.31;0.58716266911309
418;508.844;47.2937844119071;8136.826;756.45873411838;7.16;3.23583065069852
419;519.061;37.5767104600705;8304.676;599.343308783899;6.212;0.759892097603337
420;519.011;19.671847117141;8306.875;309.359931188536;6.342;0.675408024826474
421;521.883;14.7115390425298;8347.905;234.993138761493;6.147;0.486457603496953
422;516.063;27.4095873920073;8260.532;436.981995047908;6.248;0.658920329023169
423;514.413;54.4290374800065;8226.467;868.611653065397;6.471;1.28951502511603
424;481.677;102.093081357161;7709.019;1634.90475223757;11.074;14.5929916055619
425;509.214;34.9032050677301;8149.019;560.138152788217;6.338;0.497047281453191
426;514.593;30.2354285731171;8231.762;486.441831934727;6.262;0.636282955924487
427;515.389;22.7741443088407;8244.938;363.425522350881;6.124;0.732600846300353
428;507.192;36.6943469215605;8114.775;588.243575608789;6.323;0.717050207447145
429;514.746;27.295464531679;8236.618;438.329881294906;6.345;0.804751514444049
430;517.11;17.0336443546287;8275.125;274.280869156031;6.102;0.464086198889825
431;516.888;17.3663719872616;8267.83;279.469027979876;6.168;0.473303285431248
432;510.563;37.8138882026169;8170.506;600.695752144121;6.251;0.540877989938582
433;512.127;36.4089192506439;8189.72;579.449029613469;6.36;1.07202611908478
434;522.387;14.8890685067965;8357.203;238.734863396597;6.017;0.510412578214915
435;518.069;17.728895876502;8292.893;281.598803550369;6.227;0.656217189655987
436;514.419;30.5616093980646;8232.817;491.757275636065;6.239;0.528629359759753
437;500.163;46.4796768598906;8002.315;743.918560895618;6.497;0.841154563680183
438;524.059;14.1380284693459;8384.737;230.049389177592;6.082;0.502887661411565
439;516.236;13.0664870565912;8262.561;210.565180713777;6.158;0.515903091675166
440;506.321;36.3490518308237;8096.438;580.904509223313;6.403;0.728917690826606
441;499.297;59.1735865145939;7990.524;943.253755351135;7.327;3.37450455622748
442;505.268;50.6106709696675;8084.29;812.506695923146;6.741;1.68875368245342
443;520.508;15.1315219327054;8330.507;238.638359491917;6.358;0.472690173369406
444;523.766;17.1595688757038;8373.875;275.637003548146;6.092;0.629123199381475
445;522.863;15.4143680052071;8369.505;244.787864088487;5.964;0.36560087527247
446;518.982;16.7150087047514;8303.723;266.428055243809;6.063;0.527883509876949
447;510.754;26.9130136551061;8171.248;429.395783765978;6.268;0.471949149803236
448;505.816;37.7058985306013;8095.434;608.60940835976;6.46;0.70403124930644
449;514.479;21.5927985448846;8233.083;343.871659636263;6.323;0.598699423751177
450;518.527;14.8114712638556;8295.743;235.876080858139;6.153;0.435936922042629
451;519.23;16.4850113739734;8304.388;266.088016144994;6.217;0.387867245330143
452;515.201;23.1452545676197;8244.72;368.816859023626;6.324;0.587114980221081
453;518.023;13.8147479528205;8288.653;223.628684208875;6.147;0.314198981538766
454;511.36;17.6002931793749;8181.534;280.17357909691;6.317;0.773550903302424
455;507.702;28.382507218358;8122.916;450.141337941762;6.299;0.472153576709945
456;521.734;16.0069598612605;8349.056;258.534241917783;6.063;0.52373752968448
457;511.358;45.5515814873636;8179.945;732.894803491621;6.23;0.577667724561454
458;516.394;20.1980222794198;8261.696;324.831497247405;6.201;0.467513636164752
459;506.115;35.6216653877935;8101.65;571.671942953305;6.436;0.713276944811766
460;509.593;24.3547125008696;8152.394;389.490832965339;6.303;0.632661837002986
461;506.702;41.7181128048726;8104.113;660.882849604218;6.212;0.742910492589781
462;504.078;33.3841147254207;8062.375;540.113940446833;6.484;0.611427837115718
463;495.363;41.6367904742909;7934.621;664.825988172104;6.543;0.721956369872854
464;508.887;27.6262194481974;8140.101;439.872417399635;6.337;0.623923873561525
465;508.225;21.6578070219495;8128.674;342.690012962147;6.467;0.528072911632474
466;505.9;32.131469309697;8094.977;518.816758269246;6.42;0.67269606807235
467;510.121;32.1582594211802;8164.547;513.423226881099;6.58;0.877017673710171
468;516.528;27.7255376142649;8261.263;444.758763399873;6.348;0.738306169552985
469;512.097;28.6837964886109;8192.853;458.256992680994;6.526;0.545677560469551
470;521.004;15.5443437944453;8340.273;249.708372508815;6.036;0.465879812827301
471;524.024;30.6040488171087;8382.702;492.8144811549;6.175;0.831062572854778
472;492.759;48.3355722941193;7882.755;773.528504752727;6.655;0.795025156834669
473;490.241;43.0389183065745;7843.655;690.30164638728;7.291;1.79089614439253
474;479.159;66.7881015525969;7669.241;1066.60807381578;7.431;2.46517930382355
475;509.579;21.5547528169517;8151.868;347.651798263711;6.31;0.705847008919064
476;511.19;30.7351082640021;8179.405;488.264150481084;6.738;1.42656790935448
477;501.271;29.1524144626149;8020.426;466.574378126362;6.426;0.471342762753383
478;513.933;20.3806889235871;8222.923;327.639500794721;6.432;0.529014177503788
479;514.838;17.8949338082053;8235.636;286.993407527054;6.197;0.423132366996434
480;516.101;21.7108901015127;8260.218;348.540064950902;6.13;0.541553321474438
481;515.149;21.5392416068917;8236.682;345.752992692798;6.078;0.471927960604157
482;523.486;16.3047006718893;8379.074;261.258053548608;6.287;0.563685195831856
483;526.788;13.5750534437298;8426.81;218.630688833848;6.089;0.44985442089635
484;523.536;15.3461025671028;8375.761;245.933971075584;6.184;0.639612382619354
485;527.049;10.6981815744564;8434.31;170.483603844976;5.992;0.446873583913852
486;522.958;12.9533731514282;8368.334;201.525102416598;6.11;0.444409720865777
487;524.998;10.5816820969031;8399.754;166.608789515922;6.042;0.228070164642363
488;521.481;15.401258033032;8345.595;252.010174368022;6.22;0.565915187991986
489;526.833;9.53323769765535;8431.133;151.772191922744;5.942;0.490057139525592
490;506.295;32.406547563726;8099.336;526.127432951365;6.352;0.515010679500922
491;527.438;17.9899176207128;8438.308;286.847440943757;6.262;0.784153046286234
492;527.851;7.97799780646932;8445.625;128.95630362648;5.971;0.275189025943978
493;512.777;25.5709014506711;8200.228;411.178675755474;6.296;0.564042551586318
494;498.525;59.7586325563095;7975.103;955.188660381276;7.032;2.46103149106224
495;506.245;62.7144725322629;8101.406;1005.9875604718;6.876;2.75439358117173
496;513.845;12.3301251007468;8223.518;196.387259708951;6.454;0.355814558443009
497;518.192;28.9244736512179;8293.059;459.090105588237;6.164;0.844667982108944
498;505.467;29.0380626247695;8087.763;466.679419217304;6.524;0.647428760559791
499;509.607;29.8010053689476;8152.539;481.351164545178;6.528;0.717409227707591
500;522.35;10.7937417052654;8359.504;174.4579722569;6.275;0.408931534611849
501;511.973;26.7288589543192;8191.982;429.458140586489;6.265;0.414855396493769
502;507.113;33.9400990128204;8115.003;546.355134359514;6.491;0.883260437243731
503;519.457;30.4331612061588;8306.906;483.455368119993;6.096;0.767778613924612
504;502.541;32.0580649603184;8041.745;512.445954423475;6.159;0.503774751252983
505;482.575;46.6994835624552;7722.304;748.78462376306;6.857;0.868309276698123
506;486.365;35.0466107491156;7778.433;552.974683942226;6.593;0.64779703611549
507;503.226;32.8532464758056;8052.782;525.481149267974;6.219;0.405325794886018
508;488.333;57.637863258452;7816.238;925.259054079452;7.073;2.44279778123365
509;465.675;105.446704761221;7448.215;1684.42021053686;9.902;9.68492519330944
510;507.231;31.524218451851;8118.396;502.339173332133;6.355;0.711705697602605
511;501.973;44.6676061704683;8026.773;715.085314309431;6.763;2.04384466141632
512;513.295;26.0494273449541;8216.716;422.249084266611;6.231;0.560008035656638
513;514.538;29.7233288176115;8227.616;475.9411249766;6.187;0.694738080142443
514;524.187;14.5087105216097;8391.515;229.117492839374;5.842;0.444967414537285
515;513.953;18.9416752427041;8222.643;306.028823350037;6.28;0.624995999987204
516;518.731;14.3449638898104;8298.695;227.08763767538;6.219;0.421199477682492
517;521.998;9.66748240237096;8354.667;152.730342175397;6.087;0.415645281460029
518;508.399;18.8165604986683;8134.586;301.126070548524;6.534;0.489350590068115
519;527.606;11.175155658871;8438.881;179.24424495355;6.027;0.328269706186832
520;494.757;44.4066209140028;7916.509;715.1391847249;6.648;0.629774562839747
521;503.822;41.6276501378584;8065.061;663.972557858382;6.184;0.657087513197433
522;506.995;42.0786507031765;8106.016;667.402319657364;6.422;0.898062358636642
523;505.288;34.5755135319781;8084.501;554.913455692869;6.515;0.783099610522181
524;521.405;7.84898496622485;8345.964;122.76197026765;6.089;0.227835466949277
525;531.728;12.7569579445855;8506.671;198.933288237622;5.933;0.33988380367414
526;518.749;14.885573855246;8299.093;238.888188408361;6.347;0.874540450751139
527;520.628;12.7062156443205;8330.568;201.717701295628;6.271;0.648296999838812
528;513.006;15.103623538741;8211.309;239.169004532424;6.326;0.280364049050488
529;490.947;76.8110027339835;7851.427;1229.714926152;10.262;11.3137118577415
530;506.868;28.2495330226881;8109.005;455.256428713534;6.327;0.644888362431829
531;517.052;9.83701153806729;8273.119;158.234937889796;6.286;0.422449997041076
532;522.165;14.4722736638031;8356.233;230.448388410473;6.192;0.511171204196788
533;521.509;15.5647052333147;8339.535;246.363412472309;6.372;0.749170207629748
534;524.721;14.6682394649173;8397.933;239.220940766061;6.061;0.518410069346658
535;512.144;35.6029120157332;8197.1;571.185003076926;6.209;0.813344330526738
536;516.79;27.9685684295783;8265.44;448.692426702327;6.308;1.01455211793185
537;529.83;13.5233923258944;8478.292;215.656000510066;6.077;0.451221675011287
538;524.143;12.1807307252074;8389.756;194.935066122069;6.191;0.480176009396557
539;517.891;19.5433095713118;8283.26;308.8056327854;2.62;2.38551881149573
540;198.097;15.821326145428;3156.422;256.965889635186;7.893;0.763689072856216
541;191.798;14.4233697865652;3075.159;228.423929107707;8.333;3.09857079957841
542;197.807;9.09414102595765;3160.618;148.903173626364;9.917;3.59605631212861
543;185.273;13.4602875526489;2966.682;209.500115885414;16.93;26.3334448942785
544;187.829;12.4486203653253;3005.729;198.247981803091;38.386;88.4787509179464
545;195.001;12.3169813266079;3122.925;201.920737927034;9.117;2.70885234001412
546;189.593;11.4697472073275;3029.183;182.452394999353;7.998;3.40647266244718
547;197.206;13.2968456409785;3158.807;209.004825114164;9.317;4.7889916475183
548;195.092;15.4273917432601;3119.165;246.535414991435;8.617;3.8782729403692
549;195.106;11.9465193257285;3124.407;186.874410556937;9.572;2.66172049622045
550;196.392;12.1992178437799;3138.854;189.614433427415;7.967;1.51093381721372
551;196.206;9.22270155648551;3135.795;150.547206566584;8.752;1.85389212199631
552;186.591;9.64139248241688;2991.954;150.132136812869;8.189;2.6293286215306
553;188.406;13.0895708103817;3009.593;202.46964355428;8.815;2.41226553264768
554;196.198;10.1699368729601;3141.666;165.907586396752;8.274;2.08428500930176
555;196.204;11.8622562777914;3135.194;193.724689350628;8.751;2.11585656413661
556;190.401;20.3322755489886;3045.195;321.430920455709;10.039;4.74193726234331
557;190.056;12.7031407140122;3047.799;204.051422462568;8.371;2.00628736725325
558;193.116;12.1356525988509;3083.391;197.525653445328;10.943;5.13347065833633
559;194.516;12.231017292114;3111.066;194.192138007693;13.247;6.96035494784569
560;199.008;18.7480760612927;3190.045;303.725646373499;10.644;6.09488506864568
561;195.299;12.725669687682;3120.57;205.324941836108;11.735;5.60027008277279
562;195.896;11.2754274420084;3136.17;181.517147509546;8.33;2.38442026497008
563;191.18;10.5948553553127;3057.885;171.135941359503;8.313;2.13583262452843
564;193.596;11.8878502682363;3104.728;193.234223925262;8.921;2.53436560109231
565;195.724;13.3305770317723;3125.606;211.57659049148;7.444;1.47032105337576
566;194.501;18.1953595457742;3113.313;284.035854815902;10.235;3.92358063508321
567;199.097;13.6506725475342;3185.746;223.228211353314;8.802;3.11197300759502
568;196.399;14.3729401654639;3146.07;225.624648032969;10.255;3.16070957223216
569;199.398;7.75588782796695;3185.196;127.346064894032;8.638;3.17743859106671
570;185.102;14.1102082195836;2961.624;227.56855447094;20.699;36.5436827509215
571;202.004;15.3892320796068;3229.055;240.910175387013;10.615;6.94142528591931
572;199.202;18.4361936418556;3189.626;296.735919706391;9.456;2.14684512715751
573;194.691;13.634398739952;3113.854;218.393388553772;10.411;4.70061793810133
574;192.57;13.2155226911386;3084.412;219.082022119578;9.222;2.16142915683119
575;190.207;14.46904492356;3045.577;233.397981270197;11.598;4.25984459810449
576;194.202;17.7976789497957;3104.228;288.750590918876;30.58;61.7316674001278
577;202.468;9.59810689667479;3240.898;152.854677246072;11.776;5.28690306323087
578;198.012;14.0699188341655;3169.89;231.467143067861;14.871;8.98230978089711
579;192.159;12.3408180036821;3076.819;194.238167642202;10.341;4.34794767677809
580;196.071;10.9686347828709;3129.246;175.389409611867;14.461;7.04727670806248
581;198.803;13.1403668518043;3182.434;208.083008542267;15.703;9.22204971793147
582;188.897;9.59237097906452;3027.559;152.79286007205;11.029;5.48884587140138
583;198.598;13.7866782076032;3172.593;219.596140724283;11.645;4.8237646086848
584;197.906;13.5027169117924;3167.96;213.98646134744;10.639;5.21100460563988
585;201.492;15.741227906361;3225.073;246.63554719667;9.729;3.38108104014087
586;186.809;9.85270566900289;2985.947;160.762030781523;9.886;2.54325460778114
587;202.197;13.9848225230068;3233.85;224.271071652142;8.844;1.98919682284082
588;199.401;15.600040032;3192.734;249.884260496741;8.026;1.20347995413302
589;194.698;15.2309197358529;3118.361;248.708963467345;8.362;1.95557561858395
590;195.508;14.3358521197727;3125.929;226.710826933782;8.614;1.97095002473426
591;193.293;19.2200806710066;3089.793;305.511344013604;9.097;3.44722801682743
592;192.7;11.6647408886785;3082.951;189.464665436595;10.094;5.17123428206458
593;198.102;12.6032414878076;3176.223;201.024296941935;9.265;2.63484819297052
594;199.696;12.5701966571729;3193.723;190.323859778549;10.438;4.70107179268728
595;195.207;13.1387731923494;3122.132;213.136950799243;11.036;6.14284657141947
596;194.8;12.6479263122461;3115.586;201.797851039108;9.851;3.41640878701598
597;195.681;13.7826306995436;3128.102;228.714680586973;13.092;10.0164971921326
598;190.127;13.4056160246366;3044.523;214.792923396002;8.67;2.19176184837678
599;199.983;14.6729922306256;3203.205;237.968788720293;8.436;2.02884302004861
600;192.81;12.432642518789;3084.256;201.507855439932;9.137;2.68030987014562
601;195.702;18.7359338171334;3135.023;299.080896248822;9.268;1.76796380053438
602;198.496;10.5800795838217;3164.017;169.359201583488;9.669;2.90259005028268
603;194.303;14.2281510042595;3111.037;229.570785730676;8.496;1.66216846318296
604;190.802;11.57483719108;3055.935;182.341868710957;7.292;1.02545404577681
605;189.294;11.8251327265277;3032.216;191.007531432656;7.609;1.74544235080968
606;192.89;14.0517507805971;3085.52;217.621433641086;8.334;2.26478784878408
607;187.399;15.0269134888039;2994.391;239.280938499081;7.362;0.603900654081455
608;201.906;13.5151708831222;3228.416;223.874058220246;10.031;2.65391578615448
609;190.397;12.2859871805244;3051.454;193.370859655742;9.767;6.11117181889038
610;199.018;13.9087790981095;3180.503;218.636701358661;7.35;0.631696129480001
611;193.772;12.0788060668265;3099.157;184.995056477193;8.797;1.75340839509795
612;191.418;6.06137575142719;3064.166;100.372968392886;8.158;1.69258264200009
613;186.903;6.3014840315598;2996.526;102.965060986715;8.927;2.35065118637368
614;182.97;13.0636266021347;2921.834;207.41550555346;38.546;90.1057147133299
615;194.526;17.5696153628926;3113.918;279.052839935383;9.068;2.38415519629071
616;197.406;14.0925357547886;3155.784;227.07661166224;10.685;7.16238263429147
617;203.558;14.4114966606525;3255.632;230.506679373933;8.679;3.55537466380127
618;194.305;14.8775490252928;3113.269;235.191457984775;8.495;1.51672838702254
619;198.24;11.1010774251874;3169.536;179.387330778949;8.651;1.56601692200308
620;195.205;15.4653194276745;3122.28;248.142513729509;10.852;9.21879037618277
621;184.401;13.6390332868569;2949.913;215.753690260452;9.804;4.00625061622461
622;188.286;16.2598525208564;3012.289;263.775409105928;8.146;1.443178436646
623;197.913;12.9433821314214;3169.183;207.136565485185;10.637;3.71580960222668
624;188.203;14.9764114860668;3013.113;241.219020893874;8.505;3.01796040398147
625;188.2;9.1991336548617;3009.408;145.935592080884;8.902;2.56772584206336
626;191.769;11.4319083708714;3072.001;181.002283877866;9.405;2.71337151897782
627;193.929;11.601182224239;3101.084;189.347947556864;8.987;2.83315742591194
628;191.599;8.76522954633873;3061.796;148.608407649107;10.691;4.42632680673265
629;201.134;11.4232151341035;3216.758;182.463880469529;8.247;1.76461922238198
630;181.65;30.2147788342063;2912.21;481.540193441834;31.361;69.5802923894403
631;190.796;13.7300729786845;3051.666;216.700429542721;50.554;125.51551347941
632;190.494;15.2784450779524;3046.803;246.972556939028;8.757;1.71485888632272
633;205.204;11.5949533849862;3287.265;184.680040245281;8.383;1.96923868538072
634;199.807;8.02378719807578;3191.416;124.785311972194;8.913;2.49449814592034
635;193.399;11.9820252461761;3096.787;197.753238408367;9.113;3.52582770424194
636;190.702;12.180856127547;3049.733;189.532419709663;8.442;1.5181883941066
637;193.291;10.4955166142502;3098.094;173.056901867567;10.051;4.40217321331181
638;197.09;8.36636599725336;3148.746;138.013952352655;9.885;5.30647010733123
639;195.937;8.04179339451153;3136.559;125.086646485558;10.229;3.24574013131058
640;190.48;18.3650891639547;3044.869;294.370645392848;7.646;0.800789610322207
641;186.398;9.47627226286797;2983.96;155.397423466408;9.054;3.20077240677934
642;192.602;10.162267266708;3083.834;162.309725660547;9.403;2.65172415609165
643;190.6;10.1878368655962;3049.713;155.927802783859;9.363;2.45160783976557
644;198.094;9.30706312431649;3165.612;145.360432566773;10.421;2.87606484627868
645;201.363;11.8259900642609;3220.222;194.553889542198;10.906;3.76289569347862
646;192.723;7.63826426618027;3086.753;120.509631735403;10.696;6.64147604076082
647;189.411;8.53495571166056;3031.377;135.853264300112;7.529;1.04583411686557
648;203.294;8.48552320131087;3250.616;134.417854558081;9.602;4.70909927693184
649;200.405;10.6430514891172;3207.882;172.106353502709;9.46;3.36590552452085
650;199.18;13.0707865103825;3191.08;211.204304122805;9.642;2.61057388326781
651;201.521;10.5588801016015;3218.961;168.493883595216;11.444;5.19877908743967
652;197.093;11.6417516293722;3154.472;183.562477309508;10.402;4.09469363933371
653;189.007;18.0690586639149;3022.58;289.145259757093;9.255;2.53352027819001
654;195.009;14.970108516641;3122.854;229.891171218038;10.906;3.92887057562348
655;187.99;7.6963692738855;3005.337;121.988130000417;12.953;5.11838070096393
656;193.708;13.8977306061099;3099.73;223.172662573173;12.008;6.23264117369194
657;197.599;12.0443866178402;3164.785;189.482171892236;10.932;2.69106967579808
658;198.892;18.4990560840277;3179.19;296.139950496385;9.348;2.98431834762983
659;192.206;10.5108736078402;3076.08;167.440856423989;7.791;1.16479569023928
660;202.295;13.6844599820383;3240.794;220.690711594299;9.845;2.92497264944478
661;197.802;14.2103066821234;3161.524;224.142588554687;9.397;2.09035906006599
662;197.829;13.7118900593609;3160.055;220.30629501901;9.905;3.50827379205214
663;194.188;15.5998998714742;3116.014;250.857246584589;9.715;4.01826143997625
664;193.808;9.81860662212294;3104.326;162.652309617782;9.567;3.48391747893086
665;185.686;14.0948616169158;2962.095;226.556710880524;10.337;5.35138682959848
666;188.771;10.5990739689838;3018.637;174.348280177918;8.282;1.86351173862683
667;205.241;14.5609480803966;3284.241;227.945987393934;9.788;2.26458737963453
668;188.397;10.4387011165184;3017.05;168.151380547414;8.104;1.90120593308562
669;196.986;18.9814146996477;3149.38;308.88585079281;11.501;5.01132607200929
670;195.716;11.1816655288916;3134.175;181.209398500735;8.814;1.94135622697124
671;194.495;17.9791408304179;3107.812;284.012796359599;9.974;2.96999393938776
672;202.407;14.0201719318989;3241.917;224.204952980527;11.378;5.3580608432529
673;194.899;12.8071795880279;3116.581;199.06071307267;11.649;6.4129594572241
674;198.2;9.8921221181304;3174.01;166.272642367892;11.634;7.11490857284898
675;192.44;13.5851249534187;3076.637;222.135636359854;8.148;2.25432828132905
676;192.455;13.5355962188596;3081.207;217.184785611241;8.209;2.06873608756651
677;199.199;20.3694980055964;3187.811;322.363219845254;10.394;3.70050050668825
678;201.999;8.16284441846103;3229.779;132.168685281355;8.946;2.70703971156686
679;195.653;13.3602627593923;3133.634;216.924790385974;10.999;7.92873817199181
680;203.757;10.4991142959774;3254.692;165.825923051852;8.92;2.37411035969265
681;188.564;18.0761484835681;3019.625;287.393655471029;10.464;5.15831212704311
682;192.421;9.47114084997169;3080.423;148.835394651274;12.714;7.05922828643471
683;195.98;15.3085479389782;3140.494;248.909667036053;12.698;13.2089301610691
684;186.98;14.6051189656231;2984.101;234.70358367311;10.068;4.86658360659714
685;190.738;15.593246486861;3052.894;252.265732520292;9.804;3.28009207187847
686;200.236;17.4861506341446;3203.349;279.464744876698;7.767;1.82509205247298
687;189.741;11.0274035475267;3040.987;178.710267642908;8.873;2.39584661445594
688;198.423;11.9208624268548;3170.076;193.164657440224;10.075;4.20071482012288
689;194.693;9.54800612693606;3115.49;155.055996014349;8.124;2.08880444273751
690;202.209;8.68545272279988;3237.356;134.035740770891;10.162;2.68148391753521
691;198.001;14.7090458222141;3167.018;225.459395803323;9.578;1.51762841301816
692;197.584;12.6709235653913;3158.255;197.204700311633;12.328;6.37372387227435
693;197.813;19.9676774062482;3166.305;317.37633330952;10.038;4.0392222023553
694;188.903;11.6214724110159;3024.524;180.507471103001;8.416;2.10377850545156
695;192.473;8.64951565117931;3081.679;140.468470017298;9.603;3.22249918541495
696;188.72;14.0373174075389;3014.229;227.199567845095;8.951;2.14833633307263
697;192.349;10.6112887530219;3081.782;168.511886037742;10.206;2.74744317502656
698;187.249;20.3217432569158;2994.966;335.430611220857;45.171;96.2571873108705
699;188.682;13.6886623159458;3017.72;218.932468948758;12.146;6.20217252259238
700;193.714;12.4057125551093;3097.913;197.260131757531;8.977;2.1061056478724
701;199.795;16.9875862028716;3199.815;269.594511303548;21.684;32.6830840650022
702;194.496;16.0521819077657;3110.541;258.293903700807;18.536;22.8495519430907
703;200.688;16.0002004987439;3206.831;253.524288006105;11.083;5.29511482406189
704;195.744;18.1676994691127;3135.98;289.629376272501;8.619;2.41263942602288
705;192.003;15.8894959328482;3071.029;257.02142558355;10.026;4.52281372598961
706;196.063;6.82112021591812;3134.927;107.638493676746;10.237;4.37309512816724
707;194.024;22.148802766741;3105.772;352.246396711167;34.584;65.0022796831004
708;202.511;11.1031702229582;3240.971;181.121228156721;7.944;1.65964574533242
709;184.19;8.74211301688556;2948.93;139.901624150691;8.292;1.91683489116826
710;194.707;10.5413680800928;3109.786;167.083156853118;10.318;3.03115423560069
711;192.706;9.83950425580498;3087.208;157.510886341234;9.339;2.7611716715916
712;200.892;14.2368801357599;3217.478;225.389916047724;8.705;1.33562157814256
713;195.905;15.337906799821;3132.487;248.266635174764;8.914;2.45649424994238
714;187.596;13.3057470290095;3002.471;210.683436579622;8.705;2.88484748297029
715;191.904;13.9717158574028;3065.614;222.142656155907;8.861;1.90648603456726
716;196.299;8.37261422734856;3147.462;127.065341757679;10.591;6.44903628459322
717;189.299;12.5775494036001;3024.583;202.945785768019;8.29;2.13254777203232
718;197.485;14.4593210421512;3159.559;231.130570130824;8.473;1.85246349491697
719;198.321;19.3479701519309;3175.515;308.934558838925;0.922;2.766
720;503.262;34.9534670097277;8066.833;552.013250838226;6.021;0.675817282998891
721;512.013;37.5942362736635;8192.483;605.138616402056;6.082;0.618139142912018
722;527.397;38.1164618111391;8434.774;607.115547786398;6.027;0.803156896253776
723;536.293;33.2561868078714;8578.085;533.488546910794;5.83;0.526326894619684
724;543.465;44.6582492379636;8695.55;715.71623392236;5.86;0.794606821012757
725;542.239;41.6238802732291;8676.538;664.1440842137;5.957;0.846144786664797
726;548.813;37.0859871245188;8779.8;594.406801895811;5.636;0.656493716649288
727;542.679;47.1361395216039;8682.649;752.069615094912;5.737;0.810383242669786
728;544.415;44.3953950877796;8713.644;708.932653546141;5.668;0.781278439482357
729;534.709;44.2470743552606;8553.743;709.580908593942;5.958;0.729024005091738
730;536.876;52.1857076602402;8589.615;827.672925100843;5.602;0.682785471433001
731;546.27;46.4094998895702;8738.302;744.189530359017;5.669;0.758978919338342
732;542.979;41.1798568355925;8692.453;658.102059076706;5.659;0.587238452419449
733;543.073;41.7082824028984;8688.775;670.551016750409;5.691;0.673727689797594
734;536.692;48.1548555807196;8581.691;767.427622977556;5.716;0.80664986208391
735;531.899;42.4622087155154;8511.698;681.779126488927;5.702;0.498092360913118
736;527.098;48.7020247628371;8436.556;778.648961871781;5.758;0.637789934069205
737;530.58;42.5074732253053;8489.8;679.713381742643;5.823;0.711857429546107
738;538.639;46.4034400556697;8617.221;741.499839264292;5.852;0.917418116237084
739;535.315;33.4579118445863;8565.168;535.751921112749;5.844;0.587744842597528
740;538.424;36.8224554314356;8612.177;590.396461236859;5.66;0.572188780036796
741;528.136;35.7629828733553;8453.493;573.222278179231;5.808;0.399869978868145
742;544.42;39.3129744486466;8710.214;626.032007395778;5.754;0.509670481782099
743;535.197;38.4055436232858;8563.024;618.090376339897;5.855;0.673427798654015
744;536.871;41.6325875847279;8583.15;661.850553055618;5.751;0.589736381784267
745;536.807;39.3532501961391;8594.819;625.754789457488;5.815;0.476870003250366
746;543.737;49.5373677237711;8697.974;793.74697752119;5.706;0.734427668324121
747;543.573;50.2185999506161;8696.58;802.649707331919;5.807;0.614443650793133
748;541.706;42.8696783752823;8666.308;685.181866350808;6.052;1.30081359156491
749;529.01;70.7889136800395;8465.357;1131.07586771224;6.241;1.66631599644245
750;555.843;39.9952594815936;8895.784;639.361495199694;5.822;0.99022017753629
751;546.553;54.2796696839623;8746.768;868.590425814152;6.137;1.54785044497199
752;542.286;36.9517004209547;8674.489;588.54344430042;5.843;0.698642254662561
753;545.598;37.6357675091133;8729.654;602.714001499869;5.718;0.775484364768232
754;552.516;39.4193316026545;8843.555;629.001257093359;5.5;0.59246940849296
755;548.379;33.9402051997339;8768.649;545.520032344331;5.757;0.811443775008466
756;538.565;49.719779615361;8617.145;795.808775400869;6.028;0.965368323491084
757;548.896;35.0255413091648;8785.951;562.877912560989;5.894;0.639878113393481
758;545.627;33.4277277271434;8729.437;532.230362738693;5.645;0.634007097752063
759;551.088;34.0155801949646;8816.109;542.465885571608;5.671;0.487513076747673
760;541.814;37.151606748565;8668.304;594.976349180372;5.593;0.505253401769848
761;543.955;33.5427378876557;8704.751;538.634106058084;5.665;0.650603565929355
762;552.164;28.6772478456349;8836.543;461.02045067542;5.547;0.449089078023504
763;549.603;41.1831832305365;8793.954;656.65345228969;5.659;0.581437012925732
764;536.499;41.8917069239239;8583.775;672.14601381319;5.758;0.653525821984104
765;538.89;42.4251677663146;8618.73;680.822138271087;5.815;0.719447704840329
766;548.195;39.0621930387946;8773.529;626.202749697728;5.563;0.709408908881188
767;540.509;50.5761351726279;8648.427;807.359832206806;5.933;0.801249648985874
768;536.525;49.6274648254376;8581.106;794.399809229558;6.052;1.36154177313809
769;529.977;46.9646088134446;8478.526;746.862939075176;6.262;1.207433642069
770;552.544;45.9321095095801;8841.3;737.871488756702;5.648;0.675467245689987
771;555.347;29.8982441123197;8887.544;478.47665485791;6.04;1.25440025510202
772;565.371;21.0547417224704;9049.734;334.476200683993;5.643;0.622399389459856
773;561.701;25.5936923674552;8983.246;407.393669887005;5.635;0.539597071897173
774;564.535;33.957950836292;9033.55;545.477569511332;5.427;0.544574145548605
775;533.958;60.2013080921008;8544.011;958.713664254862;5.668;0.745034227401672
776;540.545;50.3187846137006;8648.601;804.52060820654;5.837;0.874220223971057
777;539.087;40.4966428361651;8626.603;649.484305631025;5.915;0.724931031202276
778;541.246;49.252350847447;8656.036;785.607009467187;5.744;0.712856226738604
779;535.976;40.7256912034651;8576.009;652.976329149074;5.652;0.491564848214353
780;528.549;46.5156181190799;8455.89;747.209824025342;5.806;0.597046061874622
781;528.465;62.708777575393;8459.939;1007.43396250523;6.036;1.12827478922468
782;556.437;25.8492092915795;8900.992;412.146251245824;5.65;0.605722708836316
783;561.759;27.1084224734676;8986.343;434.751574098374;5.493;0.513576673925126
784;517.665;109.194021379378;8283.06;1745.50934189994;9.985;12.5101544754651
785;547.926;36.8562152696139;8763.224;586.019164826537;5.914;0.763494597230397
786;555.558;37.0336913634057;8891.344;593.007113400831;5.795;0.803744362344149
787;544.584;36.5711403158261;8716.046;589.594123820816;5.977;0.746056968334189
788;544.356;51.4763715115984;8705.896;824.269694459299;5.744;0.868702480714772
789;545.9;29.8020979127337;8740.796;477.888468122004;5.565;0.42062453566095
790;550.866;48.1697853846163;8810.657;770.673058359379;5.688;1.18519871751534
791;553.446;43.6658477989382;8858.149;700.583970476776;5.56;0.755340982603227
792;538.523;45.1570306929062;8610.563;723.226718146559;5.908;0.847641433626268
793;554.738;49.2274421029581;8879.103;788.15166487232;5.344;0.637498235291671
794;548.605;42.359691276024;8776.503;676.820557682034;5.676;0.806451486451601
795;559.428;30.6394144199912;8953.055;493.653196611749;5.797;0.87923887539166
796;566.261;23.8076430794842;9056.993;379.533643437621;5.511;0.868705358565256
797;553.107;36.8109714759054;8850.601;588.238889286475;5.753;0.607273414534183
798;552.933;28.6433831975184;8849.84;458.039621714098;5.71;0.585559561445278
799;551.917;43.0999394547139;8828.888;694.264374036276;5.601;0.683395200451396
800;544.764;40.0906603088541;8713.133;640.218338975885;5.793;0.799287807989095
801;546.118;46.3676669242686;8741.401;743.700926077808;6.036;1.17786416873934
802;551.312;32.8861985641402;8819.272;529.717354648681;5.669;0.59031262903652
803;542.796;44.7774544162565;8686.842;716.316665697504;5.791;0.833264063787707
804;547.699;39.0388295034571;8764.304;621.315801106025;5.843;0.956379108931186
805;545.798;47.7757350126605;8726.284;766.581707011044;5.79;0.941605012730915
806;550.657;40.3374751440901;8813.204;645.473406519573;5.679;0.844422287721018
807;548.476;46.3200073834204;8774.511;736.616486557925;5.879;1.03534969937697
808;562.031;37.7826577810513;8995.299;603.877761793728;5.556;0.911089457737276
809;563.927;36.0440292004113;9022.054;581.747626934562;5.602;0.812598301745708
810;562.551;32.1231017960588;9003.822;513.290108901366;5.457;0.533892311238886
811;553.583;42.6935604160621;8855.452;678.324022290218;5.612;0.859730190234117
812;539.857;38.3400863457541;8635.515;617.005800997862;5.718;0.741684569072313
813;535.503;42.5632172303746;8568.867;680.195340664013;5.804;0.766187966493866
814;549.001;39.6307825938377;8784.839;632.848427404984;5.684;0.893523362873061
815;554.285;38.9360997661536;8872.657;624.259584724974;5.835;1.26488141736686
816;566.249;29.0921485799856;9055.57;461.429442255229;5.587;0.897374503760837
817;554.262;26.622212455016;8869.787;428.316561997062;5.735;0.818306177417721
818;532.777;52.4055966572272;8523.018;840.111272722843;5.929;0.973041109100742
819;539.43;40.301303700996;8629.99;641.816414233851;5.803;0.959479546420866
820;531.685;41.8336040163895;8509.874;672.373877797163;6.016;0.878808283984623
821;531.418;37.2647368969648;8501.59;596.836390277941;5.918;0.798283157783002
822;544.572;33.1871215383333;8713.974;534.760495365903;5.829;0.820371257419469
823;552.003;25.6869819363809;8828.849;408.895425957572;5.594;0.551818810842842
824;547.625;33.5655493773004;8763.291;536.038433182718;5.688;0.676044377241609
825;539.841;33.5275705800444;8634.824;535.566545915632;5.861;0.657714983864602
826;522.145;47.5357718460522;8356.199;760.67698501336;6.195;1.03753795111312
827;521.872;33.2296373136975;8352.655;532.886180403453;6.235;0.612180528929168
828;536.734;38.1341152250832;8587.852;608.001960552752;6.135;0.799653049765965
829;541.929;40.7758880835249;8669.457;654.430035115306;5.99;0.821815064354504
830;544.682;26.466824819006;8715.024;417.477257061996;6.049;0.89908230991384
831;542.395;37.6339297044573;8673.926;598.642470414532;6.205;0.975143579171802
832;538.811;38.7817850156482;8625.96;627.136018452148;6.136;0.813746889394979
833;536.594;50.8558231080766;8585.297;812.679586762821;6.367;1.3300003759398
834;537.749;54.2464639308403;8603.292;867.001794159644;6.393;1.72716559715622
835;542.852;38.4824959689459;8688.636;618.538362871692;6.026;0.887132459106299
836;543.48;38.5411346485809;8693.883;618.179906904942;6.046;1.12253463198247
837;548.139;30.3888685047678;8772.624;484.864967350697;5.911;0.612330792954267
838;563.365;27.8396599296775;9009.438;441.388256001434;5.561;0.604159747086803
839;556.926;30.1912398552951;8913.142;483.279544483321;5.689;0.660097720038493
840;558.075;16.5644500361441;8926.377;265.925090356223;5.634;0.52987168257985
841;559.607;19.1154189334116;8953.916;303.41428263021;5.678;0.659845436447055
842;563.795;21.7678300480324;9017.805;345.827611715754;5.688;0.755431002805682
843;559.545;20.0336687853194;8953.318;324.518667253508;5.723;0.702610133715696
844;569.247;21.1049364130746;9114.648;338.433560977699;5.541;0.771497893710675
845;560;21.5214753211762;8956.414;342.504301321863;5.824;0.762826323615016
846;551.308;35.0871440274092;8817.956;561.33600381947;5.753;0.792061235006486
847;546.811;24.2432936912461;8749.061;388.103910350104;5.806;0.493704364979683
848;546.388;31.4035710708177;8737.393;504.994915104102;5.964;0.706982319439454
849;538.365;32.8018314275288;8622.623;531.060263116166;6.078;0.560014285532052
850;538.442;41.1808739101056;8616.765;652.901994027447;6.191;0.872656289726948
851;541.692;39.3926972420014;8662.854;636.323590073487;6.108;0.85193661736071
852;542.822;40.445584381984;8684.836;645.788023397776;5.87;0.736831052548694
853;529.979;41.9074130554493;8480.266;669.610431149344;5.856;0.697283299670945
854;509.113;55.4287062901527;8147.12;885.82977379404;6.662;1.92110280828486
855;519.803;50.7681008212819;8316.348;811.218484439306;6.488;1.44550890692518
856;531.991;46.420509572817;8509.336;744.469544188356;6.12;0.883979637774534
857;531.391;40.7467305314181;8506.257;657.684365498385;6.055;0.773979973901132
858;527.283;61.8281788588346;8435.918;983.007654830834;6.075;0.988789664185466
859;535.621;44.2972234908692;8569.452;710.3453863551;6.154;0.962020789796148
860;550.71;31.4282719855876;8808.983;503.177135968052;5.744;0.622626693934651
861;543.211;45.4740054206792;8695.484;728.909599363323;5.743;0.691506326796803
862;537.738;39.0926657571454;8603.839;628.175915877869;5.891;0.749218926616247
863;552.365;31.7015634472492;8834.811;505.021669207391;5.616;0.552959311342167
864;538.563;53.9774321452968;8618.918;862.811814531978;5.798;0.801870313704153
865;538.254;28.7634278902886;8611.772;461.647134244308;5.899;0.718100967831133
866;537.773;32.8576475268715;8605.364;521.86295975473;6.053;0.643864116099046
867;550.714;30.8265590684402;8811.516;495.526692584778;5.755;0.627299768850579
868;537.39;51.6976268314125;8596.15;828.417339557776;6.265;1.58854807922203
869;510.289;87.5364509732946;8166.133;1399.82347372837;6.74;2.67643793128105
870;542.2;41.9385383627035;8674.282;667.917857012359;5.946;0.904402565232985
871;537.614;51.7422102736244;8604.132;833.153029302543;6.109;1.3710175053587
872;548.196;45.6544195451;8772.717;728.29789421705;5.53;0.689376529916711
873;543.792;45.9870809684629;8695.394;738.162180434615;5.568;0.6723659717743
874;522.199;62.4614995737379;8358.993;997.729037665531;5.896;0.911989035021812
875;543.555;42.2030314669461;8694.988;677.647908574958;5.7;0.572241207883524
876;544.605;37.4741135318741;8715.174;603.740976316854;5.622;0.499095181303102
877;532.245;49.2113101329343;8513.417;784.780359553562;5.854;0.851835664902562
878;549.562;39.1931156709965;8794.267;624.262719150352;5.519;0.684477172738429
879;557.24;35.8406983748924;8918.902;575.950318999844;5.493;0.706739697484158
880;560.201;40.0260923523642;8962.3;634.142328661331;5.384;0.578985319330286
881;524.703;71.5303727167692;8390.84;1150.30117143294;6.212;1.40869301126966
882;555.238;33.5054884459251;8883.694;533.277190196628;5.472;0.480828451737204
883;539.134;43.0503238547616;8627.226;689.155504225286;5.861;0.661429512495484
884;554.119;41.8274728976065;8867.505;672.520194451438;5.649;0.698504831765681
885;559.563;29.5459252859021;8950.719;473.29428856577;5.41;0.43762998069146
886;538.577;69.5576470346724;8620.026;1112.7056799909;5.904;1.47587397835995
887;556.662;34.3478729472424;8905.993;546.881150837205;5.67;0.778562778457847
888;550.787;31.8418777869658;8813.4;508.723880410592;5.737;0.742967697817339
889;563.413;24.4363180737225;9012.411;392.073051623086;5.491;0.610318769169017
890;561.88;36.6642965294593;8989.876;584.274206297005;5.679;0.845641176859305
891;566.922;23.7025322697804;9074.165;377.245430012059;5.455;0.635314882558243
892;573.789;16.1175993559821;9177.447;264.167589989725;5.354;0.480129149292149
893;555.374;24.7831023885219;8884.966;392.244893687598;5.776;0.613534025136347
894;536.832;42.9904312143996;8591.429;689.317872921478;6.01;0.900111104253248
895;539.592;40.7303193702182;8636.666;650.853404818622;5.759;0.542852650357342
896;537.11;40.4838108384097;8587.665;649.009513031213;5.887;0.677806019448047
897;535.767;39.3796985895029;8574.85;632.448001641236;5.96;0.575847201955526
898;513.916;46.4237359978711;8224.565;742.32547421265;6.202;0.730503935649906
899;526.283;38.2065664644181;8423.205;610.94668687623;3.548;2.72892213153838
900;487.962;27.8052425991917;7799.875;442.902321494245;7.093;0.47442702283911
901;548.505;49.1772026959645;8780.594;785.89616673198;5.227;0.522533252530404
902;554.381;48.2972169902164;8868.606;775.016470098541;5.096;0.497939755392156
903;549.216;38.9015902502716;8784.055;621.085158657837;5.255;0.409102676598431
904;547.2;36.6861570623026;8760.589;592.624554628797;5.446;0.405516954022891
905;501.934;42.1815550211229;8031.75;679.207909450423;6.586;1.05416507246256
906;578.353;44.6676946013559;9250.121;714.097815603014;4.98;0.585986347963838
907;596.808;40.1697074423;9546.822;641.159667006586;4.7;0.362104957160212
908;600.399;45.7293654996441;9609.498;731.662159426043;4.731;0.428402847796328
909;611.881;41.3465448254158;9789.917;660.905176073701;4.623;0.454137644332639
910;611.6;54.0537345610825;9784.989;863.702880526054;4.554;0.387019379359733
911;620.818;47.4873275306158;9932.892;760.228978174335;4.531;0.423590604239508
912;634.691;37.6497942756655;10157.164;602.456363767529;4.451;0.32411263474292
913;611.608;60.18555271824;9784.535;964.710201482816;4.784;0.804738466832544
914;642.387;43.0222863292969;10277.195;688.152989403531;4.328;0.357932954615803
915;638.018;48.8788152065896;10208.378;782.35051057438;4.369;0.47433005386545
916;648.493;46.0934633218194;10373.71;736.967604104835;4.265;0.425799248472792
917;640.793;50.6975995585592;10256.271;813.326397671303;4.369;0.460118463007078
918;653.3;48.2902663069903;10451.1;774.18025355859;4.345;0.612458161836377
919;669.005;39.0229305024619;10705.809;626.337302872012;4.139;0.35934523789803
920;665.41;51.8083879309126;10643.349;830.949445098193;4.154;0.432046293815833
921;675.177;32.5078845974337;10801.113;517.808245686549;4.08;0.209141100695217
922;686.808;38.1460608189093;10994.112;608.656701183803;3.972;0.210751037957116
923;688.303;40.6975249984557;11011.644;656.554714752725;4.036;0.421051065786567
924;694.398;35.3267308988559;11111.863;564.02993124563;3.975;0.275327078217888
925;696.48;33.0301946709368;11143.683;531.135772605285;3.99;0.386988371918322
926;699.02;34.5200724217098;11181.029;546.755710504245;3.938;0.251586963096257
927;713.098;11.1953006212466;11407.95;175.992330173845;3.848;0.0896437393240434
928;715.999;6.55045410639894;11459.282;103.793127884674;3.828;0.0940000000000027
929;722.106;8.60263703755903;11553.472;141.526885770904;3.799;0.0769999999999774
930;722.397;7.00505967141623;11557.957;109.318722097509;3.75;0.0828251169633925
931;723.803;7.46012204995133;11583.142;119.679246053997;3.724;0.0813879597974839
932;733.302;4.87759325897796;11730.836;79.7454104257607;3.689;0.0459238500127902
933;709.299;54.114994862793;11347.087;860.416232820456;3.841;0.285077182531329
934;696.598;64.9664422298164;11147.57;1043.46733869346;4.075;0.689641211065574
935;710.396;54.9142555626507;11366.337;879.50442936977;3.841;0.366645605455728
936;715.004;41.2096370282479;11439.94;657.010117486794;3.827;0.252192386879531
937;719.103;48.9063339558409;11503.365;785.696306587312;3.766;0.373314880496343
938;722.095;58.1320683014116;11554.007;930.238903788135;3.813;0.658407928263322
939;728.383;42.4450619153751;11652.939;674.835200718659;3.715;0.321473171508908
940;722.812;52.3231095788473;11567.701;838.388807325682;3.725;0.273175767592953
941;730.603;34.8998083232542;11694.347;558.279154653858;3.658;0.162653004890778
942;741.6;42.9691310128556;11860.332;685.245444243178;3.622;0.296236392092535
943;738.5;40.5143683154501;11813.285;652.800739648029;3.619;0.245089779468668
944;737.76;48.0901698894907;11811.527;767.924308666565;3.629;0.295277835267056
945;738.244;42.7894302836576;11810.627;682.727383632048;3.619;0.255556256037689
946;741.591;51.953897149299;11863.746;833.793656898363;3.675;0.475883389077616
947;748.108;45.5009375288044;11968.704;725.421227235591;3.57;0.314292857061692
948;739.701;55.782100076996;11834.299;892.610452587823;3.695;0.593957069155675
949;757.698;9.15451888413311;12123.752;144.860247259113;3.478;0.0834026378480079
950;759.106;8.14550329936739;12146.105;132.817966198126;3.51;0.0637181292882468
951;763.389;9.28576485810317;12214.11;152.40816730068;3.466;0.0995188424369918
952;744.814;44.6780481220926;11917.737;712.422257654108;3.655;0.48193879279427
953;734.934;55.4495313235383;11759.65;888.35853810273;3.501;0.265798796084553
954;711.48;93.5503239973016;11382.97;1492.21990745331;3.747;0.635752310259267
955;735.906;64.8284912981927;11776.488;1036.96233143543;3.67;0.608407758004452
956;750.017;38.2887411780522;11997.767;615.944517664557;3.512;0.167439541327593
957;757.896;41.8817555028441;12127.238;672.587806502615;3.471;0.266024434967915
958;756.103;46.7657526508435;12095.162;743.583340208738;3.452;0.32618399715498
959;733.889;73.3388780184153;11743.312;1174.68260719907;3.929;1.36405608389098
960;758.112;36.6546389424308;12130.122;589.306444522712;3.449;0.205934455592054
961;747.891;62.660692375683;11966.734;999.070792798985;3.504;0.396842538042482
962;759.904;39.672702756428;12156.756;640.181872005173;3.414;0.244548563684185
963;761.305;35.3101286460424;12185.879;563.589520439356;3.36;0.178997206682121
964;736.7;78.8804039036312;11782.697;1261.27374795525;3.596;0.605560897020274
965;738.597;74.1576562534164;11814.055;1187.10349459727;3.582;0.502847889525253
966;724.703;87.208004110862;11600.158;1391.76202627316;3.696;0.622771226053354
967;735.795;79.727926882617;11775.315;1279.28574943402;3.608;0.651733074195253
968;756.5;40.3247127702101;12097.587;646.484037282481;3.417;0.255970701448425
969;745.707;69.783754563652;11936.428;1113.32856635228;3.47;0.378417758568488
970;765.297;41.4576393563374;12243.971;662.636985135135;3.335;0.214161154274063
971;767.797;39.1545266987099;12284.16;627.130466234867;3.366;0.195765165440645
972;765.103;44.9706070784026;12242.661;716.818842350678;3.36;0.330726473086138
973;762.1;51.9487251046645;12190.282;836.860822655687;3.426;0.451557305333436
974;763.303;40.5895336386102;12212.851;647.671894394875;3.345;0.263372359977279
975;780.193;11.9740937444108;12484.487;192.883155410294;3.247;0.0719791636517147
976;784.005;11.1223264203214;12542.779;178.688473072718;3.252;0.073729234364652
977;784;9.6731597733101;12544.505;153.887945028281;3.236;0.105375518978562
978;763.098;67.4275048922917;12211.479;1077.72594163311;3.333;0.471127371312687
979;757.899;64.4079175955868;12126.001;1028.86899533857;3.487;0.419214742107189
980;767.996;67.0229965310429;12286.961;1071.43989808529;3.309;0.345729663176306
981;758.602;63.1978453430182;12139.83;1007.58758624748;3.363;0.420524672284514
982;783.79;16.0930028273191;12541.049;260.003922872224;3.255;0.154935470438505
983;789.013;8.98191076552763;12620.9;142.413738241783;3.159;0.0702068372738895
984;789.898;9.00453419117699;12639.169;146.776024980338;3.171;0.0693469537903293
985;784.878;11.3792106931937;12563.463;183.713623395084;3.201;0.0502891638427472
986;785.82;9.96773996450423;12571.311;156.378198829167;3.16;0.0553172667437378
987;777.798;43.6008194418427;12439.042;694.77026984173;3.241;0.228667881435063
988;776.604;46.8735456734396;12426.656;752.126782400425;3.242;0.219308002589963
989;776.395;49.475753304017;12426.95;790.96583179045;3.27;0.462947081209074
990;710.472;133.416417490502;11365.831;2135.24249977584;5.354;5.67808805849293
991;768.557;57.1288634667277;12300.043;912.285752865288;3.338;0.536969272863911
992;776.799;58.9420034355798;12424.587;941.327703098646;3.306;0.56752444881256
993;776.4;49.1496927762536;12422.906;788.401820599112;3.202;0.281168988332632
994;779.196;47.3962629750489;12468.14;759.09210858761;3.201;0.255517122713922
995;774.6;58.0568548924233;12391.088;930.339864348503;3.309;0.595322601620332
996;790.505;7.06976272583731;12648.78;112.494862015936;3.119;0.0569999999999869
997;794.2;6.20919801583953;12708.32;101.930138330171;3.118;0.0448998886412603
998;791.999;12.5616937154169;12671.879;200.06830780763;3.179;0.156489616268937
999;781.402;42.6019536641215;12502.723;681.281137212091;3.248;0.338756549752181
1000;795.395;9.89313928942679;12729.435;157.515204424903;3.123;0.0839106667831984
1001;793.402;11.9861785403055;12687.635;190.828123778956;3.179;0.137727992797405
1002;797.303;7.41136971146244;12761.162;119.493376117841;3.101;0.0465725240887643
1003;792.198;9.0663595781333;12674.173;142.277030756903;3.13;0.0657267069006055
1004;794.695;8.18175684068208;12714.922;129.887406302534;3.125;0.0475920161371768
1005;785.501;23.3476591760274;12569.221;373.918747148403;3.173;0.172745477509546
1006;766.304;59.4749663640074;12259.779;953.571892921029;3.285;0.414059174514952
1007;768.398;58.3734331352895;12298.162;936.271193712596;3.206;0.295878353381922
1008;783.202;44.7957062228061;12527.185;713.489369608951;3.165;0.208242646929013
1009;780.599;45.0709359676503;12487.29;725.172215256495;3.189;0.242340669306656
1010;779.104;62.9480362203619;12468.848;1007.18390879522;3.18;0.286356421265528
1011;775.199;68.9308237945845;12402.166;1101.21538973263;3.233;0.423321390907657
1012;780.6;40.7261596519965;12488.308;653.996441134027;3.151;0.183491144200471
1013;778.598;56.8949259249013;12457.365;909.428736935993;3.282;0.574417966292837
1014;769.304;56.0971455958347;12309.641;897.659205917824;3.273;0.418355112314884
1015;780.4;51.5717950046361;12483.588;821.754986693742;3.195;0.332031624999789
1016;775.198;45.8892686365765;12405.754;737.376630090759;3.22;0.281992907712231
1017;772.102;59.988931612422;12355.832;961.069172721741;3.287;0.431440610049635
1018;784.601;46.2311253269916;12550.329;737.356006586348;3.107;0.194167453503404
1019;759.401;82.3200536260752;12151.51;1318.32257353806;3.348;0.652990045865936
1020;759.801;76.835372381475;12157.814;1225.65337436163;3.28;0.469531681572182
1021;758.4;79.457271662196;12135.974;1272.38964973156;3.36;0.608194047981397
1022;769.8;53.4896442313843;12315.3;857.334865487257;3.224;0.318188623303847
1023;786.795;47.4533697960421;12585.914;755.169963322142;3.117;0.258420200448805
1024;782.603;54.0746206736584;12523.457;866.800475069695;3.224;0.476218437274323
1025;791.701;21.1150839212174;12663.794;340.528209762369;3.118;0.151248140484449
1026;797.401;8.7988231599383;12761.254;142.832381356466;3.052;0.0656962708226357
1027;800.3;7.02936981528806;12805.188;106.316484216009;3.047;0.0440567815438664
1028;795.598;9.18763059770151;12730.478;150.133995470836;3.051;0.0418210473326556
1029;803.303;6.77719123235683;12848.342;108.425797096584;3.064;0.0583438085832875
1030;798.393;8.44380370449846;12777.002;136.380156973066;3.056;0.0407921561087191
1031;802.593;8.05812639512878;12843.91;129.524045875828;3.038;0.0788416133777095
1032;805.008;7.63600392875011;12879.418;124.968761360624;3.027;0.0619758017293666
1033;777.101;72.5753942393692;12433.314;1158.19925241904;3.237;0.618789948205367
1034;803;5.9660740860298;12847.72;95.5905550777919;3.026;0.0438634243989104
1035;799;6.67473445165066;12784.5;108.250207482468;3.058;0.0830421579681242
1036;799.102;9.16066023821847;12784.75;147.045841967556;3.032;0.0769155380921236
1037;801.597;8.00985024828737;12826.236;124.770978372173;3.009;0.039862262856046
1038;779.799;71.421760612574;12473.877;1144.55677058895;3.195;0.545018348314994
1039;790.102;39.5602815460159;12644.442;634.417782865554;3.128;0.376000000000004
1040;802.001;8.14788494028602;12830.517;129.333135355945;3.026;0.0438634243989306
1041;800.496;9.78550274640794;12810.228;158.619772777693;3.021;0.0731368580128989
1042;799.602;7.75059197737751;12795.332;120.788538926546;3.033;0.0782368199762763
1043;803.898;8.61148512163541;12859.489;135.447590709162;2.977;0.0527351874937464
1044;802.399;10.0808258094172;12838.275;163.681550228052;3.015;0.060373835392499
1045;801.526;9.62466955276266;12826.913;151.072856069681;3.025;0.0823711114408379
1046;802.478;9.02471030006248;12834.334;145.736599191715;3.053;0.0755049667240519
1047;801.396;11.3019177133772;12824.343;183.414577340664;3.02;0.038729833462052
1048;801.401;11.266651188349;12824.719;175.26225471827;3.011;0.0512737749731835
1049;795.349;14.3169657749164;12725.167;233.159442487344;3.046;0.152065775242172
1050;802.655;6.1509678100257;12842.179;101.924511914556;2.994;0.0422374241638727
1051;778.992;72.451792220761;12467.276;1159.40878681508;3.13;0.51334199126898
1052;799.611;19.6710693405374;12788.281;313.645282459403;3.048;0.196560423279964
1053;804.098;7.10538077798862;12870.8;110.298578866578;2.994;0.0581721582890155
1054;804.801;6.49094977641872;12872.28;109.789218140923;2.972;0.0606300255649149
1055;788.7;45.214533504172;12618.607;728.841075613175;3.122;0.378940628595035
1056;805.683;9.00892784963482;12894.623;145.454387080907;2.994;0.0422374241638937
1057;802.008;6.51558255260871;12831.219;105.472333476472;2.972;0.0646219776855948
1058;778.75;70.5873912253461;12457.549;1126.88084092725;3.075;0.396793397122484
1059;764.814;109.150294933179;12236.534;1744.63043009227;4.812;5.31227785417894
1060;805.495;4.67045233354004;12891.825;81.0909172777953;2.966;0.0540740233383845
1061;805.408;8.12906858133561;12884.318;128.053697939595;2.945;0.0642261628933269
1062;799.592;16.1920855976044;12791.474;256.489764598885;3.027;0.224055796622187
1063;769.903;104.677785136103;12321.163;1678.27278716572;3.086;0.420123791280621
1064;783.243;68.3179209358706;12533.506;1093.9016893688;3.06;0.30430248109406
1065;802.959;12.827661088439;12842.912;202.400346135986;3.011;0.124695629434242
1066;801.601;7.71134547274976;12829.418;124.386256137761;2.961;0.0459238500128289
1067;805.697;5.80157228691148;12890.249;92.1209479379626;2.957;0.0525452186216576
1068;786.495;63.3476705570124;12588.13;1016.15180283262;3.021;0.216122650363171
1069;806.905;5.89588034140059;12904.285;96.199907613983;2.967;0.0481767578817861
1070;805.597;6.31044538840285;12890.356;103.071017381242;2.941;0.0552177507691208
1071;807.099;6.15908994902465;12913.702;95.0149744828935;2.924;0.0533291665039233
1072;805.902;7.93804106818274;12896.057;122.261432189469;2.94;0.0556776436283151
1073;808.199;9.24870417949973;12932.463;147.085055124565;2.907;0.0718401002226424
1074;804.702;6.48161368795625;12869.633;104.946457877547;2.945;0.0756637297521311
1075;803.593;8.21881262713221;12863.11;127.542112888001;2.934;0.0682934843158685
1076;805.308;6.26702768463461;12879.433;101.061771907289;2.945;0.0502493781056254
1077;807.493;8.32016111623614;12922.284;133.817151456725;2.908;0.0759999999999942
1078;808.7;5.32542956013837;12940.829;84.8864377212735;2.897;0.0624579858785295
1079;808.876666666667;7.91852679902287;12940.2411111111;121.360318834921;2.90333333333333;0.0658280588604381
