<?xml version="1.0" encoding="UTF-8" standalone="no"?>
<!-- Created with Inkscape (http://www.inkscape.org/) -->

<svg
   xmlns:dc="http://purl.org/dc/elements/1.1/"
   xmlns:cc="http://creativecommons.org/ns#"
   xmlns:rdf="http://www.w3.org/1999/02/22-rdf-syntax-ns#"
   xmlns:svg="http://www.w3.org/2000/svg"
   xmlns="http://www.w3.org/2000/svg"
   xmlns:sodipodi="http://sodipodi.sourceforge.net/DTD/sodipodi-0.dtd"
   xmlns:inkscape="http://www.inkscape.org/namespaces/inkscape"
   width="282.8259mm"
   height="276.00934mm"
   viewBox="0 0 282.8259 276.00934"
   version="1.1"
   id="svg8"
   sodipodi:docname="loop_user.svg"
   inkscape:version="0.92.4 (5da689c313, 2019-01-14)">
  <defs
     id="defs2">
    <marker
       inkscape:stockid="Arrow1Lend"
       orient="auto"
       refY="0"
       refX="0"
       id="marker3420"
       style="overflow:visible"
       inkscape:isstock="true">
      <path
         id="path3418"
         d="M 0,0 5,-5 -12.5,0 5,5 Z"
         style="fill:#ffffff;fill-opacity:1;fill-rule:evenodd;stroke:#ffffff;stroke-width:1.00000003pt;stroke-opacity:1"
         transform="matrix(-0.8,0,0,-0.8,-10,0)"
         inkscape:connector-curvature="0" />
    </marker>
    <marker
       inkscape:isstock="true"
       style="overflow:visible"
       id="marker3013"
       refX="0"
       refY="0"
       orient="auto"
       inkscape:stockid="Arrow1Lend"
       inkscape:collect="always">
      <path
         inkscape:connector-curvature="0"
         transform="matrix(-0.8,0,0,-0.8,-10,0)"
         style="fill:#ffffff;fill-opacity:1;fill-rule:evenodd;stroke:#ffffff;stroke-width:1.00000003pt;stroke-opacity:1"
         d="M 0,0 5,-5 -12.5,0 5,5 Z"
         id="path3011" />
    </marker>
    <marker
       inkscape:stockid="Arrow1Lend"
       orient="auto"
       refY="0"
       refX="0"
       id="marker2131"
       style="overflow:visible"
       inkscape:isstock="true">
      <path
         inkscape:connector-curvature="0"
         id="path2129"
         d="M 0,0 5,-5 -12.5,0 5,5 Z"
         style="fill:#ffffff;fill-opacity:1;fill-rule:evenodd;stroke:#ffffff;stroke-width:1.00000003pt;stroke-opacity:1"
         transform="matrix(-0.8,0,0,-0.8,-10,0)" />
    </marker>
    <marker
       inkscape:stockid="Arrow1Lstart"
       orient="auto"
       refY="0"
       refX="0"
       id="Arrow1Lstart"
       style="overflow:visible"
       inkscape:isstock="true">
      <path
         id="path13130"
         d="M 0,0 5,-5 -12.5,0 5,5 Z"
         style="fill:#feffff;fill-opacity:1;fill-rule:evenodd;stroke:#feffff;stroke-width:1.00000003pt;stroke-opacity:1"
         transform="matrix(0.8,0,0,0.8,10,0)"
         inkscape:connector-curvature="0" />
    </marker>
    <marker
       inkscape:isstock="true"
       style="overflow:visible"
       id="marker12714"
       refX="0"
       refY="0"
       orient="auto"
       inkscape:stockid="Arrow1Lend">
      <path
         transform="matrix(-0.8,0,0,-0.8,-10,0)"
         style="fill:#2196f3;fill-opacity:1;fill-rule:evenodd;stroke:#2196f3;stroke-width:1.00000003pt;stroke-opacity:1"
         d="M 0,0 5,-5 -12.5,0 5,5 Z"
         id="path12712"
         inkscape:connector-curvature="0" />
    </marker>
    <marker
       inkscape:isstock="true"
       style="overflow:visible"
       id="marker948"
       refX="0"
       refY="0"
       orient="auto"
       inkscape:stockid="Arrow1Lend">
      <path
         inkscape:connector-curvature="0"
         transform="matrix(-0.8,0,0,-0.8,-10,0)"
         style="fill:#000000;fill-opacity:1;fill-rule:evenodd;stroke:#000000;stroke-width:1.00000003pt;stroke-opacity:1"
         d="M 0,0 5,-5 -12.5,0 5,5 Z"
         id="path946" />
    </marker>
    <marker
       inkscape:isstock="true"
       style="overflow:visible"
       id="marker4057"
       refX="0"
       refY="0"
       orient="auto"
       inkscape:stockid="Arrow1Lend"
       inkscape:collect="always">
      <path
         transform="matrix(-0.8,0,0,-0.8,-10,0)"
         style="fill:#ffffff;fill-opacity:1;fill-rule:evenodd;stroke:#ffffff;stroke-width:1.00000003pt;stroke-opacity:1"
         d="M 0,0 5,-5 -12.5,0 5,5 Z"
         id="path4055"
         inkscape:connector-curvature="0" />
    </marker>
    <marker
       inkscape:stockid="Arrow1Lend"
       orient="auto"
       refY="0"
       refX="0"
       id="marker3701"
       style="overflow:visible"
       inkscape:isstock="true"
       inkscape:collect="always">
      <path
         id="path3699"
         d="M 0,0 5,-5 -12.5,0 5,5 Z"
         style="fill:#ffffff;fill-opacity:1;fill-rule:evenodd;stroke:#ffffff;stroke-width:1.00000003pt;stroke-opacity:1"
         transform="matrix(-0.8,0,0,-0.8,-10,0)"
         inkscape:connector-curvature="0" />
    </marker>
  </defs>
  <sodipodi:namedview
     id="base"
     pagecolor="#ffffff"
     bordercolor="#666666"
     borderopacity="1.0"
     inkscape:pageopacity="0.0"
     inkscape:pageshadow="2"
     inkscape:zoom="0.21644285"
     inkscape:cx="1406.3638"
     inkscape:cy="642.07804"
     inkscape:document-units="mm"
     inkscape:current-layer="layer2"
     showgrid="false"
     inkscape:window-width="1920"
     inkscape:window-height="1007"
     inkscape:window-x="0"
     inkscape:window-y="0"
     inkscape:window-maximized="1"
     fit-margin-top="0"
     fit-margin-left="0"
     fit-margin-right="0"
     fit-margin-bottom="0"
     inkscape:pagecheckerboard="true" />
  <metadata
     id="metadata5">
    <rdf:RDF>
      <cc:Work
         rdf:about="">
        <dc:format>image/svg+xml</dc:format>
        <dc:type
           rdf:resource="http://purl.org/dc/dcmitype/StillImage" />
        <dc:title></dc:title>
      </cc:Work>
    </rdf:RDF>
  </metadata>
  <g
     inkscape:label="base-fig[1-]"
     inkscape:groupmode="layer"
     id="layer1"
     transform="translate(3.292606,47.055432)"
     style="display:inline">
    <g
       id="g2543" />
    <path
       style="fill:none;stroke:#ffffff;stroke-width:3;stroke-linecap:butt;stroke-linejoin:miter;stroke-miterlimit:4;stroke-dasharray:9, 3;stroke-dashoffset:0;stroke-opacity:1"
       d="M -0.03063041,143.5208 H 279.53329"
       id="path1632"
       inkscape:connector-curvature="0" />
    <text
       xml:space="preserve"
       style="font-style:normal;font-weight:normal;font-size:12.69999981px;line-height:1.25;font-family:sans-serif;letter-spacing:0px;word-spacing:0px;fill:#2196f3;fill-opacity:1;stroke:none;stroke-width:0.26458332"
       x="0.42809656"
       y="133.6432"
       id="text1636"><tspan
         sodipodi:role="line"
         id="tspan1634"
         x="0.42809656"
         y="133.6432"
         style="font-size:12.69999981px;fill:#2196f3;stroke-width:0.26458332">User</tspan></text>
    <text
       id="text1640"
       y="160.10156"
       x="-4.5390415"
       style="font-style:normal;font-weight:normal;font-size:12.69999981px;line-height:1.25;font-family:sans-serif;letter-spacing:0px;word-spacing:0px;fill:#ff9800;fill-opacity:1;stroke:none;stroke-width:0.26458332"
       xml:space="preserve"><tspan
         style="font-size:12.69999981px;fill:#ff9800;stroke-width:0.26458332"
         y="160.10156"
         x="-4.5390415"
         id="tspan1638"
         sodipodi:role="line">Kernel</tspan></text>
    <rect
       y="-25.019691"
       x="44.8927"
       height="58.357143"
       width="58.357143"
       id="rect4485-1"
       style="fill:none;stroke:#ffffff;stroke-width:0.44560343;stroke-miterlimit:4;stroke-dasharray:none" />
    <rect
       y="-16.026909"
       x="45.83416"
       height="48.421841"
       width="56.474205"
       id="rect4493-3"
       style="fill:none;stroke:#ffffff;stroke-width:0.47397375;stroke-miterlimit:4;stroke-dasharray:none" />
    <rect
       style="fill:none;stroke:#ffffff;stroke-width:0.44560343;stroke-miterlimit:4;stroke-dasharray:none"
       id="rect4497-2"
       width="56.474205"
       height="7.1909313"
       x="45.83416"
       y="-24.05999" />
    <circle
       r="2.7987609"
       cy="-20.434502"
       cx="85.504501"
       id="path4515-1"
       style="fill:none;stroke:#ffffff;stroke-width:0.44560343;stroke-miterlimit:4;stroke-dasharray:none" />
    <circle
       style="fill:none;stroke:#ffffff;stroke-width:0.44560343;stroke-miterlimit:4;stroke-dasharray:none"
       id="circle4517-5"
       cx="92.13768"
       cy="-20.434502"
       r="2.7987609" />
    <circle
       r="2.7987609"
       cy="-20.434502"
       cx="98.770859"
       id="circle4519-9"
       style="fill:none;stroke:#ffffff;stroke-width:0.44560343;stroke-miterlimit:4;stroke-dasharray:none" />
    <text
       xml:space="preserve"
       style="font-style:normal;font-weight:normal;font-size:4.23333359px;line-height:1.25;font-family:sans-serif;letter-spacing:0px;word-spacing:0px;fill:#2196f3;fill-opacity:1;stroke:none;stroke-width:0.26458335"
       x="46.791275"
       y="1.3534174"
       id="text5239-9"><tspan
         sodipodi:role="line"
         id="tspan5237"
         x="46.791275"
         y="1.3534174"
         style="font-size:4.23333359px;fill:#2196f3;stroke-width:0.26458335">mem = recv_mem_stats()</tspan><tspan
         sodipodi:role="line"
         x="46.791275"
         y="6.6450844"
         style="font-size:4.23333359px;fill:#2196f3;stroke-width:0.26458335"
         id="tspan2615">if percentile &lt; low_ref:</tspan><tspan
         sodipodi:role="line"
         x="46.791275"
         y="11.936751"
         style="font-size:4.23333359px;fill:#2196f3;stroke-width:0.26458335"
         id="tspan5247">  if mem['few'] == True:</tspan><tspan
         sodipodi:role="line"
         x="46.791275"
         y="17.228418"
         style="font-size:4.23333359px;fill:#2196f3;stroke-width:0.26458335"
         id="tspan2617">    add_memory()</tspan><tspan
         sodipodi:role="line"
         x="46.791275"
         y="22.520084"
         style="font-size:4.23333359px;fill:#2196f3;stroke-width:0.26458335"
         id="tspan5241" /></text>
    <text
       id="text5257-1"
       y="-30.03005"
       x="52.483437"
       style="font-style:normal;font-weight:normal;font-size:10.58333397px;line-height:1.25;font-family:sans-serif;letter-spacing:0px;word-spacing:0px;fill:#2196f3;fill-opacity:1;stroke:none;stroke-width:0.26458335"
       xml:space="preserve"><tspan
         style="fill:#2196f3;stroke-width:0.26458335"
         y="-30.03005"
         x="52.483437"
         id="tspan5255-4"
         sodipodi:role="line">Analysis</tspan></text>
    <rect
       y="-25.019697"
       x="174.56548"
       height="58.357143"
       width="58.357143"
       id="rect5577-8"
       style="fill:none;stroke:#ffffff;stroke-width:0.44560343;stroke-miterlimit:4;stroke-dasharray:none" />
    <rect
       y="-16.026915"
       x="175.50694"
       height="48.421841"
       width="56.474205"
       id="rect5579-7"
       style="fill:none;stroke:#ffffff;stroke-width:0.47397375;stroke-miterlimit:4;stroke-dasharray:none" />
    <rect
       style="fill:none;stroke:#ffffff;stroke-width:0.44560343;stroke-miterlimit:4;stroke-dasharray:none"
       id="rect5581-0"
       width="56.474205"
       height="7.1909313"
       x="175.50694"
       y="-24.059996" />
    <circle
       r="2.7987609"
       cy="-20.434507"
       cx="215.17729"
       id="circle5583-4"
       style="fill:none;stroke:#ffffff;stroke-width:0.44560343;stroke-miterlimit:4;stroke-dasharray:none" />
    <circle
       style="fill:none;stroke:#ffffff;stroke-width:0.44560343;stroke-miterlimit:4;stroke-dasharray:none"
       id="circle5585-8"
       cx="221.81047"
       cy="-20.434507"
       r="2.7987609" />
    <circle
       r="2.7987609"
       cy="-20.434507"
       cx="228.44363"
       id="circle5587-0"
       style="fill:none;stroke:#ffffff;stroke-width:0.44560343;stroke-miterlimit:4;stroke-dasharray:none" />
    <text
       xml:space="preserve"
       style="font-style:normal;font-weight:normal;font-size:4.23333359px;line-height:1.25;font-family:sans-serif;letter-spacing:0px;word-spacing:0px;fill:#2196f3;fill-opacity:1;stroke:none;stroke-width:0.26458335"
       x="180.92993"
       y="-2.3426645"
       id="text5619-4"><tspan
         sodipodi:role="line"
         x="180.92993"
         y="-2.3426645"
         style="font-size:4.23333359px;fill:#2196f3;stroke-width:0.26458335"
         id="tspan5617-2">def add_memory():</tspan><tspan
         id="tspan5635-9"
         sodipodi:role="line"
         x="180.92993"
         y="2.9490025"
         style="font-size:4.23333359px;fill:#2196f3;stroke-width:0.26458335">  if cost &lt; cost_ok:</tspan><tspan
         id="tspan5637-6"
         sodipodi:role="line"
         x="180.92993"
         y="8.2406693"
         style="font-size:4.23333359px;fill:#2196f3;stroke-width:0.26458335">    __add_memory()</tspan><tspan
         id="tspan1036-1"
         sodipodi:role="line"
         x="180.92993"
         y="13.532336"
         style="font-size:4.23333359px;fill:#2196f3;stroke-width:0.26458335">    cost += mem_cost</tspan></text>
    <text
       id="text5641-0"
       y="-30.030058"
       x="192.41399"
       style="font-style:normal;font-weight:normal;font-size:10.58333397px;line-height:1.25;font-family:sans-serif;letter-spacing:0px;word-spacing:0px;fill:#2196f3;fill-opacity:1;stroke:none;stroke-width:0.26458335"
       xml:space="preserve"><tspan
         style="fill:#2196f3;stroke-width:0.26458335"
         y="-30.030058"
         x="192.41399"
         id="tspan5639-4"
         sodipodi:role="line">Plan</tspan></text>
    <g
       id="g5684">
      <g
         id="g901-2"
         transform="matrix(0.12810994,0,0,0.12810994,164.5721,58.829169)"
         style="display:inline;fill:#03a9f4;fill-opacity:1;stroke:none;stroke-opacity:1;enable-background:new">
        <g
           id="g6-2"
           style="fill:#03a9f4;fill-opacity:1;stroke:none;stroke-opacity:1">
          <g
             id="g4-2"
             style="fill:#03a9f4;fill-opacity:1;stroke:none;stroke-opacity:1">
            <path
               id="path2-0"
               d="M 383.781,0 0,383.781 128.227,512 512,128.219 Z M 165.938,444.125 c -4.164,-4.172 -10.922,-4.172 -15.086,0 -4.164,4.156 -4.164,10.906 0,15.078 l -7.539,7.547 c -4.164,-4.172 -10.922,-4.172 -15.086,0 -4.164,4.156 -4.164,10.906 0,15.078 l -7.539,-7.547 52.781,-52.781 c -4.156,4.172 -4.148,10.906 0.008,15.078 z M 188.563,421.5 c -4.156,-4.172 -10.906,-4.172 -15.07,-0.031 l 22.609,-22.594 c -4.156,4.156 -4.156,10.906 0.008,15.063 z m 22.632,-22.641 c -4.164,-4.172 -10.914,-4.172 -15.086,0 l 22.588,-22.584 c -4.125,4.175 -4.114,10.894 0.037,15.037 z m 22.625,-22.625 c -4.15,-4.158 -10.876,-4.169 -15.044,-0.038 l 22.575,-22.571 c -4.156,4.156 -4.148,10.906 0.008,15.063 z m 7.54,-82.967 c -4.164,-4.172 -10.914,-4.172 -15.078,0 -4.172,4.172 -4.172,10.922 0,15.078 L 241.36,323.439 105.602,459.203 82.969,436.578 c 4.164,-4.172 4.164,-10.922 0,-15.078 -4.164,-4.172 -10.914,-4.172 -15.086,0 4.172,-4.172 4.172,-10.938 0,-15.094 -4.164,-4.156 -10.914,-4.156 -15.078,0 L 30.172,383.781 383.781,30.172 l 22.688,22.68 c -3.313,4.188 -3.031,10.281 0.828,14.141 3.859,3.867 9.953,4.141 14.141,0.836 l 0.125,0.109 c -3.313,4.188 -3.047,10.281 0.813,14.141 3.875,3.867 9.969,4.141 14.156,0.836 l 22.672,22.68 -202.758,202.75 -15.078,-15.078 z m 15.085,60.342 c -4.156,-4.172 -10.906,-4.172 -15.07,-0.016 l 15.07,-15.063 7.547,7.531 z m 22.633,-22.64 -7.547,-7.531 16.503,-16.501 c -4.126,4.174 -4.118,10.901 0.028,15.063 z m 24.078,-24.063 c -4.177,-4.146 -10.903,-4.154 -15.062,-0.029 l 22.536,-22.533 c -4.096,4.161 -4.079,10.88 0.057,15.031 z m 30.156,-30.155 -7.531,7.53 c -4.152,-4.136 -10.87,-4.152 -15.031,-0.057 l 22.562,-22.559 c -4.156,4.164 -4.156,10.914 0,15.086 z m 37.719,-37.72 c -4.172,-4.172 -10.922,-4.164 -15.094,0 -4.156,4.164 -4.156,10.914 0,15.086 l -7.531,7.539 c -4.172,-4.164 -10.906,-4.164 -15.094,-0.008 l 45.25,-45.25 c -4.156,4.172 -4.156,10.922 0,15.086 z m 22.625,-22.632 c -4.156,-4.164 -10.922,-4.164 -15.094,0 l 22.606,-22.604 c -4.136,4.166 -4.13,10.908 0.019,15.065 z m 73.062,-73.062 -5.187,5.179 c -4.156,-4.164 -10.906,-4.164 -15.078,0 -4.172,4.172 -4.172,10.922 0,15.086 l -7.547,7.547 c -4.156,-4.164 -10.906,-4.164 -15.078,0 -4.172,4.164 -4.172,10.914 0,15.086 l -7.547,7.539 c -4.15,-4.157 -10.884,-4.163 -15.074,-0.018 l 65.511,-65.505 c -4.156,4.172 -4.156,10.922 0,15.086 z m 10e-4,-15.095 7.563,-7.563 7.563,7.539 -0.031,0.031 c -4.173,-4.163 -10.923,-4.163 -15.095,-0.007 z"
               inkscape:connector-curvature="0"
               style="fill:#03a9f4;fill-opacity:1;stroke:none;stroke-opacity:1" />
          </g>
        </g>
        <g
           id="g12-5"
           style="fill:#03a9f4;fill-opacity:1;stroke:none;stroke-opacity:1">
          <g
             id="g10-5"
             style="fill:#03a9f4;fill-opacity:1;stroke:none;stroke-opacity:1">
            <path
               id="path8-2"
               d="m 105.602,338.531 -45.258,45.25 45.258,45.25 45.25,-45.25 z m -15.086,45.251 15.086,-15.094 15.078,15.094 -15.078,15.078 z"
               inkscape:connector-curvature="0"
               style="fill:#03a9f4;fill-opacity:1;stroke:none;stroke-opacity:1" />
          </g>
        </g>
        <g
           id="g18-9"
           style="fill:#03a9f4;fill-opacity:1;stroke:none;stroke-opacity:1">
          <g
             id="g16-0"
             style="fill:#03a9f4;fill-opacity:1;stroke:none;stroke-opacity:1">
            <path
               id="path14-2"
               d="m 165.937,278.188 -45.25,45.25 45.25,45.25 45.258,-45.25 z m -15.085,45.25 15.086,-15.094 15.086,15.094 -15.086,15.094 z"
               inkscape:connector-curvature="0"
               style="fill:#03a9f4;fill-opacity:1;stroke:none;stroke-opacity:1" />
          </g>
        </g>
        <g
           id="g24-8"
           style="fill:#03a9f4;fill-opacity:1;stroke:none;stroke-opacity:1">
          <g
             id="g22-3"
             style="fill:#03a9f4;fill-opacity:1;stroke:none;stroke-opacity:1">
            <path
               id="path20-8"
               d="m 256.445,187.672 -45.25,45.258 45.25,45.258 45.258,-45.258 z m -15.078,45.258 15.078,-15.086 15.086,15.086 -15.086,15.086 z"
               inkscape:connector-curvature="0"
               style="fill:#03a9f4;fill-opacity:1;stroke:none;stroke-opacity:1" />
          </g>
        </g>
        <g
           id="g30-0"
           style="fill:#03a9f4;fill-opacity:1;stroke:none;stroke-opacity:1">
          <g
             id="g28-4"
             style="fill:#03a9f4;fill-opacity:1;stroke:none;stroke-opacity:1">
            <path
               id="path26-0"
               d="m 316.781,127.336 -45.25,45.25 45.25,45.258 45.266,-45.258 z m -15.078,45.25 15.078,-15.086 15.094,15.086 -15.094,15.086 z"
               inkscape:connector-curvature="0"
               style="fill:#03a9f4;fill-opacity:1;stroke:none;stroke-opacity:1" />
          </g>
        </g>
        <g
           id="g36-9"
           style="fill:#03a9f4;fill-opacity:1;stroke:none;stroke-opacity:1">
          <g
             id="g34-1"
             style="fill:#03a9f4;fill-opacity:1;stroke:none;stroke-opacity:1">
            <path
               id="path32-9"
               d="m 377.125,66.992 -45.25,45.258 45.25,45.25 45.25,-45.25 z m -15.094,45.258 15.094,-15.086 15.094,15.086 -15.094,15.086 z"
               inkscape:connector-curvature="0"
               style="fill:#03a9f4;fill-opacity:1;stroke:none;stroke-opacity:1" />
          </g>
        </g>
      </g>
      <text
         id="text7434-6"
         y="55.877544"
         x="177.02261"
         style="font-style:normal;font-weight:normal;font-size:10.58333397px;line-height:1.25;font-family:sans-serif;letter-spacing:0px;word-spacing:0px;fill:#2196f3;fill-opacity:1;stroke:none;stroke-width:0.26458335"
         xml:space="preserve"><tspan
           style="fill:#2196f3;stroke-width:0.26458335"
           y="55.877544"
           x="177.02261"
           id="tspan7432-2"
           sodipodi:role="line">Execute</tspan></text>
      <text
         xml:space="preserve"
         style="font-style:normal;font-weight:normal;font-size:6.3499999px;line-height:1.25;font-family:sans-serif;text-align:center;letter-spacing:0px;word-spacing:0px;text-anchor:middle;fill:#ffffff;fill-opacity:1;stroke:none;stroke-width:0.26458335"
         x="198.41873"
         y="130.36226"
         id="text7438-5"><tspan
           sodipodi:role="line"
           id="tspan7436-4"
           x="198.41873"
           y="130.36226"
           style="font-size:6.3499999px;text-align:center;text-anchor:middle;fill:#ffffff;stroke-width:0.26458335">add memory to</tspan><tspan
           sodipodi:role="line"
           x="198.41873"
           y="138.29976"
           style="font-size:6.3499999px;text-align:center;text-anchor:middle;fill:#ffffff;stroke-width:0.26458335"
           id="tspan7440-4"> containers</tspan></text>
    </g>
    <path
       sodipodi:nodetypes="cc"
       inkscape:connector-curvature="0"
       id="path3697"
       d="m 214.15446,33.55345 c 2.79068,3.44883 2.19424,8.68183 2.19424,13.29684"
       style="display:inline;fill:none;stroke:#ffffff;stroke-width:0.5;stroke-linecap:butt;stroke-linejoin:miter;stroke-miterlimit:4;stroke-dasharray:none;stroke-opacity:1;marker-end:url(#marker3701)" />
    <path
       style="display:inline;fill:none;stroke:#ffffff;stroke-width:0.5;stroke-linecap:butt;stroke-linejoin:miter;stroke-miterlimit:4;stroke-dasharray:none;stroke-opacity:1;marker-end:url(#marker4057)"
       d="m 96.86504,-33.39645 c 33.85115,-24.30418 72.42632,-11.69676 91.33936,7.21627"
       id="path4047"
       inkscape:connector-curvature="0"
       sodipodi:nodetypes="cc" />
    <g
       id="g3651"
       transform="translate(-183.9737,142.41154)">
      <g
         id="g3615" />
    </g>
    <flowRoot
       xml:space="preserve"
       id="flowRoot2498"
       style="font-style:normal;font-weight:normal;font-size:40px;line-height:1.25;font-family:sans-serif;font-variant-ligatures:normal;font-variant-caps:normal;font-variant-numeric:normal;font-feature-settings:normal;text-align:start;letter-spacing:0px;word-spacing:0px;writing-mode:lr-tb;text-anchor:start;fill:#000000;fill-opacity:1;stroke:none"
       transform="matrix(0.26458333,0,0,0.26458333,-18.060696,-42.723741)"><flowRegion
         id="flowRegion2500"><rect
           id="rect2502"
           width="310.12805"
           height="308.39551"
           x="714.39185"
           y="-27.406652" /></flowRegion><flowPara
         id="flowPara2504" /></flowRoot>    <g
       id="g3451"
       transform="translate(5.085771,-70.229212)"
       style="display:inline;fill:#ffffff">
      <path
         style="fill:#ffffff;stroke-width:0.96914607"
         inkscape:connector-curvature="0"
         d="m 57.334695,145.3404 h 9.69146 c 0.534969,0 0.969147,-0.43321 0.969147,-0.96915 0,-0.53594 -0.434178,-0.96914 -0.969147,-0.96914 h -9.69146 c -0.534969,0 -0.969147,0.4332 -0.969147,0.96914 0,0.53594 0.434178,0.96915 0.969147,0.96915 z"
         id="path979" />
      <path
         style="fill:#ffffff;stroke-width:0.96914607"
         inkscape:connector-curvature="0"
         d="M 81.563347,158.90844 H 57.334695 c -0.534969,0 -0.969147,0.43321 -0.969147,0.96915 0,0.53594 0.434178,0.96915 0.969147,0.96915 h 24.228652 c 0.534969,0 0.969146,-0.43321 0.969146,-0.96915 0,-0.53594 -0.434177,-0.96915 -0.969146,-0.96915 z"
         id="path981" />
      <path
         style="fill:#ffffff;stroke-width:0.96914607"
         inkscape:connector-curvature="0"
         d="M 81.563347,166.66161 H 57.334695 c -0.534969,0 -0.969147,0.43321 -0.969147,0.96915 0,0.53594 0.434178,0.96914 0.969147,0.96914 h 24.228652 c 0.534969,0 0.969146,-0.4332 0.969146,-0.96914 0,-0.53594 -0.434177,-0.96915 -0.969146,-0.96915 z"
         id="path983" />
      <path
         style="fill:#ffffff;stroke-width:0.96914607"
         inkscape:connector-curvature="0"
         d="M 81.563347,174.41478 H 57.334695 c -0.534969,0 -0.969147,0.43321 -0.969147,0.96915 0,0.53594 0.434178,0.96914 0.969147,0.96914 h 24.228652 c 0.534969,0 0.969146,-0.4332 0.969146,-0.96914 0,-0.53594 -0.434177,-0.96915 -0.969146,-0.96915 z"
         id="path985" />
      <path
         style="fill:#ffffff;stroke-width:0.96914607"
         inkscape:connector-curvature="0"
         d="M 78.087989,129.83406 H 46.674088 v 58.14877 h 45.549866 v -44.0128 z m 0.56792,3.30866 10.25938,10.25939 h -10.25938 z m -30.04353,52.90181 v -54.27218 h 28.105237 v 13.56805 h 13.568046 v 40.70413 z"
         id="path987" />
      <path
         id="path3443"
         d="M 81.563347,151.3401 H 57.334695 c -0.534969,0 -0.969147,0.43321 -0.969147,0.96915 0,0.53594 0.434178,0.96915 0.969147,0.96915 h 24.228652 c 0.534969,0 0.969146,-0.43321 0.969146,-0.96915 0,-0.53594 -0.434177,-0.96915 -0.969146,-0.96915 z"
         inkscape:connector-curvature="0"
         style="fill:#ffffff;stroke-width:0.96914607" />
    </g>
    <g
       id="g3315"
       transform="translate(50.568117,21.340592)">
      <g
         id="g3566"
         style="display:inline;fill:#2196f3"
         transform="matrix(0.62580385,0,0,0.62580385,3.9409529,47.312916)">
        <path
           inkscape:connector-curvature="0"
           d="M 25,46.998 C 19.123,46.998 13.599,44.71 9.443,40.555 5.288,36.401 3,30.877 3,24.999 3,19.122 5.288,13.598 9.443,9.443 13.599,5.288 19.123,3 25,3 c 5.877,0 11.401,2.288 15.557,6.443 8.577,8.577 8.577,22.534 0,31.111 C 36.401,44.71 30.877,46.998 25,46.998 Z M 25,5 C 19.657,5 14.635,7.08 10.857,10.857 7.08,14.634 5,19.656 5,24.999 c 0,5.343 2.08,10.365 5.857,14.142 3.777,3.777 8.8,5.857 14.143,5.857 5.343,0 10.365,-2.08 14.143,-5.857 7.798,-7.798 7.798,-20.485 0,-28.283 C 35.365,7.08 30.343,5 25,5 Z"
           id="path3564"
           style="fill:#2196f3" />
      </g>
      <g
         id="g3570"
         style="display:inline;fill:#2196f3"
         transform="matrix(0.62580385,0,0,0.62580385,3.9409529,47.312916)">
        <path
           inkscape:connector-curvature="0"
           d="m 25,49.998 c -6.678,0 -12.956,-2.6 -17.678,-7.321 C 2.6,37.956 0.001,31.677 0,24.999 0,18.321 2.601,12.043 7.322,7.322 12.045,2.601 18.323,0 25,0 c 6.678,0 12.956,2.601 17.678,7.322 9.747,9.747 9.747,25.606 0,35.354 C 37.955,47.398 31.677,49.998 25,49.998 Z M 25,2 C 18.857,2 13.081,4.393 8.736,8.736 4.393,13.08 2,18.855 2,24.999 c 10e-4,6.144 2.393,11.92 6.736,16.264 4.343,4.344 10.12,6.735 16.264,6.735 6.143,0 11.919,-2.392 16.264,-6.735 8.967,-8.968 8.967,-23.56 0,-32.526 C 36.92,4.393 31.144,2 25,2 Z"
           id="path3568"
           style="fill:#2196f3" />
      </g>
      <g
         id="g3574"
         style="display:inline;fill:#2196f3"
         transform="matrix(0.62580385,0,0,0.62580385,3.9409529,47.312916)">
        <path
           inkscape:connector-curvature="0"
           d="m 46.006,49.834 c -0.256,0 -0.512,-0.098 -0.707,-0.293 l -5.508,-5.509 c -0.391,-0.391 -0.391,-1.023 0,-1.414 0.391,-0.391 1.023,-0.391 1.414,0 l 5.508,5.509 c 0.391,0.391 0.391,1.023 0,1.414 -0.195,0.195 -0.451,0.293 -0.707,0.293 z"
           id="path3572"
           style="fill:#2196f3" />
      </g>
      <g
         id="g3578"
         style="display:inline;fill:#2196f3"
         transform="matrix(0.62580385,0,0,0.62580385,3.9409529,47.312916)">
        <path
           inkscape:connector-curvature="0"
           d="m 48.834,47.006 c -0.256,0 -0.512,-0.098 -0.707,-0.293 l -5.514,-5.515 c -0.391,-0.391 -0.391,-1.023 0,-1.414 0.391,-0.391 1.023,-0.391 1.414,0 l 5.514,5.515 c 0.391,0.391 0.391,1.023 0,1.414 -0.195,0.195 -0.451,0.293 -0.707,0.293 z"
           id="path3576"
           style="fill:#2196f3" />
      </g>
      <g
         id="g3582"
         style="display:inline;fill:#2196f3"
         transform="matrix(0.62580385,0,0,0.62580385,3.9409529,47.312916)">
        <path
           inkscape:connector-curvature="0"
           d="m 44.592,51.248 c -0.256,0 -0.512,-0.098 -0.707,-0.293 -0.391,-0.391 -0.391,-1.023 0,-1.414 l 5.656,-5.658 c 0.391,-0.391 1.023,-0.391 1.414,0 0.391,0.391 0.391,1.023 0,1.414 l -5.656,5.658 c -0.195,0.195 -0.451,0.293 -0.707,0.293 z"
           id="path3580"
           style="fill:#2196f3" />
      </g>
      <g
         id="g3586"
         style="display:inline;fill:#2196f3"
         transform="matrix(0.62580385,0,0,0.62580385,3.9409529,47.312916)">
        <path
           inkscape:connector-curvature="0"
           d="m 56.172,62.828 c -0.256,0 -0.512,-0.098 -0.707,-0.293 l -11.58,-11.58 c -0.391,-0.391 -0.391,-1.023 0,-1.414 0.391,-0.391 1.023,-0.391 1.414,0 l 11.58,11.58 c 0.391,0.391 0.391,1.023 0,1.414 -0.195,0.195 -0.451,0.293 -0.707,0.293 z"
           id="path3584"
           style="fill:#2196f3" />
      </g>
      <g
         id="g3590"
         style="display:inline;fill:#2196f3"
         transform="matrix(0.62580385,0,0,0.62580385,3.9409529,47.312916)">
        <path
           inkscape:connector-curvature="0"
           d="m 61.828,57.173 c -0.256,0 -0.512,-0.098 -0.707,-0.293 L 49.541,45.297 c -0.391,-0.391 -0.391,-1.023 0,-1.414 0.391,-0.391 1.023,-0.391 1.414,0 l 11.58,11.583 c 0.391,0.391 0.391,1.023 0,1.414 -0.195,0.195 -0.451,0.293 -0.707,0.293 z"
           id="path3588"
           style="fill:#2196f3" />
      </g>
      <g
         id="g3594"
         style="display:inline;fill:#2196f3"
         transform="matrix(0.62580385,0,0,0.62580385,3.9409529,47.312916)">
        <path
           inkscape:connector-curvature="0"
           d="m 59.001,64 c -1.336,0 -2.592,-0.521 -3.536,-1.465 -0.391,-0.391 -0.391,-1.023 0,-1.414 0.391,-0.391 1.023,-0.391 1.414,0 1.132,1.132 3.109,1.136 4.241,0 C 61.687,60.555 62,59.801 62,58.999 62,58.198 61.688,57.446 61.122,56.881 60.73,56.49 60.73,55.858 61.12,55.467 c 0.391,-0.393 1.025,-0.391 1.414,-0.002 0.945,0.943 1.466,2.198 1.466,3.534 0,1.336 -0.521,2.592 -1.465,3.536 C 61.592,63.479 60.337,64 59.001,64 Z"
           id="path3592"
           style="fill:#2196f3" />
      </g>
    </g>
    <text
       id="text4293"
       y="54.163319"
       x="53.897804"
       style="font-style:normal;font-weight:normal;font-size:10.58333397px;line-height:1.25;font-family:sans-serif;letter-spacing:0px;word-spacing:0px;display:inline;fill:#2196f3;fill-opacity:1;stroke:none;stroke-width:0.26458338"
       xml:space="preserve"><tspan
         style="fill:#2196f3;stroke-width:0.26458338"
         y="54.163319"
         x="53.897804"
         id="tspan4291"
         sodipodi:role="line">Monitor</tspan></text>
    <text
       id="text4301"
       y="127.86981"
       x="74.286751"
       style="font-style:normal;font-weight:normal;font-size:6.3499999px;line-height:1.25;font-family:sans-serif;text-align:center;letter-spacing:0px;word-spacing:0px;text-anchor:middle;display:inline;fill:#ffffff;fill-opacity:1;stroke:none;stroke-width:0.26458338"
       xml:space="preserve"><tspan
         id="tspan4303"
         style="font-size:6.3499999px;text-align:center;text-anchor:middle;fill:#ffffff;stroke-width:0.26458338"
         y="127.86981"
         x="75.297539"
         sodipodi:role="line">get requests </tspan><tspan
         id="tspan1546"
         style="font-size:6.3499999px;text-align:center;text-anchor:middle;fill:#ffffff;stroke-width:0.26458338"
         y="135.80731"
         x="74.286751"
         sodipodi:role="line">from access log</tspan></text>
    <g
       id="g5782">
      <g
         transform="translate(-8.001391,106.21609)"
         id="g3549">
        <text
           xml:space="preserve"
           style="font-style:normal;font-weight:normal;font-size:10.58333397px;line-height:1.25;font-family:sans-serif;letter-spacing:0px;word-spacing:0px;fill:#ff9800;fill-opacity:1;stroke:none;stroke-width:0.26458335"
           x="62.362743"
           y="60.481087"
           id="text3541"><tspan
             sodipodi:role="line"
             id="tspan3539"
             x="62.362743"
             y="60.481087"
             style="fill:#ff9800;stroke-width:0.26458335">Monitor</tspan></text>
      </g>
      <g
         id="g5625">
        <rect
           style="fill:none;stroke:#ffffff;stroke-width:0.44560343;stroke-miterlimit:4;stroke-dasharray:none"
           id="rect4124"
           width="58.357143"
           height="58.357143"
           x="45.35622"
           y="170.37396" />
        <rect
           style="fill:none;stroke:#ffffff;stroke-width:0.47397375;stroke-miterlimit:4;stroke-dasharray:none"
           id="rect4126"
           width="56.474205"
           height="48.421841"
           x="46.29768"
           y="179.36674" />
        <rect
           y="171.33366"
           x="46.29768"
           height="7.1909313"
           width="56.474205"
           id="rect4128"
           style="fill:none;stroke:#ffffff;stroke-width:0.44560343;stroke-miterlimit:4;stroke-dasharray:none" />
        <circle
           style="fill:none;stroke:#ffffff;stroke-width:0.44560343;stroke-miterlimit:4;stroke-dasharray:none"
           id="circle4130"
           cx="85.968048"
           cy="174.95915"
           r="2.7987609" />
        <circle
           r="2.7987609"
           cy="174.95915"
           cx="92.601227"
           id="circle4132"
           style="fill:none;stroke:#ffffff;stroke-width:0.44560343;stroke-miterlimit:4;stroke-dasharray:none" />
        <circle
           style="fill:none;stroke:#ffffff;stroke-width:0.44560343;stroke-miterlimit:4;stroke-dasharray:none"
           id="circle4134"
           cx="99.234406"
           cy="174.95915"
           r="2.7987609" />
        <text
           id="text4144"
           y="204.68665"
           x="54.494663"
           style="font-style:normal;font-weight:normal;font-size:4.23333359px;line-height:1.25;font-family:sans-serif;letter-spacing:0px;word-spacing:0px;fill:#ff9800;fill-opacity:1;stroke:none;stroke-width:0.26458335"
           xml:space="preserve"><tspan
             style="font-size:4.23333359px;fill:#ff9800;stroke-width:0.26458335"
             y="204.68665"
             x="54.494663"
             sodipodi:role="line"
             id="tspan1215">send_mem_stats();</tspan><tspan
             style="font-size:4.23333359px;fill:#ff9800;stroke-width:0.26458335"
             y="209.97832"
             x="54.494663"
             sodipodi:role="line"
             id="tspan4157" /><tspan
             style="font-size:4.23333359px;fill:#ff9800;stroke-width:0.26458335"
             y="215.26997"
             x="54.494663"
             sodipodi:role="line"
             id="tspan4159" /></text>
        <g
           style="fill:#ff9800"
           transform="matrix(0.6604521,0,0,0.6604521,58.705945,159.10372)"
           id="g3349">
          <g
             transform="matrix(0.62580385,0,0,0.62580385,3.9409529,47.312916)"
             style="display:inline;fill:#ff9800"
             id="g3319">
            <path
               style="fill:#ff9800"
               id="path3317"
               d="M 25,46.998 C 19.123,46.998 13.599,44.71 9.443,40.555 5.288,36.401 3,30.877 3,24.999 3,19.122 5.288,13.598 9.443,9.443 13.599,5.288 19.123,3 25,3 c 5.877,0 11.401,2.288 15.557,6.443 8.577,8.577 8.577,22.534 0,31.111 C 36.401,44.71 30.877,46.998 25,46.998 Z M 25,5 C 19.657,5 14.635,7.08 10.857,10.857 7.08,14.634 5,19.656 5,24.999 c 0,5.343 2.08,10.365 5.857,14.142 3.777,3.777 8.8,5.857 14.143,5.857 5.343,0 10.365,-2.08 14.143,-5.857 7.798,-7.798 7.798,-20.485 0,-28.283 C 35.365,7.08 30.343,5 25,5 Z"
               inkscape:connector-curvature="0" />
          </g>
          <g
             transform="matrix(0.62580385,0,0,0.62580385,3.9409529,47.312916)"
             style="display:inline;fill:#ff9800"
             id="g3323">
            <path
               style="fill:#ff9800"
               id="path3321"
               d="m 25,49.998 c -6.678,0 -12.956,-2.6 -17.678,-7.321 C 2.6,37.956 0.001,31.677 0,24.999 0,18.321 2.601,12.043 7.322,7.322 12.045,2.601 18.323,0 25,0 c 6.678,0 12.956,2.601 17.678,7.322 9.747,9.747 9.747,25.606 0,35.354 C 37.955,47.398 31.677,49.998 25,49.998 Z M 25,2 C 18.857,2 13.081,4.393 8.736,8.736 4.393,13.08 2,18.855 2,24.999 c 10e-4,6.144 2.393,11.92 6.736,16.264 4.343,4.344 10.12,6.735 16.264,6.735 6.143,0 11.919,-2.392 16.264,-6.735 8.967,-8.968 8.967,-23.56 0,-32.526 C 36.92,4.393 31.144,2 25,2 Z"
               inkscape:connector-curvature="0" />
          </g>
          <g
             transform="matrix(0.62580385,0,0,0.62580385,3.9409529,47.312916)"
             style="display:inline;fill:#ff9800"
             id="g3327">
            <path
               style="fill:#ff9800"
               id="path3325"
               d="m 46.006,49.834 c -0.256,0 -0.512,-0.098 -0.707,-0.293 l -5.508,-5.509 c -0.391,-0.391 -0.391,-1.023 0,-1.414 0.391,-0.391 1.023,-0.391 1.414,0 l 5.508,5.509 c 0.391,0.391 0.391,1.023 0,1.414 -0.195,0.195 -0.451,0.293 -0.707,0.293 z"
               inkscape:connector-curvature="0" />
          </g>
          <g
             transform="matrix(0.62580385,0,0,0.62580385,3.9409529,47.312916)"
             style="display:inline;fill:#ff9800"
             id="g3331">
            <path
               style="fill:#ff9800"
               id="path3329"
               d="m 48.834,47.006 c -0.256,0 -0.512,-0.098 -0.707,-0.293 l -5.514,-5.515 c -0.391,-0.391 -0.391,-1.023 0,-1.414 0.391,-0.391 1.023,-0.391 1.414,0 l 5.514,5.515 c 0.391,0.391 0.391,1.023 0,1.414 -0.195,0.195 -0.451,0.293 -0.707,0.293 z"
               inkscape:connector-curvature="0" />
          </g>
          <g
             transform="matrix(0.62580385,0,0,0.62580385,3.9409529,47.312916)"
             style="display:inline;fill:#ff9800"
             id="g3335">
            <path
               style="fill:#ff9800"
               id="path3333"
               d="m 44.592,51.248 c -0.256,0 -0.512,-0.098 -0.707,-0.293 -0.391,-0.391 -0.391,-1.023 0,-1.414 l 5.656,-5.658 c 0.391,-0.391 1.023,-0.391 1.414,0 0.391,0.391 0.391,1.023 0,1.414 l -5.656,5.658 c -0.195,0.195 -0.451,0.293 -0.707,0.293 z"
               inkscape:connector-curvature="0" />
          </g>
          <g
             transform="matrix(0.62580385,0,0,0.62580385,3.9409529,47.312916)"
             style="display:inline;fill:#ff9800"
             id="g3339">
            <path
               style="fill:#ff9800"
               id="path3337"
               d="m 56.172,62.828 c -0.256,0 -0.512,-0.098 -0.707,-0.293 l -11.58,-11.58 c -0.391,-0.391 -0.391,-1.023 0,-1.414 0.391,-0.391 1.023,-0.391 1.414,0 l 11.58,11.58 c 0.391,0.391 0.391,1.023 0,1.414 -0.195,0.195 -0.451,0.293 -0.707,0.293 z"
               inkscape:connector-curvature="0" />
          </g>
          <g
             transform="matrix(0.62580385,0,0,0.62580385,3.9409529,47.312916)"
             style="display:inline;fill:#ff9800"
             id="g3343">
            <path
               style="fill:#ff9800"
               id="path3341"
               d="m 61.828,57.173 c -0.256,0 -0.512,-0.098 -0.707,-0.293 L 49.541,45.297 c -0.391,-0.391 -0.391,-1.023 0,-1.414 0.391,-0.391 1.023,-0.391 1.414,0 l 11.58,11.583 c 0.391,0.391 0.391,1.023 0,1.414 -0.195,0.195 -0.451,0.293 -0.707,0.293 z"
               inkscape:connector-curvature="0" />
          </g>
          <g
             transform="matrix(0.62580385,0,0,0.62580385,3.9409529,47.312916)"
             style="display:inline;fill:#ff9800"
             id="g3347">
            <path
               style="fill:#ff9800"
               id="path3345"
               d="m 59.001,64 c -1.336,0 -2.592,-0.521 -3.536,-1.465 -0.391,-0.391 -0.391,-1.023 0,-1.414 0.391,-0.391 1.023,-0.391 1.414,0 1.132,1.132 3.109,1.136 4.241,0 C 61.687,60.555 62,59.801 62,58.999 62,58.198 61.688,57.446 61.122,56.881 60.73,56.49 60.73,55.858 61.12,55.467 c 0.391,-0.393 1.025,-0.391 1.414,-0.002 0.945,0.943 1.466,2.198 1.466,3.534 0,1.336 -0.521,2.592 -1.465,3.536 C 61.592,63.479 60.337,64 59.001,64 Z"
               inkscape:connector-curvature="0" />
          </g>
        </g>
      </g>
    </g>
    <path
       sodipodi:nodetypes="cc"
       inkscape:connector-curvature="0"
       id="path2127"
       d="M 172.39515,98.430543 C 138.544,122.73474 116.31865,110.12731 97.405611,91.214276"
       style="display:inline;fill:none;stroke:#ffffff;stroke-width:0.5;stroke-linecap:butt;stroke-linejoin:miter;stroke-miterlimit:4;stroke-dasharray:none;stroke-opacity:1;marker-end:url(#marker2131)" />
    <path
       style="display:inline;fill:none;stroke:#ffffff;stroke-width:0.5;stroke-linecap:butt;stroke-linejoin:miter;stroke-miterlimit:4;stroke-dasharray:none;stroke-opacity:1;marker-end:url(#marker3013)"
       d="m 70.376201,47.663714 c -2.790677,-3.44883 -2.19424,-8.68183 -2.19424,-13.29684"
       id="path3009"
       inkscape:connector-curvature="0"
       sodipodi:nodetypes="cc" />
    <path
       sodipodi:nodetypes="cc"
       inkscape:connector-curvature="0"
       id="path3416"
       d="M 73.647915,158.38956 C 26.086083,130.92973 25.20533,87.294135 55.762899,34.366874"
       style="display:inline;fill:none;stroke:#ffffff;stroke-width:0.5;stroke-linecap:butt;stroke-linejoin:miter;stroke-miterlimit:4;stroke-dasharray:none;stroke-opacity:1;marker-end:url(#marker3420)" />
  </g>
  <g
     inkscape:groupmode="layer"
     id="layer2"
     inkscape:label="conclusion-fig2"
     style="display:inline">
    <g
       id="g5749"
       transform="translate(-1.496292,-1.9746431)">
      <rect
         y="228.25993"
         x="134.16022"
         height="40.645351"
         width="135.99385"
         id="rect5686"
         style="display:inline;fill:none;fill-opacity:1;fill-rule:nonzero;stroke:#ffffff;stroke-width:0.5;stroke-miterlimit:4;stroke-dasharray:none;stroke-dashoffset:0;stroke-opacity:1" />
      <text
         id="text4117"
         y="239.29893"
         x="201.89876"
         style="font-style:normal;font-weight:normal;font-size:10.58333302px;line-height:1.25;font-family:sans-serif;letter-spacing:0px;word-spacing:0px;fill:#000000;fill-opacity:1;stroke:none;stroke-width:0.26458332"
         xml:space="preserve"><tspan
           style="text-align:center;text-anchor:middle;fill:#ffffff;stroke-width:0.26458332"
           y="239.29893"
           x="201.89876"
           id="tspan4115"
           sodipodi:role="line">Vision : <tspan
   id="tspan4146"
   style="fill:#f44336">Locale</tspan></tspan><tspan
           id="tspan4121"
           style="text-align:center;text-anchor:middle;fill:#ffffff;stroke-width:0.26458332"
           y="252.52811"
           x="201.89876"
           sodipodi:role="line">Métriques : <tspan
   id="tspan4150"
   style="fill:#4caf50">Applications</tspan></tspan><tspan
           id="tspan4123"
           style="text-align:center;text-anchor:middle;fill:#ffffff;stroke-width:0.26458332"
           y="265.75726"
           x="201.89876"
           sodipodi:role="line">Décision : <tspan
   id="tspan4148"
   style="fill:#f44336">Locale</tspan></tspan><tspan
           id="tspan4119"
           style="text-align:center;text-anchor:middle;fill:#ffffff;stroke-width:0.26458332"
           y="278.98642"
           x="201.89876"
           sodipodi:role="line" /></text>
    </g>
  </g>
</svg>
