<?xml version="1.0" encoding="UTF-8" standalone="no"?>
<!-- Created with matplotlib (https://matplotlib.org/) -->

<svg
   xmlns:dc="http://purl.org/dc/elements/1.1/"
   xmlns:cc="http://creativecommons.org/ns#"
   xmlns:rdf="http://www.w3.org/1999/02/22-rdf-syntax-ns#"
   xmlns:svg="http://www.w3.org/2000/svg"
   xmlns="http://www.w3.org/2000/svg"
   xmlns:xlink="http://www.w3.org/1999/xlink"
   xmlns:sodipodi="http://sodipodi.sourceforge.net/DTD/sodipodi-0.dtd"
   xmlns:inkscape="http://www.inkscape.org/namespaces/inkscape"
   height="296.26672pt"
   version="1.1"
   viewBox="0 0 383.44159 296.26672"
   width="383.44159pt"
   id="svg4826"
   sodipodi:docname="dummy_memory.svg"
   inkscape:version="0.92.4 (5da689c313, 2019-01-14)">
  <metadata
     id="metadata4830">
    <rdf:RDF>
      <cc:Work
         rdf:about="">
        <dc:format>image/svg+xml</dc:format>
        <dc:type
           rdf:resource="http://purl.org/dc/dcmitype/StillImage" />
        <dc:title />
      </cc:Work>
    </rdf:RDF>
  </metadata>
  <sodipodi:namedview
     pagecolor="#ffffff"
     bordercolor="#666666"
     borderopacity="1"
     objecttolerance="10"
     gridtolerance="10"
     guidetolerance="10"
     inkscape:pageopacity="0"
     inkscape:pageshadow="2"
     inkscape:window-width="1920"
     inkscape:window-height="1005"
     id="namedview4828"
     showgrid="false"
     inkscape:zoom="2.4583334"
     inkscape:cx="301.32021"
     inkscape:cy="92.076395"
     inkscape:window-x="0"
     inkscape:window-y="0"
     inkscape:window-maximized="1"
     inkscape:current-layer="g1160"
     fit-margin-top="0"
     fit-margin-left="0"
     fit-margin-right="0"
     fit-margin-bottom="0"
     inkscape:pagecheckerboard="true"
     showguides="false" />
  <defs
     id="defs4"
     style="stroke-linecap:butt;stroke-linejoin:round">
    <style
       type="text/css"
       id="style2">
*{stroke-linecap:butt;stroke-linejoin:round;}
  </style>
  </defs>
  <g
     inkscape:groupmode="layer"
     id="layer7"
     inkscape:label="phases-fig[1-]"
     style="display:inline;stroke-linecap:butt;stroke-linejoin:round"
     transform="translate(-17.418749,-3.1679382)">
    <text
       xml:space="preserve"
       style="font-style:normal;font-weight:normal;font-size:12px;line-height:1.25;font-family:sans-serif;letter-spacing:0px;word-spacing:0px;fill:#17becf;fill-opacity:1;stroke:none;stroke-width:0.75;stroke-linecap:butt;stroke-linejoin:round"
       x="73.244041"
       y="12.285126"
       id="text1201"><tspan
         sodipodi:role="line"
         id="tspan1199"
         style="font-weight:bold;fill:#17becf;fill-opacity:1;stroke-width:0.75;stroke-linecap:butt;stroke-linejoin:round"
         x="73.244041"
         y="12.285126">high</tspan></text>
    <text
       id="text1205"
       y="12.285126"
       x="129.00497"
       style="font-style:normal;font-weight:normal;font-size:12px;line-height:1.25;font-family:sans-serif;letter-spacing:0px;word-spacing:0px;fill:#17becf;fill-opacity:1;stroke:none;stroke-width:0.75;stroke-linecap:butt;stroke-linejoin:round"
       xml:space="preserve"><tspan
         y="12.285126"
         x="129.00497"
         style="font-weight:bold;fill:#17becf;fill-opacity:1;stroke-width:0.75;stroke-linecap:butt;stroke-linejoin:round"
         id="tspan1203"
         sodipodi:role="line">high</tspan></text>
    <text
       xml:space="preserve"
       style="font-style:normal;font-weight:normal;font-size:12px;line-height:1.25;font-family:sans-serif;letter-spacing:0px;word-spacing:0px;fill:#17becf;fill-opacity:1;stroke:none;stroke-width:0.75;stroke-linecap:butt;stroke-linejoin:round"
       x="184.90498"
       y="12.285126"
       id="text1209"><tspan
         sodipodi:role="line"
         id="tspan1207"
         style="font-weight:bold;fill:#17becf;fill-opacity:1;stroke-width:0.75;stroke-linecap:butt;stroke-linejoin:round"
         x="184.90498"
         y="12.285126">high</tspan></text>
    <text
       id="text1213"
       y="27.285126"
       x="73.244041"
       style="font-style:normal;font-weight:normal;font-size:12px;line-height:1.25;font-family:sans-serif;letter-spacing:0px;word-spacing:0px;fill:#bcbd22;fill-opacity:1;stroke:none;stroke-width:0.75;stroke-linecap:butt;stroke-linejoin:round"
       xml:space="preserve"><tspan
         y="27.285126"
         x="73.244041"
         style="font-weight:bold;fill:#bcbd22;fill-opacity:1;stroke-width:0.75;stroke-linecap:butt;stroke-linejoin:round"
         id="tspan1211"
         sodipodi:role="line">high</tspan></text>
    <text
       xml:space="preserve"
       style="font-style:normal;font-weight:normal;font-size:12px;line-height:1.25;font-family:sans-serif;letter-spacing:0px;word-spacing:0px;fill:#bcbd22;fill-opacity:1;stroke:none;stroke-width:0.75;stroke-linecap:butt;stroke-linejoin:round"
       x="296.46906"
       y="27.285126"
       id="text1217"><tspan
         sodipodi:role="line"
         id="tspan1215"
         style="font-weight:bold;fill:#bcbd22;fill-opacity:1;stroke-width:0.75;stroke-linecap:butt;stroke-linejoin:round"
         x="296.46906"
         y="27.285126">high</tspan></text>
    <text
       id="text1221"
       y="27.285126"
       x="352.39093"
       style="font-style:normal;font-weight:normal;font-size:12px;line-height:1.25;font-family:sans-serif;letter-spacing:0px;word-spacing:0px;fill:#bcbd22;fill-opacity:1;stroke:none;stroke-width:0.75;stroke-linecap:butt;stroke-linejoin:round"
       xml:space="preserve"><tspan
         y="27.285126"
         x="352.39093"
         style="font-weight:bold;fill:#bcbd22;fill-opacity:1;stroke-width:0.75;stroke-linecap:butt;stroke-linejoin:round"
         id="tspan1219"
         sodipodi:role="line">high</tspan></text>
    <text
       xml:space="preserve"
       style="font-style:normal;font-weight:normal;font-size:12px;line-height:1.25;font-family:sans-serif;letter-spacing:0px;word-spacing:0px;fill:#17becf;fill-opacity:1;stroke:none;stroke-width:0.75;stroke-linecap:butt;stroke-linejoin:round"
       x="245.21982"
       y="13.448212"
       id="text1225"><tspan
         sodipodi:role="line"
         id="tspan1223"
         style="fill:#17becf;fill-opacity:1;stroke-width:0.75;stroke-linecap:butt;stroke-linejoin:round"
         x="245.21982"
         y="13.448212">low</tspan></text>
    <text
       id="text1229"
       y="13.448212"
       x="286.71613"
       style="font-style:normal;font-weight:normal;font-size:12px;line-height:1.25;font-family:sans-serif;letter-spacing:0px;word-spacing:0px;fill:#17becf;fill-opacity:1;stroke:none;stroke-width:0.75;stroke-linecap:butt;stroke-linejoin:round"
       xml:space="preserve"><tspan
         y="13.448212"
         x="286.71613"
         style="fill:#17becf;fill-opacity:1;stroke-width:0.75;stroke-linecap:butt;stroke-linejoin:round"
         id="tspan1227"
         sodipodi:role="line">medium</tspan></text>
    <text
       xml:space="preserve"
       style="font-style:normal;font-weight:normal;font-size:12px;line-height:1.25;font-family:sans-serif;letter-spacing:0px;word-spacing:0px;fill:#17becf;fill-opacity:1;stroke:none;stroke-width:0.75;stroke-linecap:butt;stroke-linejoin:round"
       x="343.28839"
       y="12.285126"
       id="text1233"><tspan
         sodipodi:role="line"
         id="tspan1231"
         style="fill:#17becf;fill-opacity:1;stroke-width:0.75;stroke-linecap:butt;stroke-linejoin:round"
         x="343.28839"
         y="12.285126">stopped</tspan></text>
    <text
       id="text1237"
       y="28.448212"
       x="133.39951"
       style="font-style:normal;font-weight:normal;font-size:12px;line-height:1.25;font-family:sans-serif;letter-spacing:0px;word-spacing:0px;fill:#bcbd22;fill-opacity:1;stroke:none;stroke-width:0.75;stroke-linecap:butt;stroke-linejoin:round"
       xml:space="preserve"><tspan
         y="28.448212"
         x="133.39951"
         style="fill:#bcbd22;fill-opacity:1;stroke-width:0.75;stroke-linecap:butt;stroke-linejoin:round"
         id="tspan1235"
         sodipodi:role="line">low</tspan></text>
    <text
       xml:space="preserve"
       style="font-style:normal;font-weight:normal;font-size:12px;line-height:1.25;font-family:sans-serif;letter-spacing:0px;word-spacing:0px;fill:#bcbd22;fill-opacity:1;stroke:none;stroke-width:0.75;stroke-linecap:butt;stroke-linejoin:round"
       x="245.21982"
       y="28.448212"
       id="text1249"><tspan
         sodipodi:role="line"
         id="tspan1247"
         style="fill:#bcbd22;fill-opacity:1;stroke-width:0.75;stroke-linecap:butt;stroke-linejoin:round"
         x="245.21982"
         y="28.448212">low</tspan></text>
    <text
       xml:space="preserve"
       style="font-style:normal;font-weight:normal;font-size:12px;line-height:1.25;font-family:sans-serif;letter-spacing:0px;word-spacing:0px;fill:#bcbd22;fill-opacity:1;stroke:none;stroke-width:0.75;stroke-linecap:butt;stroke-linejoin:round"
       x="175.15205"
       y="28.448212"
       id="text1253"><tspan
         sodipodi:role="line"
         id="tspan1251"
         style="fill:#bcbd22;fill-opacity:1;stroke-width:0.75;stroke-linecap:butt;stroke-linejoin:round"
         x="175.15205"
         y="28.448212">medium</tspan></text>
    <text
       id="text1226"
       y="13.395477"
       x="33.733593"
       style="font-style:normal;font-weight:normal;font-size:12px;line-height:1.25;font-family:sans-serif;letter-spacing:0px;word-spacing:0px;display:inline;fill:#17becf;fill-opacity:1;stroke:none;stroke-width:0.75;stroke-linecap:butt;stroke-linejoin:round"
       xml:space="preserve"><tspan
         y="13.395477"
         x="33.733593"
         style="font-weight:normal;fill:#17becf;fill-opacity:1;stroke-width:0.75;stroke-linecap:butt;stroke-linejoin:round"
         id="tspan1224"
         sodipodi:role="line">A:</tspan></text>
    <text
       xml:space="preserve"
       style="font-style:normal;font-weight:normal;font-size:12px;line-height:1.25;font-family:sans-serif;letter-spacing:0px;word-spacing:0px;display:inline;fill:#17becf;fill-opacity:1;stroke:none;stroke-width:0.75;stroke-linecap:butt;stroke-linejoin:round"
       x="33.074413"
       y="28.395477"
       id="text1230"><tspan
         sodipodi:role="line"
         id="tspan1228"
         style="font-weight:normal;fill:#bcbd22;fill-opacity:1;stroke-width:0.75;stroke-linecap:butt;stroke-linejoin:round"
         x="33.074413"
         y="28.395477">B:</tspan></text>
    <text
       xml:space="preserve"
       style="font-style:normal;font-weight:normal;font-size:30px;line-height:1.25;font-family:sans-serif;font-variant-ligatures:normal;font-variant-caps:normal;font-variant-numeric:normal;font-feature-settings:normal;text-align:start;letter-spacing:0px;word-spacing:0px;writing-mode:lr-tb;text-anchor:start;display:inline;fill:#ffffff;fill-opacity:1;stroke:none;stroke-width:0.75;stroke-linecap:butt;stroke-linejoin:round"
       x="81.900002"
       y="70.865135"
       id="text1227"><tspan
         sodipodi:role="line"
         id="tspan1225"
         style="font-style:normal;font-variant:normal;font-weight:normal;font-stretch:normal;font-size:10px;font-family:sans-serif;-inkscape-font-specification:'sans-serif, Normal';font-variant-ligatures:normal;font-variant-caps:normal;font-variant-numeric:normal;font-feature-settings:normal;text-align:start;writing-mode:lr-tb;text-anchor:start;fill:#ffffff;stroke-width:0.75;stroke-linecap:butt;stroke-linejoin:round"
         x="81.900002"
         y="70.865135">φ1</tspan></text>
    <text
       id="text1222"
       y="70.865433"
       x="137.7"
       style="font-style:normal;font-weight:normal;font-size:30px;line-height:1.25;font-family:sans-serif;font-variant-ligatures:normal;font-variant-caps:normal;font-variant-numeric:normal;font-feature-settings:normal;text-align:start;letter-spacing:0px;word-spacing:0px;writing-mode:lr-tb;text-anchor:start;display:inline;fill:#ffffff;fill-opacity:1;stroke:none;stroke-width:0.75;stroke-linecap:butt;stroke-linejoin:round"
       xml:space="preserve"><tspan
         y="70.865433"
         x="137.7"
         style="font-style:normal;font-variant:normal;font-weight:normal;font-stretch:normal;font-size:10px;font-family:sans-serif;-inkscape-font-specification:'sans-serif, Normal';font-variant-ligatures:normal;font-variant-caps:normal;font-variant-numeric:normal;font-feature-settings:normal;text-align:start;writing-mode:lr-tb;text-anchor:start;fill:#ffffff;stroke-width:0.75;stroke-linecap:butt;stroke-linejoin:round"
         id="tspan1220"
         sodipodi:role="line">φ2</tspan></text>
    <text
       xml:space="preserve"
       style="font-style:normal;font-weight:normal;font-size:30px;line-height:1.25;font-family:sans-serif;font-variant-ligatures:normal;font-variant-caps:normal;font-variant-numeric:normal;font-feature-settings:normal;text-align:start;letter-spacing:0px;word-spacing:0px;writing-mode:lr-tb;text-anchor:start;display:inline;fill:#ffffff;fill-opacity:1;stroke:none;stroke-width:0.75;stroke-linecap:butt;stroke-linejoin:round"
       x="193.49991"
       y="70.865433"
       id="text1228"><tspan
         sodipodi:role="line"
         id="tspan1226"
         style="font-style:normal;font-variant:normal;font-weight:normal;font-stretch:normal;font-size:10px;font-family:sans-serif;-inkscape-font-specification:'sans-serif, Normal';font-variant-ligatures:normal;font-variant-caps:normal;font-variant-numeric:normal;font-feature-settings:normal;text-align:start;writing-mode:lr-tb;text-anchor:start;fill:#ffffff;stroke-width:0.75;stroke-linecap:butt;stroke-linejoin:round"
         x="193.49991"
         y="70.865433">φ3</tspan></text>
    <text
       id="text1236"
       y="70.865433"
       x="249.30057"
       style="font-style:normal;font-weight:normal;font-size:30px;line-height:1.25;font-family:sans-serif;font-variant-ligatures:normal;font-variant-caps:normal;font-variant-numeric:normal;font-feature-settings:normal;text-align:start;letter-spacing:0px;word-spacing:0px;writing-mode:lr-tb;text-anchor:start;display:inline;fill:#ffffff;fill-opacity:1;stroke:none;stroke-width:0.75;stroke-linecap:butt;stroke-linejoin:round"
       xml:space="preserve"><tspan
         y="70.865433"
         x="249.30057"
         style="font-style:normal;font-variant:normal;font-weight:normal;font-stretch:normal;font-size:10px;font-family:sans-serif;-inkscape-font-specification:'sans-serif, Normal';font-variant-ligatures:normal;font-variant-caps:normal;font-variant-numeric:normal;font-feature-settings:normal;text-align:start;writing-mode:lr-tb;text-anchor:start;fill:#ffffff;stroke-width:0.75;stroke-linecap:butt;stroke-linejoin:round"
         id="tspan1234"
         sodipodi:role="line">φ4</tspan></text>
    <text
       xml:space="preserve"
       style="font-style:normal;font-weight:normal;font-size:30px;line-height:1.25;font-family:sans-serif;font-variant-ligatures:normal;font-variant-caps:normal;font-variant-numeric:normal;font-feature-settings:normal;text-align:start;letter-spacing:0px;word-spacing:0px;writing-mode:lr-tb;text-anchor:start;display:inline;fill:#ffffff;fill-opacity:1;stroke:none;stroke-width:0.75;stroke-linecap:butt;stroke-linejoin:round"
       x="305.10059"
       y="70.865433"
       id="text1242"><tspan
         sodipodi:role="line"
         id="tspan1240"
         style="font-style:normal;font-variant:normal;font-weight:normal;font-stretch:normal;font-size:10px;font-family:sans-serif;-inkscape-font-specification:'sans-serif, Normal';font-variant-ligatures:normal;font-variant-caps:normal;font-variant-numeric:normal;font-feature-settings:normal;text-align:start;writing-mode:lr-tb;text-anchor:start;fill:#ffffff;stroke-width:0.75;stroke-linecap:butt;stroke-linejoin:round"
         x="305.10059"
         y="70.865433">φ5</tspan></text>
    <text
       id="text1250"
       y="70.865433"
       x="360.90039"
       style="font-style:normal;font-weight:normal;font-size:30px;line-height:1.25;font-family:sans-serif;font-variant-ligatures:normal;font-variant-caps:normal;font-variant-numeric:normal;font-feature-settings:normal;text-align:start;letter-spacing:0px;word-spacing:0px;writing-mode:lr-tb;text-anchor:start;display:inline;fill:#ffffff;fill-opacity:1;stroke:none;stroke-width:0.75;stroke-linecap:butt;stroke-linejoin:round"
       xml:space="preserve"><tspan
         y="70.865433"
         x="360.90039"
         style="font-style:normal;font-variant:normal;font-weight:normal;font-stretch:normal;font-size:10px;font-family:sans-serif;-inkscape-font-specification:'sans-serif, Normal';font-variant-ligatures:normal;font-variant-caps:normal;font-variant-numeric:normal;font-feature-settings:normal;text-align:start;writing-mode:lr-tb;text-anchor:start;fill:#ffffff;stroke-width:0.75;stroke-linecap:butt;stroke-linejoin:round"
         sodipodi:role="line"
         id="tspan1252">φ6</tspan></text>
  </g>
  <g
     inkscape:groupmode="layer"
     id="layer8"
     inkscape:label="ref-fig[3-]"
     style="display:inline;stroke-linecap:butt;stroke-linejoin:round"
     sodipodi:insensitive="true"
     transform="translate(-17.418749,-3.1679382)">
    <path
       clip-path="url(#p92c7f562a0)"
       d="M 54,49.056 H 388.8"
       style="display:inline;fill:none;stroke:#ffffff;stroke-width:1.5;stroke-linecap:butt;stroke-linejoin:round;stroke-dasharray:5.55, 2.4;stroke-dashoffset:0"
       id="path4680"
       inkscape:connector-curvature="0" />
  </g>
  <g
     inkscape:groupmode="layer"
     id="layer9"
     inkscape:label="containers-fig4"
     style="display:inline;stroke-linecap:butt;stroke-linejoin:round"
     sodipodi:insensitive="true"
     transform="translate(-17.418749,-3.1679382)">
    <path
       style="display:inline;fill:none;stroke:#17becf;stroke-width:1.5;stroke-linecap:butt;stroke-linejoin:miter;stroke-miterlimit:4;stroke-dasharray:none;stroke-opacity:1"
       d="m 53.999999,128.44068 12.050848,-12.05085 6.593789,11.42078 10.498241,-10.49824 8.992718,8.99271 17.111725,-9.87946 11.70235,6.75635 25.33166,-6.7876 12.18115,7.03279 16.60097,-9.58456 9.15714,9.15715 15.78922,-9.11591 13.4978,7.79295 h 11.33985 v 74.4927 l 10.48308,-6.05241 6.9372,6.93721 3.2429,5.61685 10.00398,-10.00398 6.47792,11.22009 12.74396,-12.74396 9.90756,9.90756 v -48.20339 l 9.33902,-5.39189 7.87985,4.54944 6.5855,-3.80214 14.32399,3.8381 h 10.53266"
       id="path3336"
       inkscape:connector-curvature="0" />
    <path
       style="display:inline;fill:none;stroke:#bcbd22;stroke-width:1.5;stroke-linecap:butt;stroke-linejoin:miter;stroke-miterlimit:4;stroke-dasharray:none;stroke-opacity:1"
       d="m 53.999999,128.44068 11.29175,-19.55788 12.148631,21.04204 12.265238,-21.24401 11.870652,20.56057 10.09011,-17.47656 h 4.41837 v 83.47234 l 17.39162,-10.04106 8.71737,8.71738 10.75705,-10.75706 9.92346,9.92346 h 5.39319 v -37.32085 l 4.48098,-7.76128 3.56763,6.17931 3.2583,-5.64353 5.40189,5.4019 9.29529,-5.36664 9.37255,5.41124 11.54335,-6.66455 h 12.62079 v 55.68787 l 13.15938,-13.15938 12.94365,12.94365 10.13919,-10.13919 10.67851,10.67852 h 6.57969 v -81.43713 l 11.54142,-11.54143 9.59987,9.59988 9.16842,-9.16842 7.87406,7.87405 8.41337,-8.41337 7.87405,7.87405 h 3.99096 V 76.155607 l 5.20816,-1.395521 h 43.60308"
       id="path1147"
       inkscape:connector-curvature="0"
       sodipodi:nodetypes="ccccccccccccccccccccccccccccccccccccccc" />
  </g>
  <g
     inkscape:groupmode="layer"
     id="layer6"
     inkscape:label="axes-fig[2-]"
     style="display:inline;stroke-linecap:butt;stroke-linejoin:round"
     transform="translate(-17.418749,-3.1679382)">
    <g
       id="figure_1"
       style="stroke-linecap:butt;stroke-linejoin:round">
      <g
         id="axes_1"
         style="stroke-linecap:butt;stroke-linejoin:round">
        <g
           id="matplotlib.axis_1"
           style="stroke-linecap:butt;stroke-linejoin:round">
          <g
             id="xtick_1"
             style="stroke-linecap:butt;stroke-linejoin:round">
            <g
               id="line2d_1"
               style="stroke-linecap:butt;stroke-linejoin:round">
              <path
                 clip-path="url(#p92c7f562a0)"
                 d="M 54,252 V 34.56"
                 style="fill:none;stroke:#b0b0b0;stroke-width:0.80000001;stroke-linecap:square;stroke-linejoin:round"
                 id="path12"
                 inkscape:connector-curvature="0" />
            </g>
            <g
               id="line2d_2"
               style="stroke-linecap:butt;stroke-linejoin:round">
              <defs
                 id="defs16">
                <path
                   d="M 0,0 V 3.5"
                   id="meddbf9c386"
                   style="stroke:#ffffff;stroke-width:0.80000001;stroke-linecap:butt;stroke-linejoin:round"
                   inkscape:connector-curvature="0" />
              </defs>
              <g
                 id="g20"
                 style="stroke-linecap:butt;stroke-linejoin:round">
                <use
                   style="stroke:#ffffff;stroke-width:0.80000001;stroke-linecap:butt;stroke-linejoin:round"
                   x="54"
                   xlink:href="#meddbf9c386"
                   y="252"
                   id="use18"
                   width="100%"
                   height="100%" />
              </g>
            </g>
            <g
               id="text_1"
               style="fill:#ffffff;stroke-linecap:butt;stroke-linejoin:round">
              <!-- 0 -->
              <defs
                 id="defs24">
                <path
                   d="m 31.78125,66.40625 q -7.609375,0 -11.453125,-7.5 Q 16.5,51.421875 16.5,36.375 q 0,-14.984375 3.828125,-22.484375 3.84375,-7.5 11.453125,-7.5 7.671875,0 11.5,7.5 3.84375,7.5 3.84375,22.484375 0,15.046875 -3.84375,22.53125 -3.828125,7.5 -11.5,7.5 z m 0,7.8125 q 12.265625,0 18.734375,-9.703125 6.46875,-9.6875 6.46875,-28.140625 0,-18.40625 -6.46875,-28.109375 -6.46875,-9.6875 -18.734375,-9.6875 -12.25,0 -18.71875,9.6875 Q 6.59375,17.96875 6.59375,36.375 q 0,18.453125 6.46875,28.140625 6.46875,9.703125 18.71875,9.703125 z"
                   id="DejaVuSans-48"
                   inkscape:connector-curvature="0"
                   style="stroke-linecap:butt;stroke-linejoin:round" />
              </defs>
              <g
                 transform="matrix(0.1,0,0,-0.1,50.81875,266.59844)"
                 id="g28"
                 style="stroke-linecap:butt;stroke-linejoin:round">
                <use
                   xlink:href="#DejaVuSans-48"
                   id="use26"
                   style="stroke-linecap:butt;stroke-linejoin:round"
                   x="0"
                   y="0"
                   width="100%"
                   height="100%" />
              </g>
            </g>
          </g>
          <g
             id="xtick_2"
             style="stroke-linecap:butt;stroke-linejoin:round">
            <g
               id="line2d_3"
               style="stroke-linecap:butt;stroke-linejoin:round">
              <path
                 clip-path="url(#p92c7f562a0)"
                 d="M 109.8,252 V 34.56"
                 style="fill:none;stroke:#b0b0b0;stroke-width:0.80000001;stroke-linecap:square;stroke-linejoin:round"
                 id="path32"
                 inkscape:connector-curvature="0" />
            </g>
            <g
               id="line2d_4"
               style="stroke-linecap:butt;stroke-linejoin:round">
              <g
                 id="g37"
                 style="stroke-linecap:butt;stroke-linejoin:round">
                <use
                   style="stroke:#ffffff;stroke-width:0.80000001;stroke-linecap:butt;stroke-linejoin:round"
                   x="109.8"
                   xlink:href="#meddbf9c386"
                   y="252"
                   id="use35"
                   width="100%"
                   height="100%" />
              </g>
            </g>
            <g
               id="text_2"
               style="fill:#ffffff;stroke-linecap:butt;stroke-linejoin:round">
              <!-- 180 -->
              <defs
                 id="defs42">
                <path
                   d="m 12.40625,8.296875 h 16.109375 v 55.625 L 10.984375,60.40625 v 8.984375 l 17.4375,3.515625 H 38.28125 V 8.296875 H 54.390625 V 0 H 12.40625 Z"
                   id="DejaVuSans-49"
                   inkscape:connector-curvature="0"
                   style="stroke-linecap:butt;stroke-linejoin:round" />
                <path
                   d="m 31.78125,34.625 q -7.03125,0 -11.0625,-3.765625 -4.015625,-3.765625 -4.015625,-10.34375 0,-6.59375 4.015625,-10.359375 4.03125,-3.765625 11.0625,-3.765625 7.03125,0 11.078125,3.78125 4.0625,3.796875 4.0625,10.34375 0,6.578125 -4.03125,10.34375 Q 38.875,34.625 31.78125,34.625 Z m -9.859375,4.1875 Q 15.578125,40.375 12.03125,44.71875 8.5,49.078125 8.5,55.328125 q 0,8.734375 6.21875,13.8125 6.234375,5.078125 17.0625,5.078125 10.890625,0 17.09375,-5.078125 6.203125,-5.078125 6.203125,-13.8125 0,-6.25 -3.546875,-10.609375 Q 48,40.375 41.703125,38.8125 q 7.125,-1.65625 11.09375,-6.5 3.984375,-4.828125 3.984375,-11.796875 0,-10.609375 -6.46875,-16.28125 -6.46875,-5.65625 -18.53125,-5.65625 -12.046875,0 -18.53125,5.65625 -6.46875,5.671875 -6.46875,16.28125 0,6.96875 4,11.796875 4.015625,4.84375 11.140625,6.5 z M 18.3125,54.390625 q 0,-5.65625 3.53125,-8.828125 3.546875,-3.171875 9.9375,-3.171875 6.359375,0 9.9375,3.171875 3.59375,3.171875 3.59375,8.828125 0,5.671875 -3.59375,8.84375 -3.578125,3.171875 -9.9375,3.171875 -6.390625,0 -9.9375,-3.171875 Q 18.3125,60.0625 18.3125,54.390625 Z"
                   id="DejaVuSans-56"
                   inkscape:connector-curvature="0"
                   style="stroke-linecap:butt;stroke-linejoin:round" />
              </defs>
              <g
                 transform="matrix(0.1,0,0,-0.1,100.25625,266.59844)"
                 id="g50"
                 style="stroke-linecap:butt;stroke-linejoin:round">
                <use
                   xlink:href="#DejaVuSans-49"
                   id="use44"
                   style="stroke-linecap:butt;stroke-linejoin:round"
                   x="0"
                   y="0"
                   width="100%"
                   height="100%" />
                <use
                   x="63.623047"
                   xlink:href="#DejaVuSans-56"
                   id="use46"
                   style="stroke-linecap:butt;stroke-linejoin:round"
                   y="0"
                   width="100%"
                   height="100%" />
                <use
                   x="127.24609"
                   xlink:href="#DejaVuSans-48"
                   id="use48"
                   style="stroke-linecap:butt;stroke-linejoin:round"
                   y="0"
                   width="100%"
                   height="100%" />
              </g>
            </g>
          </g>
          <g
             id="xtick_3"
             style="stroke-linecap:butt;stroke-linejoin:round">
            <g
               id="line2d_5"
               style="stroke-linecap:butt;stroke-linejoin:round">
              <path
                 clip-path="url(#p92c7f562a0)"
                 d="M 165.6,252 V 34.56"
                 style="fill:none;stroke:#b0b0b0;stroke-width:0.80000001;stroke-linecap:square;stroke-linejoin:round"
                 id="path54"
                 inkscape:connector-curvature="0" />
            </g>
            <g
               id="line2d_6"
               style="stroke-linecap:butt;stroke-linejoin:round">
              <g
                 id="g59"
                 style="stroke-linecap:butt;stroke-linejoin:round">
                <use
                   style="stroke:#ffffff;stroke-width:0.80000001;stroke-linecap:butt;stroke-linejoin:round"
                   x="165.60001"
                   xlink:href="#meddbf9c386"
                   y="252"
                   id="use57"
                   width="100%"
                   height="100%" />
              </g>
            </g>
            <g
               id="text_3"
               style="fill:#ffffff;stroke-linecap:butt;stroke-linejoin:round">
              <!-- 360 -->
              <defs
                 id="defs64">
                <path
                   d="M 40.578125,39.3125 Q 47.65625,37.796875 51.625,33 q 3.984375,-4.78125 3.984375,-11.8125 0,-10.78125 -7.421875,-16.703125 -7.421875,-5.90625 -21.09375,-5.90625 -4.578125,0 -9.4375,0.90625 -4.859375,0.90625 -10.03125,2.71875 v 9.515625 q 4.09375,-2.390625 8.96875,-3.609375 4.890625,-1.21875 10.21875,-1.21875 9.265625,0 14.125,3.65625 4.859375,3.65625 4.859375,10.640625 0,6.453125 -4.515625,10.078125 -4.515625,3.640625 -12.5625,3.640625 h -8.5 v 8.109375 h 8.890625 q 7.265625,0 11.125,2.90625 3.859375,2.90625 3.859375,8.375 0,5.609375 -3.984375,8.609375 -3.96875,3.015625 -11.390625,3.015625 -4.0625,0 -8.703125,-0.890625 Q 15.375,64.15625 9.8125,62.3125 v 8.78125 q 5.625,1.5625 10.53125,2.34375 4.90625,0.78125 9.25,0.78125 11.234375,0 17.765625,-5.109375 6.546875,-5.09375 6.546875,-13.78125 0,-6.0625 -3.46875,-10.234375 -3.46875,-4.171875 -9.859375,-5.78125 z"
                   id="DejaVuSans-51"
                   inkscape:connector-curvature="0"
                   style="stroke-linecap:butt;stroke-linejoin:round" />
                <path
                   d="m 33.015625,40.375 q -6.640625,0 -10.53125,-4.546875 -3.875,-4.53125 -3.875,-12.4375 0,-7.859375 3.875,-12.4375 3.890625,-4.5625 10.53125,-4.5625 6.640625,0 10.515625,4.5625 3.875,4.578125 3.875,12.4375 0,7.90625 -3.875,12.4375 Q 39.65625,40.375 33.015625,40.375 Z M 52.59375,71.296875 V 62.3125 q -3.71875,1.75 -7.5,2.671875 -3.78125,0.9375 -7.5,0.9375 -9.765625,0 -14.921875,-6.59375 -5.140625,-6.59375 -5.875,-19.921875 2.875,4.25 7.21875,6.515625 4.359375,2.265625 9.578125,2.265625 10.984375,0 17.359375,-6.671875 6.375,-6.65625 6.375,-18.125 0,-11.234375 -6.640625,-18.03125 -6.640625,-6.78125 -17.671875,-6.78125 -12.65625,0 -19.34375,9.6875 -6.6875,9.703125 -6.6875,28.109375 0,17.28125 8.203125,27.5625 8.203125,10.28125 22.015625,10.28125 3.71875,0 7.5,-0.734375 3.78125,-0.734375 7.890625,-2.1875 z"
                   id="DejaVuSans-54"
                   inkscape:connector-curvature="0"
                   style="stroke-linecap:butt;stroke-linejoin:round" />
              </defs>
              <g
                 transform="matrix(0.1,0,0,-0.1,156.05625,266.59844)"
                 id="g72"
                 style="stroke-linecap:butt;stroke-linejoin:round">
                <use
                   xlink:href="#DejaVuSans-51"
                   id="use66"
                   style="stroke-linecap:butt;stroke-linejoin:round"
                   x="0"
                   y="0"
                   width="100%"
                   height="100%" />
                <use
                   x="63.623047"
                   xlink:href="#DejaVuSans-54"
                   id="use68"
                   style="stroke-linecap:butt;stroke-linejoin:round"
                   y="0"
                   width="100%"
                   height="100%" />
                <use
                   x="127.24609"
                   xlink:href="#DejaVuSans-48"
                   id="use70"
                   style="stroke-linecap:butt;stroke-linejoin:round"
                   y="0"
                   width="100%"
                   height="100%" />
              </g>
            </g>
          </g>
          <g
             id="xtick_4"
             style="stroke-linecap:butt;stroke-linejoin:round">
            <g
               id="line2d_7"
               style="stroke-linecap:butt;stroke-linejoin:round">
              <path
                 clip-path="url(#p92c7f562a0)"
                 d="M 221.4,252 V 34.56"
                 style="fill:none;stroke:#b0b0b0;stroke-width:0.80000001;stroke-linecap:square;stroke-linejoin:round"
                 id="path76"
                 inkscape:connector-curvature="0" />
            </g>
            <g
               id="line2d_8"
               style="stroke-linecap:butt;stroke-linejoin:round">
              <g
                 id="g81"
                 style="stroke-linecap:butt;stroke-linejoin:round">
                <use
                   style="stroke:#ffffff;stroke-width:0.80000001;stroke-linecap:butt;stroke-linejoin:round"
                   x="221.39999"
                   xlink:href="#meddbf9c386"
                   y="252"
                   id="use79"
                   width="100%"
                   height="100%" />
              </g>
            </g>
            <g
               id="text_4"
               style="fill:#ffffff;stroke-linecap:butt;stroke-linejoin:round">
              <!-- 540 -->
              <defs
                 id="defs86">
                <path
                   d="m 10.796875,72.90625 h 38.71875 v -8.3125 h -29.6875 V 46.734375 q 2.140625,0.734375 4.28125,1.09375 2.15625,0.359375 4.3125,0.359375 Q 40.625,48.1875 47.75,41.5 54.890625,34.8125 54.890625,23.390625 54.890625,11.625 47.5625,5.09375 40.234375,-1.421875 26.90625,-1.421875 q -4.59375,0 -9.359375,0.78125 -4.75,0.78125 -9.828125,2.34375 V 11.625 q 4.390625,-2.390625 9.078125,-3.5625 4.6875,-1.171875 9.90625,-1.171875 8.453125,0 13.375,4.4375 4.9375,4.4375 4.9375,12.0625 0,7.609375 -4.9375,12.046875 -4.921875,4.453125 -13.375,4.453125 -3.953125,0 -7.890625,-0.875 -3.921875,-0.875 -8.015625,-2.734375 z"
                   id="DejaVuSans-53"
                   inkscape:connector-curvature="0"
                   style="stroke-linecap:butt;stroke-linejoin:round" />
                <path
                   d="M 37.796875,64.3125 12.890625,25.390625 h 24.90625 z m -2.59375,8.59375 h 12.40625 V 25.390625 h 10.40625 V 17.1875 H 47.609375 V 0 h -9.8125 V 17.1875 H 4.890625 v 9.515625 z"
                   id="DejaVuSans-52"
                   inkscape:connector-curvature="0"
                   style="stroke-linecap:butt;stroke-linejoin:round" />
              </defs>
              <g
                 transform="matrix(0.1,0,0,-0.1,211.85625,266.59844)"
                 id="g94"
                 style="stroke-linecap:butt;stroke-linejoin:round">
                <use
                   xlink:href="#DejaVuSans-53"
                   id="use88"
                   style="stroke-linecap:butt;stroke-linejoin:round"
                   x="0"
                   y="0"
                   width="100%"
                   height="100%" />
                <use
                   x="63.623047"
                   xlink:href="#DejaVuSans-52"
                   id="use90"
                   style="stroke-linecap:butt;stroke-linejoin:round"
                   y="0"
                   width="100%"
                   height="100%" />
                <use
                   x="127.24609"
                   xlink:href="#DejaVuSans-48"
                   id="use92"
                   style="stroke-linecap:butt;stroke-linejoin:round"
                   y="0"
                   width="100%"
                   height="100%" />
              </g>
            </g>
          </g>
          <g
             id="xtick_5"
             style="stroke-linecap:butt;stroke-linejoin:round">
            <g
               id="line2d_9"
               style="stroke-linecap:butt;stroke-linejoin:round">
              <path
                 clip-path="url(#p92c7f562a0)"
                 d="M 277.2,252 V 34.56"
                 style="fill:none;stroke:#b0b0b0;stroke-width:0.80000001;stroke-linecap:square;stroke-linejoin:round"
                 id="path98"
                 inkscape:connector-curvature="0" />
            </g>
            <g
               id="line2d_10"
               style="stroke-linecap:butt;stroke-linejoin:round">
              <g
                 id="g103"
                 style="stroke-linecap:butt;stroke-linejoin:round">
                <use
                   style="stroke:#ffffff;stroke-width:0.80000001;stroke-linecap:butt;stroke-linejoin:round"
                   x="277.20001"
                   xlink:href="#meddbf9c386"
                   y="252"
                   id="use101"
                   width="100%"
                   height="100%" />
              </g>
            </g>
            <g
               id="text_5"
               style="fill:#ffffff;stroke-linecap:butt;stroke-linejoin:round">
              <!-- 720 -->
              <defs
                 id="defs108">
                <path
                   d="m 8.203125,72.90625 h 46.875 V 68.703125 L 28.609375,0 H 18.3125 L 43.21875,64.59375 H 8.203125 Z"
                   id="DejaVuSans-55"
                   inkscape:connector-curvature="0"
                   style="stroke-linecap:butt;stroke-linejoin:round" />
                <path
                   d="M 19.1875,8.296875 H 53.609375 V 0 H 7.328125 v 8.296875 q 5.609375,5.8125 15.296875,15.59375 9.703125,9.796875 12.1875,12.640625 4.734375,5.3125 6.609375,9 1.890625,3.6875 1.890625,7.25 0,5.8125 -4.078125,9.46875 -4.078125,3.671875 -10.625,3.671875 -4.640625,0 -9.796875,-1.609375 -5.140625,-1.609375 -11,-4.890625 v 9.96875 Q 13.765625,71.78125 18.9375,73 q 5.1875,1.21875 9.484375,1.21875 11.328125,0 18.0625,-5.671875 6.734375,-5.65625 6.734375,-15.125 0,-4.5 -1.6875,-8.53125 Q 49.859375,40.875 45.40625,35.40625 44.1875,33.984375 37.640625,27.21875 31.109375,20.453125 19.1875,8.296875 Z"
                   id="DejaVuSans-50"
                   inkscape:connector-curvature="0"
                   style="stroke-linecap:butt;stroke-linejoin:round" />
              </defs>
              <g
                 transform="matrix(0.1,0,0,-0.1,267.65625,266.59844)"
                 id="g116"
                 style="stroke-linecap:butt;stroke-linejoin:round">
                <use
                   xlink:href="#DejaVuSans-55"
                   id="use110"
                   style="stroke-linecap:butt;stroke-linejoin:round"
                   x="0"
                   y="0"
                   width="100%"
                   height="100%" />
                <use
                   x="63.623047"
                   xlink:href="#DejaVuSans-50"
                   id="use112"
                   style="stroke-linecap:butt;stroke-linejoin:round"
                   y="0"
                   width="100%"
                   height="100%" />
                <use
                   x="127.24609"
                   xlink:href="#DejaVuSans-48"
                   id="use114"
                   style="stroke-linecap:butt;stroke-linejoin:round"
                   y="0"
                   width="100%"
                   height="100%" />
              </g>
            </g>
          </g>
          <g
             id="xtick_6"
             style="stroke-linecap:butt;stroke-linejoin:round">
            <g
               id="line2d_11"
               style="stroke-linecap:butt;stroke-linejoin:round">
              <path
                 clip-path="url(#p92c7f562a0)"
                 d="M 333,252 V 34.56"
                 style="fill:none;stroke:#b0b0b0;stroke-width:0.80000001;stroke-linecap:square;stroke-linejoin:round"
                 id="path120"
                 inkscape:connector-curvature="0" />
            </g>
            <g
               id="line2d_12"
               style="stroke-linecap:butt;stroke-linejoin:round">
              <g
                 id="g125"
                 style="stroke-linecap:butt;stroke-linejoin:round">
                <use
                   style="stroke:#ffffff;stroke-width:0.80000001;stroke-linecap:butt;stroke-linejoin:round"
                   x="333"
                   xlink:href="#meddbf9c386"
                   y="252"
                   id="use123"
                   width="100%"
                   height="100%" />
              </g>
            </g>
            <g
               id="text_6"
               style="fill:#ffffff;stroke-linecap:butt;stroke-linejoin:round">
              <!-- 900 -->
              <defs
                 id="defs129">
                <path
                   d="M 10.984375,1.515625 V 10.5 Q 14.703125,8.734375 18.5,7.8125 q 3.8125,-0.921875 7.484375,-0.921875 9.765625,0 14.90625,6.5625 5.15625,6.5625 5.890625,19.953125 -2.828125,-4.203125 -7.1875,-6.453125 -4.34375,-2.25 -9.609375,-2.25 -10.9375,0 -17.3125,6.609375 -6.375,6.625 -6.375,18.109375 0,11.21875 6.640625,18 6.640625,6.796875 17.671875,6.796875 12.65625,0 19.3125,-9.703125 6.671875,-9.6875 6.671875,-28.140625 0,-17.234375 -8.1875,-27.515625 -8.171875,-10.28125 -21.984375,-10.28125 -3.71875,0 -7.53125,0.734375 -3.796875,0.734375 -7.90625,2.203125 z m 19.625,30.90625 q 6.640625,0 10.515625,4.53125 3.890625,4.546875 3.890625,12.46875 0,7.859375 -3.890625,12.421875 -3.875,4.5625 -10.515625,4.5625 -6.640625,0 -10.515625,-4.5625 -3.875,-4.5625 -3.875,-12.421875 0,-7.921875 3.875,-12.46875 3.875,-4.53125 10.515625,-4.53125 z"
                   id="DejaVuSans-57"
                   inkscape:connector-curvature="0"
                   style="stroke-linecap:butt;stroke-linejoin:round" />
              </defs>
              <g
                 transform="matrix(0.1,0,0,-0.1,323.45625,266.59844)"
                 id="g137"
                 style="stroke-linecap:butt;stroke-linejoin:round">
                <use
                   xlink:href="#DejaVuSans-57"
                   id="use131"
                   style="stroke-linecap:butt;stroke-linejoin:round"
                   x="0"
                   y="0"
                   width="100%"
                   height="100%" />
                <use
                   x="63.623047"
                   xlink:href="#DejaVuSans-48"
                   id="use133"
                   style="stroke-linecap:butt;stroke-linejoin:round"
                   y="0"
                   width="100%"
                   height="100%" />
                <use
                   x="127.24609"
                   xlink:href="#DejaVuSans-48"
                   id="use135"
                   style="stroke-linecap:butt;stroke-linejoin:round"
                   y="0"
                   width="100%"
                   height="100%" />
              </g>
            </g>
          </g>
          <g
             id="xtick_7"
             style="stroke-linecap:butt;stroke-linejoin:round">
            <g
               id="line2d_13"
               style="stroke-linecap:butt;stroke-linejoin:round">
              <path
                 clip-path="url(#p92c7f562a0)"
                 d="M 388.8,252 V 34.56"
                 style="fill:none;stroke:#b0b0b0;stroke-width:0.80000001;stroke-linecap:square;stroke-linejoin:round"
                 id="path141"
                 inkscape:connector-curvature="0" />
            </g>
            <g
               id="line2d_14"
               style="stroke-linecap:butt;stroke-linejoin:round">
              <g
                 id="g146"
                 style="stroke-linecap:butt;stroke-linejoin:round">
                <use
                   style="stroke:#ffffff;stroke-width:0.80000001;stroke-linecap:butt;stroke-linejoin:round"
                   x="388.79999"
                   xlink:href="#meddbf9c386"
                   y="252"
                   id="use144"
                   width="100%"
                   height="100%" />
              </g>
            </g>
            <g
               id="text_7"
               style="fill:#ffffff;stroke-linecap:butt;stroke-linejoin:round">
              <!-- 1080 -->
              <g
                 transform="matrix(0.1,0,0,-0.1,376.075,266.59844)"
                 id="g157"
                 style="stroke-linecap:butt;stroke-linejoin:round">
                <use
                   xlink:href="#DejaVuSans-49"
                   id="use149"
                   style="stroke-linecap:butt;stroke-linejoin:round"
                   x="0"
                   y="0"
                   width="100%"
                   height="100%" />
                <use
                   x="63.623047"
                   xlink:href="#DejaVuSans-48"
                   id="use151"
                   style="stroke-linecap:butt;stroke-linejoin:round"
                   y="0"
                   width="100%"
                   height="100%" />
                <use
                   x="127.24609"
                   xlink:href="#DejaVuSans-56"
                   id="use153"
                   style="stroke-linecap:butt;stroke-linejoin:round"
                   y="0"
                   width="100%"
                   height="100%" />
                <use
                   x="190.86914"
                   xlink:href="#DejaVuSans-48"
                   id="use155"
                   style="stroke-linecap:butt;stroke-linejoin:round"
                   y="0"
                   width="100%"
                   height="100%" />
              </g>
            </g>
          </g>
          <g
             id="text_8"
             style="fill:#ffffff;stroke-linecap:butt;stroke-linejoin:round">
            <!-- Time (seconds) -->
            <defs
               id="defs173">
              <path
                 d="M -0.296875,72.90625 H 61.375 v -8.3125 H 35.5 V 0 H 25.59375 V 64.59375 H -0.296875 Z"
                 id="DejaVuSans-84"
                 inkscape:connector-curvature="0"
                 style="stroke-linecap:butt;stroke-linejoin:round" />
              <path
                 d="M 9.421875,54.6875 H 18.40625 V 0 H 9.421875 Z m 0,21.296875 H 18.40625 V 64.59375 H 9.421875 Z"
                 id="DejaVuSans-105"
                 inkscape:connector-curvature="0"
                 style="stroke-linecap:butt;stroke-linejoin:round" />
              <path
                 d="M 52,44.1875 Q 55.375,50.25 60.0625,53.125 64.75,56 71.09375,56 q 8.546875,0 13.1875,-5.984375 4.640625,-5.96875 4.640625,-17 V 0 h -9.03125 v 32.71875 q 0,7.859375 -2.796875,11.65625 -2.78125,3.8125 -8.484375,3.8125 -6.984375,0 -11.046875,-4.640625 -4.046875,-4.625 -4.046875,-12.640625 V 0 h -9.03125 v 32.71875 q 0,7.90625 -2.78125,11.6875 -2.78125,3.78125 -8.59375,3.78125 -6.890625,0 -10.953125,-4.65625 -4.046875,-4.65625 -4.046875,-12.625 V 0 h -9.03125 v 54.6875 h 9.03125 v -8.5 q 3.078125,5.03125 7.375,7.421875 Q 29.78125,56 35.6875,56 41.65625,56 45.828125,52.96875 50,49.953125 52,44.1875 Z"
                 id="DejaVuSans-109"
                 inkscape:connector-curvature="0"
                 style="stroke-linecap:butt;stroke-linejoin:round" />
              <path
                 d="m 56.203125,29.59375 v -4.390625 h -41.3125 q 0.59375,-9.28125 5.59375,-14.140625 5,-4.859375 13.9375,-4.859375 5.171875,0 10.03125,1.265625 4.859375,1.265625 9.65625,3.8125 v -8.5 q -4.84375,-2.046875 -9.921875,-3.125 -5.078125,-1.078125 -10.296875,-1.078125 -13.09375,0 -20.734375,7.609375 -7.640625,7.625 -7.640625,20.625 0,13.421875 7.25,21.296875 Q 20.015625,56 32.328125,56 q 11.03125,0 17.453125,-7.109375 6.421875,-7.09375 6.421875,-19.296875 z m -8.984375,2.640625 q -0.09375,7.359375 -4.125,11.75 -4.03125,4.40625 -10.671875,4.40625 -7.515625,0 -12.03125,-4.25 -4.515625,-4.25 -5.203125,-11.96875 z"
                 id="DejaVuSans-101"
                 inkscape:connector-curvature="0"
                 style="stroke-linecap:butt;stroke-linejoin:round" />
              <path
                 id="DejaVuSans-32"
                 d=""
                 inkscape:connector-curvature="0"
                 style="stroke-linecap:butt;stroke-linejoin:round" />
              <path
                 d="M 31,75.875 Q 24.46875,64.65625 21.28125,53.65625 18.109375,42.671875 18.109375,31.390625 18.109375,20.125 21.3125,9.0625 24.515625,-2 31,-13.1875 H 23.1875 Q 15.875,-1.703125 12.234375,9.375 8.59375,20.453125 8.59375,31.390625 q 0,10.890625 3.609375,21.921875 3.625,11.046875 10.984375,22.5625 z"
                 id="DejaVuSans-40"
                 inkscape:connector-curvature="0"
                 style="stroke-linecap:butt;stroke-linejoin:round" />
              <path
                 d="m 44.28125,53.078125 v -8.5 Q 40.484375,46.53125 36.375,47.5 q -4.09375,0.984375 -8.5,0.984375 -6.6875,0 -10.03125,-2.046875 Q 14.5,44.390625 14.5,40.28125 q 0,-3.125 2.390625,-4.90625 2.390625,-1.78125 9.625,-3.390625 l 3.078125,-0.6875 Q 39.15625,29.25 43.1875,25.515625 47.21875,21.78125 47.21875,15.09375 q 0,-7.625 -6.03125,-12.078125 -6.03125,-4.4375 -16.578125,-4.4375 -4.390625,0 -9.15625,0.859375 Q 10.6875,0.296875 5.421875,2 v 9.28125 q 4.984375,-2.59375 9.8125,-3.890625 4.828125,-1.28125 9.578125,-1.28125 6.34375,0 9.75,2.171875 3.421875,2.171875 3.421875,6.125 0,3.65625 -2.46875,5.609375 -2.453125,1.953125 -10.8125,3.765625 l -3.125,0.734375 q -8.34375,1.75 -12.0625,5.390625 -3.703125,3.640625 -3.703125,9.984375 0,7.71875 5.46875,11.90625 Q 16.75,56 26.8125,56 q 4.96875,0 9.359375,-0.734375 4.40625,-0.71875 8.109375,-2.1875 z"
                 id="DejaVuSans-115"
                 inkscape:connector-curvature="0"
                 style="stroke-linecap:butt;stroke-linejoin:round" />
              <path
                 d="M 48.78125,52.59375 V 44.1875 q -3.8125,2.109375 -7.640625,3.15625 -3.828125,1.046875 -7.734375,1.046875 -8.75,0 -13.59375,-5.546875 -4.828125,-5.53125 -4.828125,-15.546875 0,-10.015625 4.828125,-15.5625 4.84375,-5.53125 13.59375,-5.53125 3.90625,0 7.734375,1.046875 3.828125,1.046875 7.640625,3.15625 v -8.3125 q -3.765625,-1.75 -7.796875,-2.625 -4.015625,-0.890625 -8.5625,-0.890625 -12.359375,0 -19.640625,7.765625 -7.265625,7.765625 -7.265625,20.953125 0,13.375 7.34375,21.03125 Q 20.21875,56 33.015625,56 q 4.140625,0 8.09375,-0.859375 3.953125,-0.84375 7.671875,-2.546875 z"
                 id="DejaVuSans-99"
                 inkscape:connector-curvature="0"
                 style="stroke-linecap:butt;stroke-linejoin:round" />
              <path
                 d="m 30.609375,48.390625 q -7.21875,0 -11.421875,-5.640625 -4.203125,-5.640625 -4.203125,-15.453125 0,-9.8125 4.171875,-15.453125 4.1875,-5.640625 11.453125,-5.640625 7.1875,0 11.375,5.65625 4.203125,5.671875 4.203125,15.4375 0,9.71875 -4.203125,15.40625 -4.1875,5.6875 -11.375,5.6875 z m 0,7.609375 q 11.71875,0 18.40625,-7.625 6.703125,-7.609375 6.703125,-21.078125 0,-13.421875 -6.703125,-21.078125 -6.6875,-7.640625 -18.40625,-7.640625 -11.765625,0 -18.4375,7.640625 -6.65625,7.65625 -6.65625,21.078125 0,13.46875 6.65625,21.078125 Q 18.84375,56 30.609375,56 Z"
                 id="DejaVuSans-111"
                 inkscape:connector-curvature="0"
                 style="stroke-linecap:butt;stroke-linejoin:round" />
              <path
                 d="M 54.890625,33.015625 V 0 H 45.90625 v 32.71875 q 0,7.765625 -3.03125,11.609375 -3.03125,3.859375 -9.078125,3.859375 -7.28125,0 -11.484375,-4.640625 -4.203125,-4.625 -4.203125,-12.640625 V 0 h -9.03125 v 54.6875 h 9.03125 v -8.5 q 3.234375,4.9375 7.59375,7.375 4.375,2.4375 10.09375,2.4375 9.421875,0 14.25,-5.828125 4.84375,-5.828125 4.84375,-17.15625 z"
                 id="DejaVuSans-110"
                 inkscape:connector-curvature="0"
                 style="stroke-linecap:butt;stroke-linejoin:round" />
              <path
                 d="m 45.40625,46.390625 v 29.59375 h 8.984375 V 0 H 45.40625 v 8.203125 q -2.828125,-4.875 -7.15625,-7.25 -4.3125,-2.375 -10.375,-2.375 -9.90625,0 -16.140625,7.90625 -6.21875,7.921875 -6.21875,20.8125 0,12.890625 6.21875,20.796875 Q 17.96875,56 27.875,56 q 6.0625,0 10.375,-2.375 4.328125,-2.359375 7.15625,-7.234375 z M 14.796875,27.296875 q 0,-9.90625 4.078125,-15.546875 4.078125,-5.640625 11.203125,-5.640625 7.125,0 11.21875,5.640625 4.109375,5.640625 4.109375,15.546875 0,9.90625 -4.109375,15.546875 -4.09375,5.640625 -11.21875,5.640625 -7.125,0 -11.203125,-5.640625 -4.078125,-5.640625 -4.078125,-15.546875 z"
                 id="DejaVuSans-100"
                 inkscape:connector-curvature="0"
                 style="stroke-linecap:butt;stroke-linejoin:round" />
              <path
                 d="m 8.015625,75.875 h 7.8125 q 7.3125,-11.515625 10.953125,-22.5625 3.640625,-11.03125 3.640625,-21.921875 0,-10.9375 -3.640625,-22.015625 -3.640625,-11.078125 -10.953125,-22.5625 h -7.8125 Q 14.5,-2 17.703125,9.0625 20.90625,20.125 20.90625,31.390625 q 0,11.28125 -3.203125,22.265625 -3.203125,11 -9.6875,22.21875 z"
                 id="DejaVuSans-41"
                 inkscape:connector-curvature="0"
                 style="stroke-linecap:butt;stroke-linejoin:round" />
            </defs>
            <g
               transform="matrix(0.1,0,0,-0.1,183.08437,280.27656)"
               id="g203"
               style="stroke-linecap:butt;stroke-linejoin:round">
              <use
                 xlink:href="#DejaVuSans-84"
                 id="use175"
                 style="stroke-linecap:butt;stroke-linejoin:round"
                 x="0"
                 y="0"
                 width="100%"
                 height="100%" />
              <use
                 x="61.037109"
                 xlink:href="#DejaVuSans-105"
                 id="use177"
                 style="stroke-linecap:butt;stroke-linejoin:round"
                 y="0"
                 width="100%"
                 height="100%" />
              <use
                 x="88.820312"
                 xlink:href="#DejaVuSans-109"
                 id="use179"
                 style="stroke-linecap:butt;stroke-linejoin:round"
                 y="0"
                 width="100%"
                 height="100%" />
              <use
                 x="186.23242"
                 xlink:href="#DejaVuSans-101"
                 id="use181"
                 style="stroke-linecap:butt;stroke-linejoin:round"
                 y="0"
                 width="100%"
                 height="100%" />
              <use
                 x="247.75586"
                 xlink:href="#DejaVuSans-32"
                 id="use183"
                 style="stroke-linecap:butt;stroke-linejoin:round"
                 y="0"
                 width="100%"
                 height="100%" />
              <use
                 x="279.54297"
                 xlink:href="#DejaVuSans-40"
                 id="use185"
                 style="stroke-linecap:butt;stroke-linejoin:round"
                 y="0"
                 width="100%"
                 height="100%" />
              <use
                 x="318.55664"
                 xlink:href="#DejaVuSans-115"
                 id="use187"
                 style="stroke-linecap:butt;stroke-linejoin:round"
                 y="0"
                 width="100%"
                 height="100%" />
              <use
                 x="370.65625"
                 xlink:href="#DejaVuSans-101"
                 id="use189"
                 style="stroke-linecap:butt;stroke-linejoin:round"
                 y="0"
                 width="100%"
                 height="100%" />
              <use
                 x="432.17969"
                 xlink:href="#DejaVuSans-99"
                 id="use191"
                 style="stroke-linecap:butt;stroke-linejoin:round"
                 y="0"
                 width="100%"
                 height="100%" />
              <use
                 x="487.16016"
                 xlink:href="#DejaVuSans-111"
                 id="use193"
                 style="stroke-linecap:butt;stroke-linejoin:round"
                 y="0"
                 width="100%"
                 height="100%" />
              <use
                 x="548.3418"
                 xlink:href="#DejaVuSans-110"
                 id="use195"
                 style="stroke-linecap:butt;stroke-linejoin:round"
                 y="0"
                 width="100%"
                 height="100%" />
              <use
                 x="611.7207"
                 xlink:href="#DejaVuSans-100"
                 id="use197"
                 style="stroke-linecap:butt;stroke-linejoin:round"
                 y="0"
                 width="100%"
                 height="100%" />
              <use
                 x="675.19727"
                 xlink:href="#DejaVuSans-115"
                 id="use199"
                 style="stroke-linecap:butt;stroke-linejoin:round"
                 y="0"
                 width="100%"
                 height="100%" />
              <use
                 x="727.29688"
                 xlink:href="#DejaVuSans-41"
                 id="use201"
                 style="stroke-linecap:butt;stroke-linejoin:round"
                 y="0"
                 width="100%"
                 height="100%" />
            </g>
          </g>
        </g>
        <g
           id="matplotlib.axis_2"
           style="stroke-linecap:butt;stroke-linejoin:round">
          <g
             id="ytick_1"
             style="stroke-linecap:butt;stroke-linejoin:round">
            <g
               id="line2d_15"
               style="stroke-linecap:butt;stroke-linejoin:round">
              <defs
                 id="defs208">
                <path
                   d="M 0,0 H -3.5"
                   id="ma389352f20"
                   style="stroke:#ffffff;stroke-width:0.80000001;stroke-linecap:butt;stroke-linejoin:round"
                   inkscape:connector-curvature="0" />
              </defs>
              <g
                 id="g212"
                 style="stroke-linecap:butt;stroke-linejoin:round">
                <use
                   style="stroke:#ffffff;stroke-width:0.80000001;stroke-linecap:butt;stroke-linejoin:round"
                   x="54"
                   xlink:href="#ma389352f20"
                   y="252"
                   id="use210"
                   width="100%"
                   height="100%" />
              </g>
            </g>
            <g
               id="text_9"
               style="fill:#ffffff;stroke-linecap:butt;stroke-linejoin:round">
              <!-- 0.0 -->
              <defs
                 id="defs216">
                <path
                   d="M 10.6875,12.40625 H 21 V 0 H 10.6875 Z"
                   id="DejaVuSans-46"
                   inkscape:connector-curvature="0"
                   style="stroke-linecap:butt;stroke-linejoin:round" />
              </defs>
              <g
                 transform="matrix(0.1,0,0,-0.1,31.096875,255.79922)"
                 id="g224"
                 style="stroke-linecap:butt;stroke-linejoin:round">
                <use
                   xlink:href="#DejaVuSans-48"
                   id="use218"
                   style="stroke-linecap:butt;stroke-linejoin:round"
                   x="0"
                   y="0"
                   width="100%"
                   height="100%" />
                <use
                   x="63.623047"
                   xlink:href="#DejaVuSans-46"
                   id="use220"
                   style="stroke-linecap:butt;stroke-linejoin:round"
                   y="0"
                   width="100%"
                   height="100%" />
                <use
                   x="95.410156"
                   xlink:href="#DejaVuSans-48"
                   id="use222"
                   style="stroke-linecap:butt;stroke-linejoin:round"
                   y="0"
                   width="100%"
                   height="100%" />
              </g>
            </g>
          </g>
          <g
             id="ytick_2"
             style="stroke-linecap:butt;stroke-linejoin:round">
            <g
               id="line2d_16"
               style="stroke-linecap:butt;stroke-linejoin:round">
              <g
                 id="g230"
                 style="stroke-linecap:butt;stroke-linejoin:round">
                <use
                   style="stroke:#ffffff;stroke-width:0.80000001;stroke-linecap:butt;stroke-linejoin:round"
                   x="54"
                   xlink:href="#ma389352f20"
                   y="215.75999"
                   id="use228"
                   width="100%"
                   height="100%" />
              </g>
            </g>
            <g
               id="text_10"
               style="fill:#ffffff;stroke-linecap:butt;stroke-linejoin:round">
              <!-- 0.5 -->
              <g
                 transform="matrix(0.1,0,0,-0.1,31.096875,219.55922)"
                 id="g239"
                 style="stroke-linecap:butt;stroke-linejoin:round">
                <use
                   xlink:href="#DejaVuSans-48"
                   id="use233"
                   style="stroke-linecap:butt;stroke-linejoin:round"
                   x="0"
                   y="0"
                   width="100%"
                   height="100%" />
                <use
                   x="63.623047"
                   xlink:href="#DejaVuSans-46"
                   id="use235"
                   style="stroke-linecap:butt;stroke-linejoin:round"
                   y="0"
                   width="100%"
                   height="100%" />
                <use
                   x="95.410156"
                   xlink:href="#DejaVuSans-53"
                   id="use237"
                   style="stroke-linecap:butt;stroke-linejoin:round"
                   y="0"
                   width="100%"
                   height="100%" />
              </g>
            </g>
          </g>
          <g
             id="ytick_3"
             style="stroke-linecap:butt;stroke-linejoin:round">
            <g
               id="line2d_17"
               style="stroke-linecap:butt;stroke-linejoin:round">
              <g
                 id="g245"
                 style="stroke-linecap:butt;stroke-linejoin:round">
                <use
                   style="stroke:#ffffff;stroke-width:0.80000001;stroke-linecap:butt;stroke-linejoin:round"
                   x="54"
                   xlink:href="#ma389352f20"
                   y="179.52"
                   id="use243"
                   width="100%"
                   height="100%" />
              </g>
            </g>
            <g
               id="text_11"
               style="fill:#ffffff;stroke-linecap:butt;stroke-linejoin:round">
              <!-- 1.0 -->
              <g
                 transform="matrix(0.1,0,0,-0.1,31.096875,183.31922)"
                 id="g254"
                 style="stroke-linecap:butt;stroke-linejoin:round">
                <use
                   xlink:href="#DejaVuSans-49"
                   id="use248"
                   style="stroke-linecap:butt;stroke-linejoin:round"
                   x="0"
                   y="0"
                   width="100%"
                   height="100%" />
                <use
                   x="63.623047"
                   xlink:href="#DejaVuSans-46"
                   id="use250"
                   style="stroke-linecap:butt;stroke-linejoin:round"
                   y="0"
                   width="100%"
                   height="100%" />
                <use
                   x="95.410156"
                   xlink:href="#DejaVuSans-48"
                   id="use252"
                   style="stroke-linecap:butt;stroke-linejoin:round"
                   y="0"
                   width="100%"
                   height="100%" />
              </g>
            </g>
          </g>
          <g
             id="ytick_4"
             style="stroke-linecap:butt;stroke-linejoin:round">
            <g
               id="line2d_18"
               style="stroke-linecap:butt;stroke-linejoin:round">
              <g
                 id="g260"
                 style="stroke-linecap:butt;stroke-linejoin:round">
                <use
                   style="stroke:#ffffff;stroke-width:0.80000001;stroke-linecap:butt;stroke-linejoin:round"
                   x="54"
                   xlink:href="#ma389352f20"
                   y="143.28"
                   id="use258"
                   width="100%"
                   height="100%" />
              </g>
            </g>
            <g
               id="text_12"
               style="fill:#ffffff;stroke-linecap:butt;stroke-linejoin:round">
              <!-- 1.5 -->
              <g
                 transform="matrix(0.1,0,0,-0.1,31.096875,147.07922)"
                 id="g269"
                 style="stroke-linecap:butt;stroke-linejoin:round">
                <use
                   xlink:href="#DejaVuSans-49"
                   id="use263"
                   style="stroke-linecap:butt;stroke-linejoin:round"
                   x="0"
                   y="0"
                   width="100%"
                   height="100%" />
                <use
                   x="63.623047"
                   xlink:href="#DejaVuSans-46"
                   id="use265"
                   style="stroke-linecap:butt;stroke-linejoin:round"
                   y="0"
                   width="100%"
                   height="100%" />
                <use
                   x="95.410156"
                   xlink:href="#DejaVuSans-53"
                   id="use267"
                   style="stroke-linecap:butt;stroke-linejoin:round"
                   y="0"
                   width="100%"
                   height="100%" />
              </g>
            </g>
          </g>
          <g
             id="ytick_5"
             style="stroke-linecap:butt;stroke-linejoin:round">
            <g
               id="line2d_19"
               style="stroke-linecap:butt;stroke-linejoin:round">
              <g
                 id="g275"
                 style="stroke-linecap:butt;stroke-linejoin:round">
                <use
                   style="stroke:#ffffff;stroke-width:0.80000001;stroke-linecap:butt;stroke-linejoin:round"
                   x="54"
                   xlink:href="#ma389352f20"
                   y="107.04"
                   id="use273"
                   width="100%"
                   height="100%" />
              </g>
            </g>
            <g
               id="text_13"
               style="fill:#ffffff;stroke-linecap:butt;stroke-linejoin:round">
              <!-- 2.0 -->
              <g
                 transform="matrix(0.1,0,0,-0.1,31.096875,110.83922)"
                 id="g284"
                 style="stroke-linecap:butt;stroke-linejoin:round">
                <use
                   xlink:href="#DejaVuSans-50"
                   id="use278"
                   style="stroke-linecap:butt;stroke-linejoin:round"
                   x="0"
                   y="0"
                   width="100%"
                   height="100%" />
                <use
                   x="63.623047"
                   xlink:href="#DejaVuSans-46"
                   id="use280"
                   style="stroke-linecap:butt;stroke-linejoin:round"
                   y="0"
                   width="100%"
                   height="100%" />
                <use
                   x="95.410156"
                   xlink:href="#DejaVuSans-48"
                   id="use282"
                   style="stroke-linecap:butt;stroke-linejoin:round"
                   y="0"
                   width="100%"
                   height="100%" />
              </g>
            </g>
          </g>
          <g
             id="ytick_6"
             style="stroke-linecap:butt;stroke-linejoin:round">
            <g
               id="line2d_20"
               style="stroke-linecap:butt;stroke-linejoin:round">
              <g
                 id="g290"
                 style="stroke-linecap:butt;stroke-linejoin:round">
                <use
                   style="stroke:#ffffff;stroke-width:0.80000001;stroke-linecap:butt;stroke-linejoin:round"
                   x="54"
                   xlink:href="#ma389352f20"
                   y="70.800003"
                   id="use288"
                   width="100%"
                   height="100%" />
              </g>
            </g>
            <g
               id="text_14"
               style="fill:#ffffff;stroke-linecap:butt;stroke-linejoin:round">
              <!-- 2.5 -->
              <g
                 transform="matrix(0.1,0,0,-0.1,31.096875,74.599219)"
                 id="g299"
                 style="stroke-linecap:butt;stroke-linejoin:round">
                <use
                   xlink:href="#DejaVuSans-50"
                   id="use293"
                   style="stroke-linecap:butt;stroke-linejoin:round"
                   x="0"
                   y="0"
                   width="100%"
                   height="100%" />
                <use
                   x="63.623047"
                   xlink:href="#DejaVuSans-46"
                   id="use295"
                   style="stroke-linecap:butt;stroke-linejoin:round"
                   y="0"
                   width="100%"
                   height="100%" />
                <use
                   x="95.410156"
                   xlink:href="#DejaVuSans-53"
                   id="use297"
                   style="stroke-linecap:butt;stroke-linejoin:round"
                   y="0"
                   width="100%"
                   height="100%" />
              </g>
            </g>
          </g>
          <g
             id="ytick_7"
             style="stroke-linecap:butt;stroke-linejoin:round">
            <g
               id="line2d_21"
               style="stroke-linecap:butt;stroke-linejoin:round">
              <g
                 id="g305"
                 style="stroke-linecap:butt;stroke-linejoin:round">
                <use
                   style="stroke:#ffffff;stroke-width:0.80000001;stroke-linecap:butt;stroke-linejoin:round"
                   x="54"
                   xlink:href="#ma389352f20"
                   y="34.560001"
                   id="use303"
                   width="100%"
                   height="100%" />
              </g>
            </g>
            <g
               id="text_15"
               style="fill:#ffffff;stroke-linecap:butt;stroke-linejoin:round">
              <!-- 3.0 -->
              <g
                 transform="matrix(0.1,0,0,-0.1,31.096875,38.359219)"
                 id="g314"
                 style="stroke-linecap:butt;stroke-linejoin:round">
                <use
                   xlink:href="#DejaVuSans-51"
                   id="use308"
                   style="stroke-linecap:butt;stroke-linejoin:round"
                   x="0"
                   y="0"
                   width="100%"
                   height="100%" />
                <use
                   x="63.623047"
                   xlink:href="#DejaVuSans-46"
                   id="use310"
                   style="stroke-linecap:butt;stroke-linejoin:round"
                   y="0"
                   width="100%"
                   height="100%" />
                <use
                   x="95.410156"
                   xlink:href="#DejaVuSans-48"
                   id="use312"
                   style="stroke-linecap:butt;stroke-linejoin:round"
                   y="0"
                   width="100%"
                   height="100%" />
              </g>
            </g>
          </g>
          <g
             id="text_16"
             style="fill:#ffffff;stroke-linecap:butt;stroke-linejoin:round">
            <!-- Memory (bytes) -->
            <defs
               id="defs323">
              <path
                 d="M 9.8125,72.90625 H 24.515625 L 43.109375,23.296875 61.8125,72.90625 H 76.515625 V 0 h -9.625 v 64.015625 l -18.796875,-50 H 38.1875 l -18.796875,50 V 0 H 9.8125 Z"
                 id="DejaVuSans-77"
                 inkscape:connector-curvature="0"
                 style="stroke-linecap:butt;stroke-linejoin:round" />
              <path
                 d="m 41.109375,46.296875 q -1.515625,0.875 -3.296875,1.28125 Q 36.03125,48 33.890625,48 26.265625,48 22.1875,43.046875 18.109375,38.09375 18.109375,28.8125 V 0 h -9.03125 v 54.6875 h 9.03125 v -8.5 q 2.84375,4.984375 7.375,7.390625 Q 30.03125,56 36.53125,56 q 0.921875,0 2.046875,-0.125 1.125,-0.109375 2.484375,-0.359375 z"
                 id="DejaVuSans-114"
                 inkscape:connector-curvature="0"
                 style="stroke-linecap:butt;stroke-linejoin:round" />
              <path
                 d="M 32.171875,-5.078125 Q 28.375,-14.84375 24.75,-17.8125 q -3.609375,-2.984375 -9.65625,-2.984375 h -7.1875 v 7.515625 h 5.28125 q 3.703125,0 5.75,1.765625 2.0625,1.75 4.546875,8.296875 L 25.09375,0.875 2.984375,54.6875 H 12.5 L 29.59375,11.921875 46.6875,54.6875 h 9.515625 z"
                 id="DejaVuSans-121"
                 inkscape:connector-curvature="0"
                 style="stroke-linecap:butt;stroke-linejoin:round" />
              <path
                 d="m 48.6875,27.296875 q 0,9.90625 -4.078125,15.546875 -4.078125,5.640625 -11.203125,5.640625 -7.140625,0 -11.21875,-5.640625 -4.078125,-5.640625 -4.078125,-15.546875 0,-9.90625 4.078125,-15.546875 4.078125,-5.640625 11.21875,-5.640625 7.125,0 11.203125,5.640625 4.078125,5.640625 4.078125,15.546875 z m -30.578125,19.09375 q 2.84375,4.875 7.15625,7.234375 Q 29.59375,56 35.59375,56 q 9.96875,0 16.1875,-7.90625 6.234375,-7.90625 6.234375,-20.796875 0,-12.890625 -6.234375,-20.8125 -6.21875,-7.90625 -16.1875,-7.90625 -6,0 -10.328125,2.375 -4.3125,2.375 -7.15625,7.25 V 0 h -9.03125 v 75.984375 h 9.03125 z"
                 id="DejaVuSans-98"
                 inkscape:connector-curvature="0"
                 style="stroke-linecap:butt;stroke-linejoin:round" />
              <path
                 d="M 18.3125,70.21875 V 54.6875 h 18.5 v -6.984375 h -18.5 v -29.6875 q 0,-6.6875 1.828125,-8.59375 1.828125,-1.90625 7.453125,-1.90625 H 36.8125 V 0 H 27.59375 Q 17.1875,0 13.234375,3.875 9.28125,7.765625 9.28125,18.015625 v 29.6875 H 2.6875 V 54.6875 h 6.59375 v 15.53125 z"
                 id="DejaVuSans-116"
                 inkscape:connector-curvature="0"
                 style="stroke-linecap:butt;stroke-linejoin:round" />
            </defs>
            <g
               transform="matrix(0,-0.1,-0.1,0,25.017187,182.88078)"
               id="g353"
               style="stroke-linecap:butt;stroke-linejoin:round">
              <use
                 xlink:href="#DejaVuSans-77"
                 id="use325"
                 style="stroke-linecap:butt;stroke-linejoin:round"
                 x="0"
                 y="0"
                 width="100%"
                 height="100%" />
              <use
                 x="86.279297"
                 xlink:href="#DejaVuSans-101"
                 id="use327"
                 style="stroke-linecap:butt;stroke-linejoin:round"
                 y="0"
                 width="100%"
                 height="100%" />
              <use
                 x="147.80273"
                 xlink:href="#DejaVuSans-109"
                 id="use329"
                 style="stroke-linecap:butt;stroke-linejoin:round"
                 y="0"
                 width="100%"
                 height="100%" />
              <use
                 x="245.21484"
                 xlink:href="#DejaVuSans-111"
                 id="use331"
                 style="stroke-linecap:butt;stroke-linejoin:round"
                 y="0"
                 width="100%"
                 height="100%" />
              <use
                 x="306.39648"
                 xlink:href="#DejaVuSans-114"
                 id="use333"
                 style="stroke-linecap:butt;stroke-linejoin:round"
                 y="0"
                 width="100%"
                 height="100%" />
              <use
                 x="347.50977"
                 xlink:href="#DejaVuSans-121"
                 id="use335"
                 style="stroke-linecap:butt;stroke-linejoin:round"
                 y="0"
                 width="100%"
                 height="100%" />
              <use
                 x="406.68945"
                 xlink:href="#DejaVuSans-32"
                 id="use337"
                 style="stroke-linecap:butt;stroke-linejoin:round"
                 y="0"
                 width="100%"
                 height="100%" />
              <use
                 x="438.47656"
                 xlink:href="#DejaVuSans-40"
                 id="use339"
                 style="stroke-linecap:butt;stroke-linejoin:round"
                 y="0"
                 width="100%"
                 height="100%" />
              <use
                 x="477.49023"
                 xlink:href="#DejaVuSans-98"
                 id="use341"
                 style="stroke-linecap:butt;stroke-linejoin:round"
                 y="0"
                 width="100%"
                 height="100%" />
              <use
                 x="540.9668"
                 xlink:href="#DejaVuSans-121"
                 id="use343"
                 style="stroke-linecap:butt;stroke-linejoin:round"
                 y="0"
                 width="100%"
                 height="100%" />
              <use
                 x="600.14648"
                 xlink:href="#DejaVuSans-116"
                 id="use345"
                 style="stroke-linecap:butt;stroke-linejoin:round"
                 y="0"
                 width="100%"
                 height="100%" />
              <use
                 x="639.35547"
                 xlink:href="#DejaVuSans-101"
                 id="use347"
                 style="stroke-linecap:butt;stroke-linejoin:round"
                 y="0"
                 width="100%"
                 height="100%" />
              <use
                 x="700.87891"
                 xlink:href="#DejaVuSans-115"
                 id="use349"
                 style="stroke-linecap:butt;stroke-linejoin:round"
                 y="0"
                 width="100%"
                 height="100%" />
              <use
                 x="752.97852"
                 xlink:href="#DejaVuSans-41"
                 id="use351"
                 style="stroke-linecap:butt;stroke-linejoin:round"
                 y="0"
                 width="100%"
                 height="100%" />
            </g>
          </g>
          <g
             id="text_17"
             style="fill:#ffffff;stroke-linecap:butt;stroke-linejoin:round">
            <!-- 1e9 -->
            <g
               transform="matrix(0.1,0,0,-0.1,54,31.56)"
               id="g362"
               style="stroke-linecap:butt;stroke-linejoin:round">
              <use
                 xlink:href="#DejaVuSans-49"
                 id="use356"
                 style="stroke-linecap:butt;stroke-linejoin:round"
                 x="0"
                 y="0"
                 width="100%"
                 height="100%" />
              <use
                 x="63.623047"
                 xlink:href="#DejaVuSans-101"
                 id="use358"
                 style="stroke-linecap:butt;stroke-linejoin:round"
                 y="0"
                 width="100%"
                 height="100%" />
              <use
                 x="125.14648"
                 xlink:href="#DejaVuSans-57"
                 id="use360"
                 style="stroke-linecap:butt;stroke-linejoin:round"
                 y="0"
                 width="100%"
                 height="100%" />
            </g>
          </g>
        </g>
        <g
           id="line2d_22"
           style="stroke-linecap:butt;stroke-linejoin:round" />
        <g
           id="patch_3"
           style="stroke-linecap:butt;stroke-linejoin:round">
          <path
             d="M 54,252 V 34.56"
             style="fill:none;stroke:#ffffff;stroke-width:0.80000001;stroke-linecap:square;stroke-linejoin:miter"
             id="path4689"
             inkscape:connector-curvature="0" />
        </g>
        <g
           id="patch_4"
           style="stroke-linecap:butt;stroke-linejoin:round">
          <path
             d="M 388.8,252 V 34.56"
             style="fill:none;stroke:#ffffff;stroke-width:0.80000001;stroke-linecap:square;stroke-linejoin:miter"
             id="path4692"
             inkscape:connector-curvature="0" />
        </g>
        <g
           id="patch_5"
           style="stroke-linecap:butt;stroke-linejoin:round">
          <path
             d="M 54,252 H 388.8"
             style="fill:none;stroke:#ffffff;stroke-width:0.80000001;stroke-linecap:square;stroke-linejoin:miter"
             id="path4695"
             inkscape:connector-curvature="0" />
        </g>
        <g
           id="patch_6"
           style="stroke-linecap:butt;stroke-linejoin:round">
          <path
             d="M 54,34.56 H 388.8"
             style="fill:none;stroke:#ffffff;stroke-width:0.80000001;stroke-linecap:square;stroke-linejoin:miter"
             id="path4698"
             inkscape:connector-curvature="0" />
        </g>
        <g
           id="legend_1"
           style="stroke-linecap:butt;stroke-linejoin:round">
          <g
             id="line2d_26"
             style="stroke-linecap:butt;stroke-linejoin:round" />
          <g
             id="line2d_28"
             style="stroke-linecap:butt;stroke-linejoin:round" />
          <g
             id="line2d_30"
             style="stroke-linecap:butt;stroke-linejoin:round" />
          <g
             id="patch_7"
             style="fill:none;stroke-linecap:butt;stroke-linejoin:round"
             transform="matrix(1.8513721,0,0,0.2913771,15.768971,227.31884)">
            <path
               d="m 61,247 h 100.13906 q 2,0 2,-2 v -43.03438 q 0,-2 -2,-2 H 61 q -2,0 -2,2 V 245 q 0,2 2,2 z"
               style="opacity:0.8;fill:none;stroke:#cccccc;stroke-linecap:butt;stroke-linejoin:miter"
               id="path4746"
               inkscape:connector-curvature="0" />
          </g>
          <g
             id="g1227"
             transform="translate(66.323438,1.5641341)"
             style="stroke-linecap:butt;stroke-linejoin:round">
            <g
               style="stroke-linecap:butt;stroke-linejoin:round"
               transform="translate(0,82.067797)"
               id="g1160">
              <g
                 id="g4490">
                <g
                   transform="translate(-2.3573809e-6)"
                   style="stroke-linecap:butt;stroke-linejoin:round"
                   id="line2d_25">
                  <path
                     inkscape:connector-curvature="0"
                     id="path4749"
                     style="fill:none;stroke:#ffffff;stroke-width:1.5;stroke-linecap:butt;stroke-linejoin:round;stroke-dasharray:5.55, 2.4;stroke-dashoffset:0"
                     d="M 63,208.06406 H 83" />
                </g>
                <text
                   xml:space="preserve"
                   style="font-style:normal;font-weight:normal;font-size:30.00000191px;line-height:1.25;font-family:sans-serif;letter-spacing:0px;word-spacing:0px;fill:#ffffff;fill-opacity:1;stroke:none;stroke-width:0.75;stroke-linecap:butt;stroke-linejoin:round"
                   x="90.999603"
                   y="211.79208"
                   id="text3332"><tspan
                     sodipodi:role="line"
                     id="tspan3330"
                     style="font-style:normal;font-variant:normal;font-weight:normal;font-stretch:normal;font-size:10px;font-family:sans-serif;-inkscape-font-specification:'sans-serif, Normal';font-variant-ligatures:normal;font-variant-caps:normal;font-variant-numeric:normal;font-feature-settings:normal;text-align:start;writing-mode:lr-tb;text-anchor:start;fill:#ffffff;stroke-width:0.75;stroke-linecap:butt;stroke-linejoin:round"
                     x="90.999603"
                     y="211.79208">baseline</tspan></text>
              </g>
            </g>
            <g
               style="stroke-linecap:butt;stroke-linejoin:round"
               transform="translate(92.302031,68.130292)"
               id="g1171">
              <g
                 id="LineCollection_3"
                 style="stroke-linecap:butt;stroke-linejoin:round">
                <path
                   d="m 73,227.74219 v -10"
                   style="fill:none;stroke:#17becf;stroke-width:1.5;stroke-linecap:butt;stroke-linejoin:round"
                   id="path4788"
                   inkscape:connector-curvature="0" />
              </g>
              <g
                 id="line2d_27"
                 style="stroke-linecap:butt;stroke-linejoin:round">
                <path
                   d="M 63,222.74219 H 83"
                   style="fill:none;stroke:#17becf;stroke-width:1.5;stroke-linecap:square;stroke-linejoin:round"
                   id="path4791"
                   inkscape:connector-curvature="0" />
              </g>
              <g
                 id="text_25"
                 style="fill:#ffffff;stroke-linecap:butt;stroke-linejoin:round">
                <!-- A -->
                <defs
                   id="defs4796">
                  <path
                     d="M 34.1875,63.1875 20.796875,26.90625 h 26.8125 z m -5.578125,9.71875 h 11.1875 L 67.578125,0 h -10.25 L 50.6875,18.703125 H 17.828125 L 11.1875,0 H 0.78125 Z"
                     id="DejaVuSans-65"
                     inkscape:connector-curvature="0"
                     style="stroke-linecap:butt;stroke-linejoin:round" />
                </defs>
                <g
                   transform="matrix(0.1,0,0,-0.1,91,226.24219)"
                   id="g4800"
                   style="stroke-linecap:butt;stroke-linejoin:round">
                  <use
                     xlink:href="#DejaVuSans-65"
                     id="use4798"
                     style="stroke-linecap:butt;stroke-linejoin:round"
                     x="0"
                     y="0"
                     width="100%"
                     height="100%" />
                </g>
              </g>
            </g>
            <g
               style="stroke-linecap:butt;stroke-linejoin:round"
               transform="translate(149.99998,53.452172)"
               id="g1182">
              <g
                 id="LineCollection_4"
                 style="stroke-linecap:butt;stroke-linejoin:round">
                <path
                   d="m 73,242.42031 v -10"
                   style="fill:none;stroke:#bcbd22;stroke-width:1.5;stroke-linecap:butt;stroke-linejoin:round"
                   id="path4803"
                   inkscape:connector-curvature="0" />
              </g>
              <g
                 id="line2d_29"
                 style="stroke-linecap:butt;stroke-linejoin:round">
                <path
                   d="M 63,237.42031 H 83"
                   style="fill:none;stroke:#bcbd22;stroke-width:1.5;stroke-linecap:square;stroke-linejoin:round"
                   id="path4806"
                   inkscape:connector-curvature="0" />
              </g>
              <g
                 id="text_26"
                 style="fill:#ffffff;stroke-linecap:butt;stroke-linejoin:round">
                <!-- B -->
                <defs
                   id="defs4811">
                  <path
                     d="M 19.671875,34.8125 V 8.109375 H 35.5 q 7.953125,0 11.78125,3.296875 3.84375,3.296875 3.84375,10.078125 0,6.84375 -3.84375,10.078125 -3.828125,3.25 -11.78125,3.25 z m 0,29.984375 V 42.828125 H 34.28125 q 7.21875,0 10.75,2.703125 3.546875,2.71875 3.546875,8.28125 0,5.515625 -3.546875,8.25 -3.53125,2.734375 -10.75,2.734375 z M 9.8125,72.90625 h 25.203125 q 11.28125,0 17.375,-4.6875 Q 58.5,63.53125 58.5,54.890625 58.5,48.1875 55.375,44.234375 52.25,40.28125 46.1875,39.3125 53.46875,37.75 57.5,32.78125 q 4.03125,-4.953125 4.03125,-12.375 0,-9.765625 -6.640625,-15.09375 Q 48.25,0 35.984375,0 H 9.8125 Z"
                     id="DejaVuSans-66"
                     inkscape:connector-curvature="0"
                     style="stroke-linecap:butt;stroke-linejoin:round" />
                </defs>
                <g
                   transform="matrix(0.1,0,0,-0.1,91,240.92031)"
                   id="g4815"
                   style="stroke-linecap:butt;stroke-linejoin:round">
                  <use
                     xlink:href="#DejaVuSans-66"
                     id="use4813"
                     style="stroke-linecap:butt;stroke-linejoin:round"
                     x="0"
                     y="0"
                     width="100%"
                     height="100%" />
                </g>
              </g>
            </g>
          </g>
        </g>
      </g>
    </g>
  </g>
  <defs
     id="defs4824">
    <clipPath
       id="p92c7f562a0"
       style="stroke-linecap:butt;stroke-linejoin:round">
      <rect
         height="217.44"
         width="334.79999"
         x="54"
         y="34.560001"
         id="rect4821"
         style="stroke-linecap:butt;stroke-linejoin:round" />
    </clipPath>
  </defs>
</svg>
