<?xml version="1.0" encoding="UTF-8" standalone="no"?>
<!-- Created with Inkscape (http://www.inkscape.org/) -->

<svg
   xmlns:dc="http://purl.org/dc/elements/1.1/"
   xmlns:cc="http://creativecommons.org/ns#"
   xmlns:rdf="http://www.w3.org/1999/02/22-rdf-syntax-ns#"
   xmlns:svg="http://www.w3.org/2000/svg"
   xmlns="http://www.w3.org/2000/svg"
   xmlns:sodipodi="http://sodipodi.sourceforge.net/DTD/sodipodi-0.dtd"
   xmlns:inkscape="http://www.inkscape.org/namespaces/inkscape"
   width="297.59399mm"
   height="349.5415mm"
   viewBox="0 0 297.594 349.54151"
   version="1.1"
   id="svg8"
   sodipodi:docname="memoplight.svg"
   inkscape:version="0.92.4 (5da689c313, 2019-01-14)">
  <defs
     id="defs2">
    <marker
       inkscape:stockid="Arrow1Lend"
       orient="auto"
       refY="0"
       refX="0"
       id="marker4469"
       style="overflow:visible"
       inkscape:isstock="true">
      <path
         inkscape:connector-curvature="0"
         id="path4467"
         d="M 0,0 5,-5 -12.5,0 5,5 Z"
         style="fill:#000000;fill-opacity:1;fill-rule:evenodd;stroke:#000000;stroke-width:1.00000003pt;stroke-opacity:1"
         transform="matrix(-0.8,0,0,-0.8,-10,0)" />
    </marker>
    <marker
       inkscape:stockid="Arrow1Lend"
       orient="auto"
       refY="0"
       refX="0"
       id="marker3923"
       style="overflow:visible"
       inkscape:isstock="true">
      <path
         inkscape:connector-curvature="0"
         id="path3921"
         d="M 0,0 5,-5 -12.5,0 5,5 Z"
         style="fill:#000000;fill-opacity:1;fill-rule:evenodd;stroke:#000000;stroke-width:1.00000003pt;stroke-opacity:1"
         transform="matrix(-0.8,0,0,-0.8,-10,0)" />
    </marker>
    <marker
       inkscape:isstock="true"
       style="overflow:visible"
       id="marker3835"
       refX="0"
       refY="0"
       orient="auto"
       inkscape:stockid="Arrow1Lend">
      <path
         transform="matrix(-0.8,0,0,-0.8,-10,0)"
         style="fill:#000000;fill-opacity:1;fill-rule:evenodd;stroke:#000000;stroke-width:1.00000003pt;stroke-opacity:1"
         d="M 0,0 5,-5 -12.5,0 5,5 Z"
         id="path3833"
         inkscape:connector-curvature="0" />
    </marker>
    <marker
       inkscape:isstock="true"
       style="overflow:visible"
       id="marker3741"
       refX="0"
       refY="0"
       orient="auto"
       inkscape:stockid="Arrow1Lend">
      <path
         transform="matrix(-0.8,0,0,-0.8,-10,0)"
         style="fill:#000000;fill-opacity:1;fill-rule:evenodd;stroke:#000000;stroke-width:1.00000003pt;stroke-opacity:1"
         d="M 0,0 5,-5 -12.5,0 5,5 Z"
         id="path3739"
         inkscape:connector-curvature="0" />
    </marker>
    <marker
       inkscape:isstock="true"
       style="overflow:visible"
       id="marker3343"
       refX="0"
       refY="0"
       orient="auto"
       inkscape:stockid="Arrow1Lend"
       inkscape:collect="always">
      <path
         transform="matrix(-0.8,0,0,-0.8,-10,0)"
         style="fill:#000000;fill-opacity:1;fill-rule:evenodd;stroke:#000000;stroke-width:1.00000003pt;stroke-opacity:1"
         d="M 0,0 5,-5 -12.5,0 5,5 Z"
         id="path3341"
         inkscape:connector-curvature="0" />
    </marker>
    <marker
       inkscape:stockid="Arrow1Lend"
       orient="auto"
       refY="0"
       refX="0"
       id="marker3047"
       style="overflow:visible"
       inkscape:isstock="true"
       inkscape:collect="always">
      <path
         inkscape:connector-curvature="0"
         id="path3045"
         d="M 0,0 5,-5 -12.5,0 5,5 Z"
         style="fill:#000000;fill-opacity:1;fill-rule:evenodd;stroke:#000000;stroke-width:1.00000003pt;stroke-opacity:1"
         transform="matrix(-0.8,0,0,-0.8,-10,0)" />
    </marker>
    <marker
       inkscape:stockid="Arrow1Lend"
       orient="auto"
       refY="0"
       refX="0"
       id="marker2891"
       style="overflow:visible"
       inkscape:isstock="true"
       inkscape:collect="always">
      <path
         inkscape:connector-curvature="0"
         id="path2889"
         d="M 0,0 5,-5 -12.5,0 5,5 Z"
         style="fill:#000000;fill-opacity:1;fill-rule:evenodd;stroke:#000000;stroke-width:1.00000003pt;stroke-opacity:1"
         transform="matrix(-0.8,0,0,-0.8,-10,0)" />
    </marker>
    <marker
       inkscape:isstock="true"
       style="overflow:visible"
       id="marker2747"
       refX="0"
       refY="0"
       orient="auto"
       inkscape:stockid="Arrow1Lend"
       inkscape:collect="always">
      <path
         transform="matrix(-0.8,0,0,-0.8,-10,0)"
         style="fill:#000000;fill-opacity:1;fill-rule:evenodd;stroke:#000000;stroke-width:1.00000003pt;stroke-opacity:1"
         d="M 0,0 5,-5 -12.5,0 5,5 Z"
         id="path2745"
         inkscape:connector-curvature="0" />
    </marker>
    <marker
       inkscape:stockid="Arrow1Lend"
       orient="auto"
       refY="0"
       refX="0"
       id="marker1753"
       style="overflow:visible"
       inkscape:isstock="true">
      <path
         inkscape:connector-curvature="0"
         id="path1751"
         d="M 0,0 5,-5 -12.5,0 5,5 Z"
         style="fill:#000000;fill-opacity:1;fill-rule:evenodd;stroke:#000000;stroke-width:1.00000003pt;stroke-opacity:1"
         transform="matrix(-0.8,0,0,-0.8,-10,0)" />
    </marker>
    <marker
       inkscape:stockid="Arrow1Lend"
       orient="auto"
       refY="0"
       refX="0"
       id="marker3405"
       style="overflow:visible"
       inkscape:isstock="true">
      <path
         id="path3403"
         d="M 0,0 5,-5 -12.5,0 5,5 Z"
         style="fill:#000000;fill-opacity:1;fill-rule:evenodd;stroke:#000000;stroke-width:1.00000003pt;stroke-opacity:1"
         transform="matrix(-0.8,0,0,-0.8,-10,0)"
         inkscape:connector-curvature="0" />
    </marker>
    <marker
       inkscape:stockid="Arrow2Mend"
       orient="auto"
       refY="0"
       refX="0"
       id="Arrow2Mend"
       style="overflow:visible"
       inkscape:isstock="true">
      <path
         id="path1820"
         style="fill:#000000;fill-opacity:1;fill-rule:evenodd;stroke:#000000;stroke-width:0.625;stroke-linejoin:round;stroke-opacity:1"
         d="M 8.7185878,4.0337352 -2.2072895,0.01601326 8.7185884,-4.0017078 c -1.7454984,2.3720609 -1.7354408,5.6174519 -6e-7,8.035443 z"
         transform="scale(-0.6)"
         inkscape:connector-curvature="0" />
    </marker>
    <marker
       inkscape:stockid="Arrow1Lstart"
       orient="auto"
       refY="0"
       refX="0"
       id="marker2801"
       style="overflow:visible"
       inkscape:isstock="true">
      <path
         id="path2799"
         d="M 0,0 5,-5 -12.5,0 5,5 Z"
         style="fill:#000000;fill-opacity:1;fill-rule:evenodd;stroke:#000000;stroke-width:1.00000003pt;stroke-opacity:1"
         transform="matrix(0.8,0,0,0.8,10,0)"
         inkscape:connector-curvature="0" />
    </marker>
    <marker
       inkscape:isstock="true"
       style="overflow:visible"
       id="marker2077"
       refX="0"
       refY="0"
       orient="auto"
       inkscape:stockid="Arrow1Lstart">
      <path
         transform="matrix(0.8,0,0,0.8,10,0)"
         style="fill:#000000;fill-opacity:1;fill-rule:evenodd;stroke:#000000;stroke-width:1.00000003pt;stroke-opacity:1"
         d="M 0,0 5,-5 -12.5,0 5,5 Z"
         id="path2075"
         inkscape:connector-curvature="0" />
    </marker>
  </defs>
  <sodipodi:namedview
     id="base"
     pagecolor="#ffffff"
     bordercolor="#666666"
     borderopacity="1.0"
     inkscape:pageopacity="0.0"
     inkscape:pageshadow="2"
     inkscape:zoom="1.7315428"
     inkscape:cx="348.24346"
     inkscape:cy="383.28968"
     inkscape:document-units="mm"
     inkscape:current-layer="layer1"
     showgrid="false"
     inkscape:window-width="3200"
     inkscape:window-height="1657"
     inkscape:window-x="0"
     inkscape:window-y="0"
     inkscape:window-maximized="1"
     fit-margin-top="0"
     fit-margin-left="0"
     fit-margin-right="0"
     fit-margin-bottom="0" />
  <metadata
     id="metadata5">
    <rdf:RDF>
      <cc:Work
         rdf:about="">
        <dc:format>image/svg+xml</dc:format>
        <dc:type
           rdf:resource="http://purl.org/dc/dcmitype/StillImage" />
        <dc:title />
      </cc:Work>
    </rdf:RDF>
  </metadata>
  <g
     inkscape:label="Calque 1"
     inkscape:groupmode="layer"
     id="layer1"
     transform="translate(18.060696,42.723741)"
     style="display:inline">
    <g
       id="g2543">
      <g
         transform="translate(13.550704,-74.932276)"
         id="g3451">
        <path
           id="path979"
           d="m 57.334695,145.3404 h 9.69146 c 0.534969,0 0.969147,-0.43321 0.969147,-0.96915 0,-0.53594 -0.434178,-0.96914 -0.969147,-0.96914 h -9.69146 c -0.534969,0 -0.969147,0.4332 -0.969147,0.96914 0,0.53594 0.434178,0.96915 0.969147,0.96915 z"
           inkscape:connector-curvature="0"
           style="stroke-width:0.96914607" />
        <path
           id="path981"
           d="M 81.563347,158.90844 H 57.334695 c -0.534969,0 -0.969147,0.43321 -0.969147,0.96915 0,0.53594 0.434178,0.96915 0.969147,0.96915 h 24.228652 c 0.534969,0 0.969146,-0.43321 0.969146,-0.96915 0,-0.53594 -0.434177,-0.96915 -0.969146,-0.96915 z"
           inkscape:connector-curvature="0"
           style="stroke-width:0.96914607" />
        <path
           id="path983"
           d="M 81.563347,166.66161 H 57.334695 c -0.534969,0 -0.969147,0.43321 -0.969147,0.96915 0,0.53594 0.434178,0.96914 0.969147,0.96914 h 24.228652 c 0.534969,0 0.969146,-0.4332 0.969146,-0.96914 0,-0.53594 -0.434177,-0.96915 -0.969146,-0.96915 z"
           inkscape:connector-curvature="0"
           style="stroke-width:0.96914607" />
        <path
           id="path985"
           d="M 81.563347,174.41478 H 57.334695 c -0.534969,0 -0.969147,0.43321 -0.969147,0.96915 0,0.53594 0.434178,0.96914 0.969147,0.96914 h 24.228652 c 0.534969,0 0.969146,-0.4332 0.969146,-0.96914 0,-0.53594 -0.434177,-0.96915 -0.969146,-0.96915 z"
           inkscape:connector-curvature="0"
           style="stroke-width:0.96914607" />
        <path
           id="path987"
           d="M 78.087989,129.83406 H 46.674088 v 58.14877 h 45.549866 v -44.0128 z m 0.56792,3.30866 10.25938,10.25939 h -10.25938 z m -30.04353,52.90181 v -54.27218 h 28.105237 v 13.56805 h 13.568046 v 40.70413 z"
           inkscape:connector-curvature="0"
           style="stroke-width:0.96914607" />
        <path
           style="stroke-width:0.96914607"
           inkscape:connector-curvature="0"
           d="M 81.563347,151.3401 H 57.334695 c -0.534969,0 -0.969147,0.43321 -0.969147,0.96915 0,0.53594 0.434178,0.96915 0.969147,0.96915 h 24.228652 c 0.534969,0 0.969146,-0.43321 0.969146,-0.96915 0,-0.53594 -0.434177,-0.96915 -0.969146,-0.96915 z"
           id="path3443" />
      </g>
      <g
         id="g3598"
         transform="matrix(0.62580386,0,0,0.62580386,62.974002,63.950444)"
         style="fill:#2196f3">
        <g
           id="g3596"
           style="fill:#2196f3">
          <g
             id="g3566"
             style="fill:#2196f3">
            <path
               inkscape:connector-curvature="0"
               d="M 25,46.998 C 19.123,46.998 13.599,44.71 9.443,40.555 5.288,36.401 3,30.877 3,24.999 3,19.122 5.288,13.598 9.443,9.443 13.599,5.288 19.123,3 25,3 c 5.877,0 11.401,2.288 15.557,6.443 8.577,8.577 8.577,22.534 0,31.111 C 36.401,44.71 30.877,46.998 25,46.998 Z M 25,5 C 19.657,5 14.635,7.08 10.857,10.857 7.08,14.634 5,19.656 5,24.999 c 0,5.343 2.08,10.365 5.857,14.142 3.777,3.777 8.8,5.857 14.143,5.857 5.343,0 10.365,-2.08 14.143,-5.857 7.798,-7.798 7.798,-20.485 0,-28.283 C 35.365,7.08 30.343,5 25,5 Z"
               id="path3564"
               style="fill:#2196f3" />
          </g>
          <g
             id="g3570"
             style="fill:#2196f3">
            <path
               inkscape:connector-curvature="0"
               d="m 25,49.998 c -6.678,0 -12.956,-2.6 -17.678,-7.321 C 2.6,37.956 0.001,31.677 0,24.999 0,18.321 2.601,12.043 7.322,7.322 12.045,2.601 18.323,0 25,0 c 6.678,0 12.956,2.601 17.678,7.322 9.747,9.747 9.747,25.606 0,35.354 C 37.955,47.398 31.677,49.998 25,49.998 Z M 25,2 C 18.857,2 13.081,4.393 8.736,8.736 4.393,13.08 2,18.855 2,24.999 c 10e-4,6.144 2.393,11.92 6.736,16.264 4.343,4.344 10.12,6.735 16.264,6.735 6.143,0 11.919,-2.392 16.264,-6.735 8.967,-8.968 8.967,-23.56 0,-32.526 C 36.92,4.393 31.144,2 25,2 Z"
               id="path3568"
               style="fill:#2196f3" />
          </g>
          <g
             id="g3574"
             style="fill:#2196f3">
            <path
               inkscape:connector-curvature="0"
               d="m 46.006,49.834 c -0.256,0 -0.512,-0.098 -0.707,-0.293 l -5.508,-5.509 c -0.391,-0.391 -0.391,-1.023 0,-1.414 0.391,-0.391 1.023,-0.391 1.414,0 l 5.508,5.509 c 0.391,0.391 0.391,1.023 0,1.414 -0.195,0.195 -0.451,0.293 -0.707,0.293 z"
               id="path3572"
               style="fill:#2196f3" />
          </g>
          <g
             id="g3578"
             style="fill:#2196f3">
            <path
               inkscape:connector-curvature="0"
               d="m 48.834,47.006 c -0.256,0 -0.512,-0.098 -0.707,-0.293 l -5.514,-5.515 c -0.391,-0.391 -0.391,-1.023 0,-1.414 0.391,-0.391 1.023,-0.391 1.414,0 l 5.514,5.515 c 0.391,0.391 0.391,1.023 0,1.414 -0.195,0.195 -0.451,0.293 -0.707,0.293 z"
               id="path3576"
               style="fill:#2196f3" />
          </g>
          <g
             id="g3582"
             style="fill:#2196f3">
            <path
               inkscape:connector-curvature="0"
               d="m 44.592,51.248 c -0.256,0 -0.512,-0.098 -0.707,-0.293 -0.391,-0.391 -0.391,-1.023 0,-1.414 l 5.656,-5.658 c 0.391,-0.391 1.023,-0.391 1.414,0 0.391,0.391 0.391,1.023 0,1.414 l -5.656,5.658 c -0.195,0.195 -0.451,0.293 -0.707,0.293 z"
               id="path3580"
               style="fill:#2196f3" />
          </g>
          <g
             id="g3586"
             style="fill:#2196f3">
            <path
               inkscape:connector-curvature="0"
               d="m 56.172,62.828 c -0.256,0 -0.512,-0.098 -0.707,-0.293 l -11.58,-11.58 c -0.391,-0.391 -0.391,-1.023 0,-1.414 0.391,-0.391 1.023,-0.391 1.414,0 l 11.58,11.58 c 0.391,0.391 0.391,1.023 0,1.414 -0.195,0.195 -0.451,0.293 -0.707,0.293 z"
               id="path3584"
               style="fill:#2196f3" />
          </g>
          <g
             id="g3590"
             style="fill:#2196f3">
            <path
               inkscape:connector-curvature="0"
               d="m 61.828,57.173 c -0.256,0 -0.512,-0.098 -0.707,-0.293 L 49.541,45.297 c -0.391,-0.391 -0.391,-1.023 0,-1.414 0.391,-0.391 1.023,-0.391 1.414,0 l 11.58,11.583 c 0.391,0.391 0.391,1.023 0,1.414 -0.195,0.195 -0.451,0.293 -0.707,0.293 z"
               id="path3588"
               style="fill:#2196f3" />
          </g>
          <g
             id="g3594"
             style="fill:#2196f3">
            <path
               inkscape:connector-curvature="0"
               d="m 59.001,64 c -1.336,0 -2.592,-0.521 -3.536,-1.465 -0.391,-0.391 -0.391,-1.023 0,-1.414 0.391,-0.391 1.023,-0.391 1.414,0 1.132,1.132 3.109,1.136 4.241,0 C 61.687,60.555 62,59.801 62,58.999 62,58.198 61.688,57.446 61.122,56.881 60.73,56.49 60.73,55.858 61.12,55.467 c 0.391,-0.393 1.025,-0.391 1.414,-0.002 0.945,0.943 1.466,2.198 1.466,3.534 0,1.336 -0.521,2.592 -1.465,3.536 C 61.592,63.479 60.337,64 59.001,64 Z"
               id="path3592"
               style="fill:#2196f3" />
          </g>
        </g>
      </g>
      <text
         xml:space="preserve"
         style="font-style:normal;font-weight:normal;font-size:10.58333397px;line-height:1.25;font-family:sans-serif;letter-spacing:0px;word-spacing:0px;fill:#2196f3;fill-opacity:1;stroke:none;stroke-width:0.26458335"
         x="62.362743"
         y="49.460255"
         id="text4293"><tspan
           sodipodi:role="line"
           id="tspan4291"
           x="62.362743"
           y="49.460255"
           style="fill:#2196f3;stroke-width:0.26458335">Monitor</tspan></text>
      <text
         xml:space="preserve"
         style="font-style:normal;font-weight:normal;font-size:6.3499999px;line-height:1.25;font-family:sans-serif;text-align:center;letter-spacing:0px;word-spacing:0px;text-anchor:middle;fill:#000000;fill-opacity:1;stroke:none;stroke-width:0.26458335"
         x="82.751678"
         y="123.16673"
         id="text4301"><tspan
           sodipodi:role="line"
           x="83.762466"
           y="123.16673"
           style="font-size:6.3499999px;text-align:center;text-anchor:middle;stroke-width:0.26458335"
           id="tspan4303">get requests </tspan><tspan
           sodipodi:role="line"
           x="82.751678"
           y="131.10423"
           style="font-size:6.3499999px;text-align:center;text-anchor:middle;stroke-width:0.26458335"
           id="tspan1546">from access log</tspan></text>
    </g>
    <g
       id="g1598"
       transform="translate(-66.82957,-159.07541)">
      <rect
         y="129.40289"
         x="120.18719"
         height="58.357143"
         width="58.357143"
         id="rect4485"
         style="fill:none;stroke:#000000;stroke-width:0.44560343;stroke-miterlimit:4;stroke-dasharray:none" />
      <rect
         y="138.39568"
         x="121.12865"
         height="48.421841"
         width="56.474205"
         id="rect4493"
         style="fill:none;stroke:#000000;stroke-width:0.47397375;stroke-miterlimit:4;stroke-dasharray:none" />
      <rect
         style="fill:none;stroke:#000000;stroke-width:0.44560343;stroke-miterlimit:4;stroke-dasharray:none"
         id="rect4497"
         width="56.474205"
         height="7.1909313"
         x="121.12865"
         y="130.36259" />
      <circle
         r="2.7987609"
         cy="133.98808"
         cx="160.799"
         id="path4515"
         style="fill:none;stroke:#000000;stroke-width:0.44560343;stroke-miterlimit:4;stroke-dasharray:none" />
      <circle
         style="fill:none;stroke:#000000;stroke-width:0.44560343;stroke-miterlimit:4;stroke-dasharray:none"
         id="circle4517"
         cx="167.43217"
         cy="133.98808"
         r="2.7987609" />
      <circle
         r="2.7987609"
         cy="133.98808"
         cx="174.06535"
         id="circle4519"
         style="fill:none;stroke:#000000;stroke-width:0.44560343;stroke-miterlimit:4;stroke-dasharray:none" />
      <text
         xml:space="preserve"
         style="font-style:normal;font-weight:normal;font-size:4.23333359px;line-height:1.25;font-family:sans-serif;letter-spacing:0px;word-spacing:0px;fill:#2196f3;fill-opacity:1;stroke:none;stroke-width:0.26458335"
         x="123.16476"
         y="155.93207"
         id="text5239"><tspan
           sodipodi:role="line"
           x="123.16476"
           y="155.93207"
           style="font-size:4.23333359px;fill:#2196f3;stroke-width:0.26458335"
           id="tspan1527">$avg_tps += $tps</tspan><tspan
           sodipodi:role="line"
           x="123.16476"
           y="161.22374"
           style="font-size:4.23333359px;fill:#2196f3;stroke-width:0.26458335"
           id="tspan1536">if($_period == $period){</tspan><tspan
           sodipodi:role="line"
           x="123.16476"
           y="166.5154"
           style="font-size:4.23333359px;fill:#2196f3;stroke-width:0.26458335"
           id="tspan1540">  $avg_tps /= $nr_tps;</tspan><tspan
           sodipodi:role="line"
           x="123.16476"
           y="171.80707"
           style="font-size:4.23333359px;fill:#2196f3;stroke-width:0.26458335"
           id="tspan1542">}</tspan></text>
      <text
         id="text5257"
         y="124.39253"
         x="127.77792"
         style="font-style:normal;font-weight:normal;font-size:10.58333397px;line-height:1.25;font-family:sans-serif;letter-spacing:0px;word-spacing:0px;fill:#2196f3;fill-opacity:1;stroke:none;stroke-width:0.26458335"
         xml:space="preserve"><tspan
           style="fill:#2196f3;stroke-width:0.26458335"
           y="124.39253"
           x="127.77792"
           id="tspan5255"
           sodipodi:role="line">Analysis</tspan></text>
    </g>
    <g
       id="g1645"
       transform="translate(-24.050003,-159.07542)">
      <rect
         style="fill:none;stroke:#000000;stroke-width:0.44560343;stroke-miterlimit:4;stroke-dasharray:none"
         id="rect5577"
         width="58.357143"
         height="58.357143"
         x="207.0804"
         y="129.40289" />
      <rect
         style="fill:none;stroke:#000000;stroke-width:0.47397375;stroke-miterlimit:4;stroke-dasharray:none"
         id="rect5579"
         width="56.474205"
         height="48.421841"
         x="208.02187"
         y="138.39568" />
      <rect
         y="130.36259"
         x="208.02187"
         height="7.1909313"
         width="56.474205"
         id="rect5581"
         style="fill:none;stroke:#000000;stroke-width:0.44560343;stroke-miterlimit:4;stroke-dasharray:none" />
      <circle
         style="fill:none;stroke:#000000;stroke-width:0.44560343;stroke-miterlimit:4;stroke-dasharray:none"
         id="circle5583"
         cx="247.69221"
         cy="133.98808"
         r="2.7987609" />
      <circle
         r="2.7987609"
         cy="133.98808"
         cx="254.32539"
         id="circle5585"
         style="fill:none;stroke:#000000;stroke-width:0.44560343;stroke-miterlimit:4;stroke-dasharray:none" />
      <circle
         style="fill:none;stroke:#000000;stroke-width:0.44560343;stroke-miterlimit:4;stroke-dasharray:none"
         id="circle5587"
         cx="260.95856"
         cy="133.98808"
         r="2.7987609" />
      <text
         xml:space="preserve"
         style="font-style:normal;font-weight:normal;font-size:10.58333397px;line-height:1.25;font-family:sans-serif;letter-spacing:0px;word-spacing:0px;fill:#2196f3;fill-opacity:1;stroke:none;stroke-width:0.26458335"
         x="224.92891"
         y="124.39253"
         id="text5641"><tspan
           sodipodi:role="line"
           id="tspan5639"
           x="224.92891"
           y="124.39253"
           style="fill:#2196f3;stroke-width:0.26458335">Plan</tspan></text>
      <text
         xml:space="preserve"
         style="font-style:normal;font-weight:normal;font-size:4.23333406px;line-height:1.25;font-family:sans-serif;letter-spacing:0px;word-spacing:0px;display:inline;fill:#2196f3;fill-opacity:1;stroke:none;stroke-width:0.26458338"
         x="214.74193"
         y="147.99457"
         id="text5239-1"><tspan
           sodipodi:role="line"
           id="tspan5237-0"
           x="214.74193"
           y="147.99457"
           style="font-size:4.23333406px;fill:#2196f3;stroke-width:0.26458338">if($avg_tps &lt; $ref){</tspan><tspan
           sodipodi:role="line"
           x="214.74193"
           y="153.28624"
           style="font-size:4.23333406px;fill:#2196f3;stroke-width:0.26458338"
           id="tspan1427-4">  $color = $RED;</tspan><tspan
           sodipodi:role="line"
           x="214.74193"
           y="158.5779"
           style="font-size:4.23333406px;fill:#2196f3;stroke-width:0.26458338"
           id="tspan1444-2">}elseif(#...){</tspan><tspan
           sodipodi:role="line"
           x="214.74193"
           y="163.86957"
           style="font-size:4.23333406px;fill:#2196f3;stroke-width:0.26458338"
           id="tspan1429-2">  $color = $YELLOW;</tspan><tspan
           sodipodi:role="line"
           x="214.74193"
           y="169.16124"
           style="font-size:4.23333406px;fill:#2196f3;stroke-width:0.26458338"
           id="tspan1431-2">}else{</tspan><tspan
           sodipodi:role="line"
           x="214.74193"
           y="174.45291"
           style="font-size:4.23333406px;fill:#2196f3;stroke-width:0.26458338"
           id="tspan1433-0">  $color = $GREEN;</tspan><tspan
           sodipodi:role="line"
           x="214.74193"
           y="179.74457"
           style="font-size:4.23333406px;fill:#2196f3;stroke-width:0.26458338"
           id="tspan5247-5">}</tspan><tspan
           sodipodi:role="line"
           x="214.74193"
           y="185.03624"
           style="font-size:4.23333406px;fill:#2196f3;stroke-width:0.26458338"
           id="tspan5241-5" /></text>
    </g>
    <g
       id="g2437">
      <g
         id="g3689" />
      <g
         id="g2458"
         transform="translate(5.3222294)">
        <g
           id="g2511">
          <text
             xml:space="preserve"
             style="font-style:normal;font-weight:normal;font-size:10.58333397px;line-height:1.25;font-family:sans-serif;letter-spacing:0px;word-spacing:0px;display:inline;fill:#2196f3;fill-opacity:1;stroke:none;stroke-width:0.26458335"
             x="185.48752"
             y="49.297474"
             id="text7434"><tspan
               sodipodi:role="line"
               id="tspan7432"
               x="185.48752"
               y="49.297474"
               style="fill:#2196f3;stroke-width:0.26458335">Execute</tspan></text>
          <text
             id="text7438"
             y="123.5326"
             x="206.89914"
             style="font-style:normal;font-weight:normal;font-size:6.3499999px;line-height:1.25;font-family:sans-serif;text-align:center;letter-spacing:0px;word-spacing:0px;text-anchor:middle;display:inline;fill:#000000;fill-opacity:1;stroke:none;stroke-width:0.26458335"
             xml:space="preserve"><tspan
               id="tspan7440"
               style="font-size:6.3499999px;text-align:center;text-anchor:middle;stroke-width:0.26458335"
               y="123.5326"
               x="206.89914"
               sodipodi:role="line">inform the kernel</tspan></text>
          <g
             transform="translate(0,-5.4882478)"
             id="g2083">
            <g
               id="g1630"
               transform="translate(-5.3222294)">
              <g
                 id="g1582"
                 transform="translate(-24.050003,-69.117048)">
                <rect
                   style="fill:none;stroke:#000000;stroke-width:0.44560343;stroke-miterlimit:4;stroke-dasharray:none"
                   id="rect1548"
                   width="58.357143"
                   height="58.357143"
                   x="207.0804"
                   y="129.40289" />
                <rect
                   style="fill:none;stroke:#000000;stroke-width:0.47397375;stroke-miterlimit:4;stroke-dasharray:none"
                   id="rect1550"
                   width="56.474205"
                   height="48.421841"
                   x="208.02187"
                   y="138.39568" />
                <rect
                   y="130.36259"
                   x="208.02187"
                   height="7.1909313"
                   width="56.474205"
                   id="rect1552"
                   style="fill:none;stroke:#000000;stroke-width:0.44560343;stroke-miterlimit:4;stroke-dasharray:none" />
                <circle
                   style="fill:none;stroke:#000000;stroke-width:0.44560343;stroke-miterlimit:4;stroke-dasharray:none"
                   id="circle1554"
                   cx="247.69221"
                   cy="133.98808"
                   r="2.7987609" />
                <circle
                   r="2.7987609"
                   cy="133.98808"
                   cx="254.32539"
                   id="circle1556"
                   style="fill:none;stroke:#000000;stroke-width:0.44560343;stroke-miterlimit:4;stroke-dasharray:none" />
                <circle
                   style="fill:none;stroke:#000000;stroke-width:0.44560343;stroke-miterlimit:4;stroke-dasharray:none"
                   id="circle1558"
                   cx="260.95856"
                   cy="133.98808"
                   r="2.7987609" />
                <text
                   xml:space="preserve"
                   style="font-style:normal;font-weight:normal;font-size:4.23333406px;line-height:1.25;font-family:sans-serif;letter-spacing:0px;word-spacing:0px;display:inline;fill:#2196f3;fill-opacity:1;stroke:none;stroke-width:0.26458338"
                   x="209.96497"
                   y="163.77449"
                   id="text1580"><tspan
                     sodipodi:role="line"
                     x="209.96497"
                     y="163.77449"
                     style="font-size:4.23333406px;fill:#2196f3;stroke-width:0.26458338"
                     id="tspan1578">write '/sys/fs/#..., $color;</tspan></text>
              </g>
            </g>
          </g>
        </g>
      </g>
    </g>
    <path
       style="fill:none;stroke:#000000;stroke-width:3;stroke-linecap:butt;stroke-linejoin:miter;stroke-miterlimit:4;stroke-dasharray:9, 3;stroke-dashoffset:0;stroke-opacity:1"
       d="M -0.03063041,143.5208 H 279.53329"
       id="path1632"
       inkscape:connector-curvature="0" />
    <text
       xml:space="preserve"
       style="font-style:normal;font-weight:normal;font-size:12.69999981px;line-height:1.25;font-family:sans-serif;letter-spacing:0px;word-spacing:0px;fill:#2196f3;fill-opacity:1;stroke:none;stroke-width:0.26458332"
       x="0.42809656"
       y="133.6432"
       id="text1636"><tspan
         sodipodi:role="line"
         id="tspan1634"
         x="0.42809656"
         y="133.6432"
         style="font-size:12.69999981px;fill:#2196f3;stroke-width:0.26458332">User</tspan></text>
    <text
       id="text1640"
       y="160.10156"
       x="-18.897854"
       style="font-style:normal;font-weight:normal;font-size:12.69999981px;line-height:1.25;font-family:sans-serif;letter-spacing:0px;word-spacing:0px;fill:#ff9800;fill-opacity:1;stroke:none;stroke-width:0.26458332"
       xml:space="preserve"><tspan
         style="font-size:12.69999981px;fill:#ff9800;stroke-width:0.26458332"
         y="160.10156"
         x="-18.897854"
         id="tspan1638"
         sodipodi:role="line">Supervisor</tspan></text>
    <path
       style="fill:none;stroke:#000000;stroke-width:0.5;stroke-linecap:butt;stroke-linejoin:miter;stroke-miterlimit:4;stroke-dasharray:none;stroke-opacity:1;marker-end:url(#marker2747)"
       d="M 82.536189,40.087493 V 29.891472"
       id="path2737"
       inkscape:connector-curvature="0"
       sodipodi:nodetypes="cc" />
    <path
       sodipodi:nodetypes="cc"
       inkscape:connector-curvature="0"
       id="path2887"
       d="M 212.20897,28.920791 V 39.116812"
       style="fill:none;stroke:#000000;stroke-width:0.5;stroke-linecap:butt;stroke-linejoin:miter;stroke-miterlimit:4;stroke-dasharray:none;stroke-opacity:1;marker-end:url(#marker2891)" />
    <path
       style="fill:none;stroke:#000000;stroke-width:0.5;stroke-linecap:butt;stroke-linejoin:miter;stroke-miterlimit:4;stroke-dasharray:none;stroke-opacity:1;marker-end:url(#marker3047)"
       d="m 112.61066,-6.9081514 h 69.04228"
       id="path3157"
       inkscape:connector-curvature="0"
       sodipodi:nodetypes="cc" />
    <path
       sodipodi:nodetypes="cc"
       inkscape:connector-curvature="0"
       id="path3339"
       d="M 177.33195,82.60235 H 108.28967"
       style="fill:none;stroke:#000000;stroke-width:0.5;stroke-linecap:butt;stroke-linejoin:miter;stroke-miterlimit:4;stroke-dasharray:none;stroke-opacity:1;marker-end:url(#marker3343)" />
    <g
       id="g569">
      <g
         transform="translate(60.61865,118.83492)"
         id="g4122">
        <rect
           y="129.40289"
           x="120.18719"
           height="58.357143"
           width="58.357143"
           id="rect3551"
           style="fill:none;stroke:#000000;stroke-width:0.44560343;stroke-miterlimit:4;stroke-dasharray:none" />
        <rect
           y="138.39568"
           x="121.12865"
           height="48.421841"
           width="56.474205"
           id="rect3553"
           style="fill:none;stroke:#000000;stroke-width:0.47397375;stroke-miterlimit:4;stroke-dasharray:none" />
        <rect
           style="fill:none;stroke:#000000;stroke-width:0.44560343;stroke-miterlimit:4;stroke-dasharray:none"
           id="rect3555"
           width="56.474205"
           height="7.1909313"
           x="121.12865"
           y="130.36259" />
        <circle
           r="2.7987609"
           cy="133.98808"
           cx="160.799"
           id="circle3557"
           style="fill:none;stroke:#000000;stroke-width:0.44560343;stroke-miterlimit:4;stroke-dasharray:none" />
        <circle
           style="fill:none;stroke:#000000;stroke-width:0.44560343;stroke-miterlimit:4;stroke-dasharray:none"
           id="circle3559"
           cx="167.43217"
           cy="133.98808"
           r="2.7987609" />
        <circle
           r="2.7987609"
           cy="133.98808"
           cx="174.06535"
           id="circle3561"
           style="fill:none;stroke:#000000;stroke-width:0.44560343;stroke-miterlimit:4;stroke-dasharray:none" />
        <text
           xml:space="preserve"
           style="font-style:normal;font-weight:normal;font-size:4.23333359px;line-height:1.25;font-family:sans-serif;letter-spacing:0px;word-spacing:0px;fill:#ff9800;fill-opacity:1;stroke:none;stroke-width:0.26458335"
           x="123.16476"
           y="155.93207"
           id="text3571"><tspan
             sodipodi:role="line"
             x="123.16476"
             y="155.93207"
             style="font-size:4.23333359px;fill:#ff9800;stroke-width:0.26458335"
             id="tspan3569">for_each_mem_cgroup(i)</tspan><tspan
             sodipodi:role="line"
             x="123.16476"
             y="161.22374"
             style="font-size:4.23333359px;fill:#ff9800;stroke-width:0.26458335"
             id="tspan4269">  if (<tspan
   style="fill:#2196f3"
   id="tspan1187">i-&gt;color</tspan> == GREEN)</tspan><tspan
             sodipodi:role="line"
             x="123.16476"
             y="166.5154"
             style="font-size:4.23333359px;fill:#ff9800;stroke-width:0.26458335"
             id="tspan4271">    list_add(i, greens);    </tspan></text>
      </g>
      <text
         xml:space="preserve"
         style="font-style:normal;font-weight:normal;font-size:10.58333397px;line-height:1.25;font-family:sans-serif;letter-spacing:0px;word-spacing:0px;fill:#ff9800;fill-opacity:1;stroke:none;stroke-width:0.26458335"
         x="188.39656"
         y="243.22745"
         id="text3575"><tspan
           sodipodi:role="line"
           id="tspan3573"
           x="188.39656"
           y="243.22745"
           style="fill:#ff9800;stroke-width:0.26458335">Analysis</tspan></text>
    </g>
    <g
       id="g585">
      <g
         transform="translate(127.44822,99.777427)"
         id="g3549">
        <text
           xml:space="preserve"
           style="font-style:normal;font-weight:normal;font-size:10.58333397px;line-height:1.25;font-family:sans-serif;letter-spacing:0px;word-spacing:0px;fill:#ff9800;fill-opacity:1;stroke:none;stroke-width:0.26458335"
           x="62.362743"
           y="60.481087"
           id="text3541"><tspan
             sodipodi:role="line"
             id="tspan3539"
             x="62.362743"
             y="60.481087"
             style="fill:#ff9800;stroke-width:0.26458335">Monitor</tspan></text>
      </g>
      <g
         id="g4146"
         transform="translate(60.61865,34.532406)">
        <rect
           style="fill:none;stroke:#000000;stroke-width:0.44560343;stroke-miterlimit:4;stroke-dasharray:none"
           id="rect4124"
           width="58.357143"
           height="58.357143"
           x="120.18719"
           y="129.40289" />
        <rect
           style="fill:none;stroke:#000000;stroke-width:0.47397375;stroke-miterlimit:4;stroke-dasharray:none"
           id="rect4126"
           width="56.474205"
           height="48.421841"
           x="121.12865"
           y="138.39568" />
        <rect
           y="130.36259"
           x="121.12865"
           height="7.1909313"
           width="56.474205"
           id="rect4128"
           style="fill:none;stroke:#000000;stroke-width:0.44560343;stroke-miterlimit:4;stroke-dasharray:none" />
        <circle
           style="fill:none;stroke:#000000;stroke-width:0.44560343;stroke-miterlimit:4;stroke-dasharray:none"
           id="circle4130"
           cx="160.799"
           cy="133.98808"
           r="2.7987609" />
        <circle
           r="2.7987609"
           cy="133.98808"
           cx="167.43217"
           id="circle4132"
           style="fill:none;stroke:#000000;stroke-width:0.44560343;stroke-miterlimit:4;stroke-dasharray:none" />
        <circle
           style="fill:none;stroke:#000000;stroke-width:0.44560343;stroke-miterlimit:4;stroke-dasharray:none"
           id="circle4134"
           cx="174.06535"
           cy="133.98808"
           r="2.7987609" />
        <text
           id="text4144"
           y="155.93207"
           x="123.16476"
           style="font-style:normal;font-weight:normal;font-size:4.23333359px;line-height:1.25;font-family:sans-serif;letter-spacing:0px;word-spacing:0px;fill:#ff9800;fill-opacity:1;stroke:none;stroke-width:0.26458335"
           xml:space="preserve"><tspan
             id="tspan4142"
             style="font-size:4.23333359px;fill:#ff9800;stroke-width:0.26458335"
             y="155.93207"
             x="123.16476"
             sodipodi:role="line">if (memory_pressure)</tspan><tspan
             style="font-size:4.23333359px;fill:#ff9800;stroke-width:0.26458335"
             y="161.22374"
             x="123.16476"
             sodipodi:role="line"
             id="tspan4157">  mem_op_light();</tspan><tspan
             style="font-size:4.23333359px;fill:#ff9800;stroke-width:0.26458335"
             y="166.5154"
             x="123.16476"
             sodipodi:role="line"
             id="tspan4159" /></text>
      </g>
    </g>
    <g
       id="g3651"
       transform="translate(-183.9737,142.41154)">
      <g
         id="g3615" />
    </g>
    <path
       sodipodi:nodetypes="cc"
       inkscape:connector-curvature="0"
       id="path3653"
       d="M 80.311631,233.69531 V 223.49929"
       style="fill:none;stroke:#000000;stroke-width:0.5;stroke-linecap:butt;stroke-linejoin:miter;stroke-miterlimit:4;stroke-dasharray:none;stroke-opacity:1;marker-end:url(#marker4469)" />
    <path
       style="fill:none;stroke:#000000;stroke-width:0.5;stroke-linecap:butt;stroke-linejoin:miter;stroke-miterlimit:4;stroke-dasharray:none;stroke-opacity:1;marker-end:url(#marker3835)"
       d="m 209.98441,222.52861 v 10.19602"
       id="path3655"
       inkscape:connector-curvature="0"
       sodipodi:nodetypes="cc" />
    <path
       sodipodi:nodetypes="cc"
       inkscape:connector-curvature="0"
       id="path3657"
       d="m 110.3861,187.4215 h 69.04228"
       style="fill:none;stroke:#000000;stroke-width:0.5;stroke-linecap:butt;stroke-linejoin:miter;stroke-miterlimit:4;stroke-dasharray:none;stroke-opacity:1;marker-end:url(#marker3741)" />
    <path
       style="fill:none;stroke:#000000;stroke-width:0.5;stroke-linecap:butt;stroke-linejoin:miter;stroke-miterlimit:4;stroke-dasharray:none;stroke-opacity:1;marker-end:url(#marker3923)"
       d="M 175.10739,271.00218 H 106.06511"
       id="path3659"
       inkscape:connector-curvature="0"
       sodipodi:nodetypes="cc" />
    <g
       id="g288">
      <g
         id="g554">
        <text
           xml:space="preserve"
           style="font-style:normal;font-weight:normal;font-size:10.58333397px;line-height:1.25;font-family:sans-serif;letter-spacing:0px;word-spacing:0px;fill:#ff9800;fill-opacity:1;stroke:none;stroke-width:0.26458335"
           x="68.981575"
           y="244.25322"
           id="text3593"><tspan
             sodipodi:role="line"
             id="tspan3591"
             x="68.981575"
             y="244.25322"
             style="fill:#ff9800;stroke-width:0.26458335">Plan</tspan></text>
        <g
           id="g4615"
           transform="translate(-25.667882,-79.496159)">
          <path
             style="fill:#4caf50;stroke-width:0.04576862"
             sodipodi:nodetypes="csssssscscsssssss"
             inkscape:connector-curvature="0"
             id="path2"
             d="m 95.361193,327.51117 c -0.605702,0 -1.098447,0.49279 -1.098447,1.09845 v 10.98446 c 0,0.60566 0.492745,1.09845 1.098447,1.09845 h 21.236637 c 0.6057,0 1.09845,-0.49279 1.09845,-1.09845 v -10.98446 c 0,-0.60566 -0.49275,-1.09845 -1.09845,-1.09845 m 0.36615,12.08291 c 0,0.20189 -0.16426,0.36615 -0.36615,0.36615 H 95.361193 c -0.201886,0 -0.366149,-0.16426 -0.366149,-0.36615 v -10.98446 c 0,-0.20189 0.164263,-0.36615 0.366149,-0.36615 h 21.236637 c 0.20189,0 0.36615,0.16426 0.36615,0.36615 z" />
          <path
             style="fill:#4caf50;stroke-width:0.04576862"
             inkscape:connector-curvature="0"
             id="path4"
             d="m 105.97951,329.70806 c -0.2022,0 -0.36615,0.16395 -0.36615,0.36615 v 8.05528 c 0,0.2022 0.16395,0.36615 0.36615,0.36615 0.20221,0 0.36615,-0.16395 0.36615,-0.36615 v -8.05528 c 0,-0.2022 -0.16394,-0.36615 -0.36615,-0.36615 z" />
          <path
             style="fill:#4caf50;stroke-width:0.04576862"
             inkscape:connector-curvature="0"
             id="path6"
             d="m 104.14877,329.70806 c -0.20221,0 -0.36615,0.16395 -0.36615,0.36615 v 8.05528 c 0,0.2022 0.16394,0.36615 0.36615,0.36615 0.2022,0 0.36614,-0.16395 0.36614,-0.36615 v -8.05528 c 0,-0.2022 -0.16394,-0.36615 -0.36614,-0.36615 z" />
          <path
             style="fill:#4caf50;stroke-width:0.04576862"
             inkscape:connector-curvature="0"
             id="path8"
             d="m 102.31802,329.70806 c -0.2022,0 -0.36615,0.16395 -0.36615,0.36615 v 8.05528 c 0,0.2022 0.16395,0.36615 0.36615,0.36615 0.20221,0 0.36615,-0.16395 0.36615,-0.36615 v -8.05528 c 0,-0.2022 -0.16394,-0.36615 -0.36615,-0.36615 z" />
          <path
             style="fill:#4caf50;stroke-width:0.04576862"
             inkscape:connector-curvature="0"
             id="path10"
             d="m 100.48728,329.70806 c -0.20221,0 -0.36615,0.16395 -0.36615,0.36615 v 8.05528 c 0,0.2022 0.16394,0.36615 0.36615,0.36615 0.2022,0 0.36615,-0.16395 0.36615,-0.36615 v -8.05528 c 0,-0.2022 -0.16395,-0.36615 -0.36615,-0.36615 z" />
          <path
             style="fill:#4caf50;stroke-width:0.04576862"
             inkscape:connector-curvature="0"
             id="path12"
             d="m 113.30249,329.70806 c -0.20221,0 -0.36615,0.16395 -0.36615,0.36615 v 8.05528 c 0,0.2022 0.16394,0.36615 0.36615,0.36615 0.20221,0 0.36615,-0.16395 0.36615,-0.36615 v -8.05528 c 0,-0.2022 -0.16394,-0.36615 -0.36615,-0.36615 z" />
          <path
             style="fill:#4caf50;stroke-width:0.04576862"
             inkscape:connector-curvature="0"
             id="path14"
             d="m 115.13324,329.70806 c -0.20221,0 -0.36616,0.16395 -0.36616,0.36615 v 8.05528 c 0,0.2022 0.16395,0.36615 0.36616,0.36615 0.2022,0 0.36615,-0.16395 0.36615,-0.36615 v -8.05528 c 0,-0.2022 -0.16395,-0.36615 -0.36615,-0.36615 z" />
          <path
             style="fill:#4caf50;stroke-width:0.04576862"
             inkscape:connector-curvature="0"
             id="path16"
             d="m 98.656533,329.70806 c -0.202206,0 -0.366149,0.16395 -0.366149,0.36615 v 8.05528 c 0,0.2022 0.163943,0.36615 0.366149,0.36615 0.202206,0 0.366149,-0.16395 0.366149,-0.36615 v -8.05528 c 0,-0.2022 -0.163943,-0.36615 -0.366149,-0.36615 z" />
          <path
             style="fill:#4caf50;stroke-width:0.04576862"
             inkscape:connector-curvature="0"
             id="path18"
             d="m 96.825789,329.70806 c -0.202206,0 -0.366149,0.16395 -0.366149,0.36615 v 8.05528 c 0,0.2022 0.163943,0.36615 0.366149,0.36615 0.202205,0 0.366148,-0.16395 0.366148,-0.36615 v -8.05528 c 0,-0.2022 -0.163943,-0.36615 -0.366148,-0.36615 z" />
          <path
             style="fill:#4caf50;stroke-width:0.04576862"
             inkscape:connector-curvature="0"
             id="path20"
             d="m 111.47174,329.70806 c -0.2022,0 -0.36615,0.16395 -0.36615,0.36615 v 8.05528 c 0,0.2022 0.16395,0.36615 0.36615,0.36615 0.20221,0 0.36616,-0.16395 0.36616,-0.36615 v -8.05528 c 0,-0.2022 -0.16395,-0.36615 -0.36616,-0.36615 z" />
          <path
             style="fill:#4caf50;stroke-width:0.04576862"
             inkscape:connector-curvature="0"
             id="path22"
             d="m 109.641,329.70806 c -0.2022,0 -0.36615,0.16395 -0.36615,0.36615 v 8.05528 c 0,0.2022 0.16395,0.36615 0.36615,0.36615 0.2022,0 0.36615,-0.16395 0.36615,-0.36615 v -8.05528 c 0,-0.2022 -0.16395,-0.36615 -0.36615,-0.36615 z" />
          <path
             style="fill:#4caf50;stroke-width:0.04576862"
             inkscape:connector-curvature="0"
             id="path24"
             d="m 107.81025,329.70806 c -0.2022,0 -0.36614,0.16395 -0.36614,0.36615 v 8.05528 c 0,0.2022 0.16394,0.36615 0.36614,0.36615 0.20221,0 0.36616,-0.16395 0.36616,-0.36615 v -8.05528 c 0,-0.2022 -0.16395,-0.36615 -0.36616,-0.36615 z" />
        </g>
        <g
           id="g4629"
           transform="translate(-52.126224,-51.103758)">
          <path
             d="m 121.81952,327.51117 c -0.6057,0 -1.09844,0.49279 -1.09844,1.09845 v 10.98446 c 0,0.60566 0.49274,1.09845 1.09844,1.09845 h 21.23665 c 0.60571,0 1.09846,-0.49279 1.09846,-1.09845 v -10.98446 c 0,-0.60566 -0.49275,-1.09845 -1.09846,-1.09845 m 0.36615,12.08291 c 0,0.20189 -0.16426,0.36615 -0.36615,0.36615 h -21.23665 c -0.20188,0 -0.36615,-0.16426 -0.36615,-0.36615 v -10.98446 c 0,-0.20189 0.16427,-0.36615 0.36615,-0.36615 h 21.23665 c 0.20189,0 0.36615,0.16426 0.36615,0.36615 z"
             id="path4322"
             inkscape:connector-curvature="0"
             sodipodi:nodetypes="csssssscscsssssss"
             style="fill:#f44336;stroke-width:0.04576862" />
          <path
             d="m 132.43785,329.70806 c -0.20221,0 -0.36615,0.16395 -0.36615,0.36615 v 8.05528 c 0,0.2022 0.16394,0.36615 0.36615,0.36615 0.20221,0 0.36615,-0.16395 0.36615,-0.36615 v -8.05528 c 0,-0.2022 -0.16394,-0.36615 -0.36615,-0.36615 z"
             id="path4324"
             inkscape:connector-curvature="0"
             style="fill:#f44336;stroke-width:0.04576862" />
          <path
             d="m 130.6071,329.70806 c -0.2022,0 -0.36615,0.16395 -0.36615,0.36615 v 8.05528 c 0,0.2022 0.16395,0.36615 0.36615,0.36615 0.20221,0 0.36615,-0.16395 0.36615,-0.36615 v -8.05528 c 0,-0.2022 -0.16394,-0.36615 -0.36615,-0.36615 z"
             id="path4326"
             inkscape:connector-curvature="0"
             style="fill:#f44336;stroke-width:0.04576862" />
          <path
             d="m 128.77636,329.70806 c -0.20221,0 -0.36615,0.16395 -0.36615,0.36615 v 8.05528 c 0,0.2022 0.16394,0.36615 0.36615,0.36615 0.2022,0 0.36615,-0.16395 0.36615,-0.36615 v -8.05528 c 0,-0.2022 -0.16395,-0.36615 -0.36615,-0.36615 z"
             id="path4328"
             inkscape:connector-curvature="0"
             style="fill:#f44336;stroke-width:0.04576862" />
          <path
             d="m 126.94561,329.70806 c -0.2022,0 -0.36615,0.16395 -0.36615,0.36615 v 8.05528 c 0,0.2022 0.16395,0.36615 0.36615,0.36615 0.20221,0 0.36615,-0.16395 0.36615,-0.36615 v -8.05528 c 0,-0.2022 -0.16394,-0.36615 -0.36615,-0.36615 z"
             id="path4330"
             inkscape:connector-curvature="0"
             style="fill:#f44336;stroke-width:0.04576862" />
          <path
             d="m 139.76083,329.70806 c -0.2022,0 -0.36615,0.16395 -0.36615,0.36615 v 8.05528 c 0,0.2022 0.16395,0.36615 0.36615,0.36615 0.20221,0 0.36615,-0.16395 0.36615,-0.36615 v -8.05528 c 0,-0.2022 -0.16394,-0.36615 -0.36615,-0.36615 z"
             id="path4332"
             inkscape:connector-curvature="0"
             style="fill:#f44336;stroke-width:0.04576862" />
          <path
             d="m 141.59158,329.70806 c -0.20221,0 -0.36615,0.16395 -0.36615,0.36615 v 8.05528 c 0,0.2022 0.16394,0.36615 0.36615,0.36615 0.20221,0 0.36615,-0.16395 0.36615,-0.36615 v -8.05528 c 0,-0.2022 -0.16394,-0.36615 -0.36615,-0.36615 z"
             id="path4334"
             inkscape:connector-curvature="0"
             style="fill:#f44336;stroke-width:0.04576862" />
          <path
             d="m 125.11487,329.70806 c -0.20221,0 -0.36615,0.16395 -0.36615,0.36615 v 8.05528 c 0,0.2022 0.16394,0.36615 0.36615,0.36615 0.2022,0 0.36615,-0.16395 0.36615,-0.36615 v -8.05528 c 0,-0.2022 -0.16395,-0.36615 -0.36615,-0.36615 z"
             id="path4336"
             inkscape:connector-curvature="0"
             style="fill:#f44336;stroke-width:0.04576862" />
          <path
             d="m 123.28412,329.70806 c -0.2022,0 -0.36615,0.16395 -0.36615,0.36615 v 8.05528 c 0,0.2022 0.16395,0.36615 0.36615,0.36615 0.20221,0 0.36615,-0.16395 0.36615,-0.36615 v -8.05528 c 0,-0.2022 -0.16394,-0.36615 -0.36615,-0.36615 z"
             id="path4338"
             inkscape:connector-curvature="0"
             style="fill:#f44336;stroke-width:0.04576862" />
          <path
             d="m 137.93008,329.70806 c -0.2022,0 -0.36615,0.16395 -0.36615,0.36615 v 8.05528 c 0,0.2022 0.16395,0.36615 0.36615,0.36615 0.20221,0 0.36616,-0.16395 0.36616,-0.36615 v -8.05528 c 0,-0.2022 -0.16395,-0.36615 -0.36616,-0.36615 z"
             id="path4340"
             inkscape:connector-curvature="0"
             style="fill:#f44336;stroke-width:0.04576862" />
          <path
             d="m 136.09934,329.70806 c -0.2022,0 -0.36615,0.16395 -0.36615,0.36615 v 8.05528 c 0,0.2022 0.16395,0.36615 0.36615,0.36615 0.2022,0 0.36615,-0.16395 0.36615,-0.36615 v -8.05528 c 0,-0.2022 -0.16395,-0.36615 -0.36615,-0.36615 z"
             id="path4342"
             inkscape:connector-curvature="0"
             style="fill:#f44336;stroke-width:0.04576862" />
          <path
             d="m 134.26859,329.70806 c -0.2022,0 -0.36614,0.16395 -0.36614,0.36615 v 8.05528 c 0,0.2022 0.16394,0.36615 0.36614,0.36615 0.20221,0 0.36615,-0.16395 0.36615,-0.36615 v -8.05528 c 0,-0.2022 -0.16394,-0.36615 -0.36615,-0.36615 z"
             id="path4344"
             inkscape:connector-curvature="0"
             style="fill:#f44336;stroke-width:0.04576862" />
        </g>
        <text
           xml:space="preserve"
           style="font-style:normal;font-variant:normal;font-weight:normal;font-stretch:normal;font-size:6.3499999px;line-height:1.25;font-family:sans-serif;-inkscape-font-specification:'sans-serif, Normal';font-variant-ligatures:normal;font-variant-caps:normal;font-variant-numeric:normal;font-feature-settings:normal;text-align:center;letter-spacing:0px;word-spacing:0px;writing-mode:lr-tb;text-anchor:middle;fill:#000000;fill-opacity:1;stroke:none;stroke-width:0.26458332"
           x="80.224815"
           y="298.79034"
           id="text4348"><tspan
             sodipodi:role="line"
             id="tspan4346"
             x="81.235603"
             y="298.79034"
             style="font-style:normal;font-variant:normal;font-weight:normal;font-stretch:normal;font-size:6.3499999px;font-family:sans-serif;-inkscape-font-specification:'sans-serif, Normal';font-variant-ligatures:normal;font-variant-caps:normal;font-variant-numeric:normal;font-feature-settings:normal;text-align:center;writing-mode:lr-tb;text-anchor:middle;stroke-width:0.26458332">green container </tspan><tspan
             sodipodi:role="line"
             x="80.224815"
             y="306.72784"
             style="font-style:normal;font-variant:normal;font-weight:normal;font-stretch:normal;font-size:6.3499999px;font-family:sans-serif;-inkscape-font-specification:'sans-serif, Normal';font-variant-ligatures:normal;font-variant-caps:normal;font-variant-numeric:normal;font-feature-settings:normal;text-align:center;writing-mode:lr-tb;text-anchor:middle;stroke-width:0.26458332"
             id="tspan4350">will be reclaimed</tspan></text>
      </g>
    </g>
    <g
       id="g620">
      <text
         xml:space="preserve"
         style="font-style:normal;font-weight:normal;font-size:10.58333397px;line-height:1.25;font-family:sans-serif;letter-spacing:0px;word-spacing:0px;fill:#ff9800;fill-opacity:1;stroke:none;stroke-width:0.26458335"
         x="58.896915"
         y="160.09573"
         id="text4794"><tspan
           sodipodi:role="line"
           id="tspan4792"
           x="58.896915"
           y="160.09573"
           style="fill:#ff9800;stroke-width:0.26458335">Execute</tspan></text>
      <g
         transform="translate(-25.667882,-163.79867)"
         id="g4874">
        <path
           style="fill:#4caf50;stroke-width:0.04576862"
           sodipodi:nodetypes="csssssscscsssssss"
           inkscape:connector-curvature="0"
           id="path4796"
           d="m 95.361193,327.51117 c -0.605702,0 -1.098447,0.49279 -1.098447,1.09845 v 10.98446 c 0,0.60566 0.492745,1.09845 1.098447,1.09845 h 21.236637 c 0.6057,0 1.09845,-0.49279 1.09845,-1.09845 v -10.98446 c 0,-0.60566 -0.49275,-1.09845 -1.09845,-1.09845 m 0.36615,12.08291 c 0,0.20189 -0.16426,0.36615 -0.36615,0.36615 H 95.361193 c -0.201886,0 -0.366149,-0.16426 -0.366149,-0.36615 v -10.98446 c 0,-0.20189 0.164263,-0.36615 0.366149,-0.36615 h 21.236637 c 0.20189,0 0.36615,0.16426 0.36615,0.36615 z" />
        <path
           style="fill:#4caf50;stroke-width:0.04576862"
           inkscape:connector-curvature="0"
           id="path4798"
           d="m 112.08198,329.70806 c -0.2022,0 -0.36615,0.16395 -0.36615,0.36615 v 8.05528 c 0,0.2022 0.16395,0.36615 0.36615,0.36615 0.20221,0 0.36615,-0.16395 0.36615,-0.36615 v -8.05528 c 0,-0.2022 -0.16394,-0.36615 -0.36615,-0.36615 z" />
        <path
           style="fill:#4caf50;stroke-width:0.04576862"
           inkscape:connector-curvature="0"
           id="path4800"
           d="m 109.03075,329.70806 c -0.20221,0 -0.36615,0.16395 -0.36615,0.36615 v 8.05528 c 0,0.2022 0.16394,0.36615 0.36615,0.36615 0.2022,0 0.36614,-0.16395 0.36614,-0.36615 v -8.05528 c 0,-0.2022 -0.16394,-0.36615 -0.36614,-0.36615 z" />
        <path
           style="fill:#4caf50;stroke-width:0.04576862"
           inkscape:connector-curvature="0"
           id="path4802"
           d="m 105.97951,329.70806 c -0.2022,0 -0.36615,0.16395 -0.36615,0.36615 v 8.05528 c 0,0.2022 0.16395,0.36615 0.36615,0.36615 0.20221,0 0.36615,-0.16395 0.36615,-0.36615 v -8.05528 c 0,-0.2022 -0.16394,-0.36615 -0.36615,-0.36615 z" />
        <path
           style="fill:#4caf50;stroke-width:0.04576862"
           inkscape:connector-curvature="0"
           id="path4804"
           d="m 102.92826,329.70806 c -0.20221,0 -0.36615,0.16395 -0.36615,0.36615 v 8.05528 c 0,0.2022 0.16394,0.36615 0.36615,0.36615 0.2022,0 0.36615,-0.16395 0.36615,-0.36615 v -8.05528 c 0,-0.2022 -0.16395,-0.36615 -0.36615,-0.36615 z" />
        <path
           style="fill:#4caf50;stroke-width:0.04576862"
           inkscape:connector-curvature="0"
           id="path4808"
           d="m 115.13323,329.70806 c -0.20221,0 -0.36616,0.16395 -0.36616,0.36615 v 8.05528 c 0,0.2022 0.16395,0.36615 0.36616,0.36615 0.2022,0 0.36615,-0.16395 0.36615,-0.36615 v -8.05528 c 0,-0.2022 -0.16395,-0.36615 -0.36615,-0.36615 z" />
        <path
           style="fill:#4caf50;stroke-width:0.04576862"
           inkscape:connector-curvature="0"
           id="path4810"
           d="m 99.877028,329.70806 c -0.202206,0 -0.366149,0.16395 -0.366149,0.36615 v 8.05528 c 0,0.2022 0.163943,0.36615 0.366149,0.36615 0.202202,0 0.366152,-0.16395 0.366152,-0.36615 v -8.05528 c 0,-0.2022 -0.16395,-0.36615 -0.366152,-0.36615 z" />
        <path
           style="fill:#4caf50;stroke-width:0.04576862"
           inkscape:connector-curvature="0"
           id="path4812"
           d="m 96.825789,329.70806 c -0.202206,0 -0.366149,0.16395 -0.366149,0.36615 v 8.05528 c 0,0.2022 0.163943,0.36615 0.366149,0.36615 0.202205,0 0.366148,-0.16395 0.366148,-0.36615 v -8.05528 c 0,-0.2022 -0.163943,-0.36615 -0.366148,-0.36615 z" />
      </g>
      <g
         transform="translate(-24.953074,-165.58089)"
         style="fill:#000000"
         id="g4864">
        <path
           style="fill:#000000;stroke-width:0.04576862"
           inkscape:connector-curvature="0"
           id="path4806"
           d="m 108.01082,345.58307 c -0.20221,0 -0.36615,0.16395 -0.36615,0.36615 v 8.05528 c 0,0.2022 0.16394,0.36615 0.36615,0.36615 0.20221,0 0.36615,-0.16395 0.36615,-0.36615 v -8.05528 c 0,-0.2022 -0.16394,-0.36615 -0.36615,-0.36615 z" />
        <path
           style="fill:#000000;stroke-width:0.04576862"
           inkscape:connector-curvature="0"
           id="path4814"
           d="m 106.18007,345.58307 c -0.2022,0 -0.36615,0.16395 -0.36615,0.36615 v 8.05528 c 0,0.2022 0.16395,0.36615 0.36615,0.36615 0.20221,0 0.36616,-0.16395 0.36616,-0.36615 v -8.05528 c 0,-0.2022 -0.16395,-0.36615 -0.36616,-0.36615 z" />
        <path
           style="fill:#000000;stroke-width:0.04576862"
           inkscape:connector-curvature="0"
           id="path4816"
           d="m 104.34933,345.58307 c -0.2022,0 -0.36615,0.16395 -0.36615,0.36615 v 8.05528 c 0,0.2022 0.16395,0.36615 0.36615,0.36615 0.2022,0 0.36615,-0.16395 0.36615,-0.36615 v -8.05528 c 0,-0.2022 -0.16395,-0.36615 -0.36615,-0.36615 z" />
        <path
           style="fill:#000000;stroke-width:0.04576862"
           inkscape:connector-curvature="0"
           id="path4818"
           d="m 102.51858,345.58307 c -0.2022,0 -0.36614,0.16395 -0.36614,0.36615 v 8.05528 c 0,0.2022 0.16394,0.36615 0.36614,0.36615 0.20221,0 0.36616,-0.16395 0.36616,-0.36615 v -8.05528 c 0,-0.2022 -0.16395,-0.36615 -0.36616,-0.36615 z" />
      </g>
      <g
         id="g4889"
         transform="translate(-38.897059,-153.05801)">
        <g
           transform="translate(-13.229165,17.287582)"
           id="g4846">
          <path
             style="fill:#f44336;stroke-width:0.04576862"
             sodipodi:nodetypes="csssssscscsssssss"
             inkscape:connector-curvature="0"
             id="path4822"
             d="m 121.81952,327.51117 c -0.6057,0 -1.09844,0.49279 -1.09844,1.09845 v 10.98446 c 0,0.60566 0.49274,1.09845 1.09844,1.09845 h 21.23665 c 0.60571,0 1.09846,-0.49279 1.09846,-1.09845 v -10.98446 c 0,-0.60566 -0.49275,-1.09845 -1.09846,-1.09845 m 0.36615,12.08291 c 0,0.20189 -0.16426,0.36615 -0.36615,0.36615 h -21.23665 c -0.20188,0 -0.36615,-0.16426 -0.36615,-0.36615 v -10.98446 c 0,-0.20189 0.16427,-0.36615 0.36615,-0.36615 h 21.23665 c 0.20189,0 0.36615,0.16426 0.36615,0.36615 z" />
          <path
             style="fill:#f44336;stroke-width:0.04576862"
             inkscape:connector-curvature="0"
             id="path4824"
             d="m 132.43785,329.70806 c -0.20221,0 -0.36615,0.16395 -0.36615,0.36615 v 8.05528 c 0,0.2022 0.16394,0.36615 0.36615,0.36615 0.20221,0 0.36615,-0.16395 0.36615,-0.36615 v -8.05528 c 0,-0.2022 -0.16394,-0.36615 -0.36615,-0.36615 z" />
          <path
             style="fill:#f44336;stroke-width:0.04576862"
             inkscape:connector-curvature="0"
             id="path4826"
             d="m 130.6071,329.70806 c -0.2022,0 -0.36615,0.16395 -0.36615,0.36615 v 8.05528 c 0,0.2022 0.16395,0.36615 0.36615,0.36615 0.20221,0 0.36615,-0.16395 0.36615,-0.36615 v -8.05528 c 0,-0.2022 -0.16394,-0.36615 -0.36615,-0.36615 z" />
          <path
             style="fill:#f44336;stroke-width:0.04576862"
             inkscape:connector-curvature="0"
             id="path4828"
             d="m 128.77636,329.70806 c -0.20221,0 -0.36615,0.16395 -0.36615,0.36615 v 8.05528 c 0,0.2022 0.16394,0.36615 0.36615,0.36615 0.2022,0 0.36615,-0.16395 0.36615,-0.36615 v -8.05528 c 0,-0.2022 -0.16395,-0.36615 -0.36615,-0.36615 z" />
          <path
             style="fill:#f44336;stroke-width:0.04576862"
             inkscape:connector-curvature="0"
             id="path4830"
             d="m 126.94561,329.70806 c -0.2022,0 -0.36615,0.16395 -0.36615,0.36615 v 8.05528 c 0,0.2022 0.16395,0.36615 0.36615,0.36615 0.20221,0 0.36615,-0.16395 0.36615,-0.36615 v -8.05528 c 0,-0.2022 -0.16394,-0.36615 -0.36615,-0.36615 z" />
          <path
             style="fill:#f44336;stroke-width:0.04576862"
             inkscape:connector-curvature="0"
             id="path4832"
             d="m 139.76083,329.70806 c -0.2022,0 -0.36615,0.16395 -0.36615,0.36615 v 8.05528 c 0,0.2022 0.16395,0.36615 0.36615,0.36615 0.20221,0 0.36615,-0.16395 0.36615,-0.36615 v -8.05528 c 0,-0.2022 -0.16394,-0.36615 -0.36615,-0.36615 z" />
          <path
             style="fill:#f44336;stroke-width:0.04576862"
             inkscape:connector-curvature="0"
             id="path4834"
             d="m 141.59158,329.70806 c -0.20221,0 -0.36615,0.16395 -0.36615,0.36615 v 8.05528 c 0,0.2022 0.16394,0.36615 0.36615,0.36615 0.20221,0 0.36615,-0.16395 0.36615,-0.36615 v -8.05528 c 0,-0.2022 -0.16394,-0.36615 -0.36615,-0.36615 z" />
          <path
             style="fill:#f44336;stroke-width:0.04576862"
             inkscape:connector-curvature="0"
             id="path4836"
             d="m 125.11487,329.70806 c -0.20221,0 -0.36615,0.16395 -0.36615,0.36615 v 8.05528 c 0,0.2022 0.16394,0.36615 0.36615,0.36615 0.2022,0 0.36615,-0.16395 0.36615,-0.36615 v -8.05528 c 0,-0.2022 -0.16395,-0.36615 -0.36615,-0.36615 z" />
          <path
             style="fill:#f44336;stroke-width:0.04576862"
             inkscape:connector-curvature="0"
             id="path4838"
             d="m 123.28412,329.70806 c -0.2022,0 -0.36615,0.16395 -0.36615,0.36615 v 8.05528 c 0,0.2022 0.16395,0.36615 0.36615,0.36615 0.20221,0 0.36615,-0.16395 0.36615,-0.36615 v -8.05528 c 0,-0.2022 -0.16394,-0.36615 -0.36615,-0.36615 z" />
          <path
             style="fill:#f44336;stroke-width:0.04576862"
             inkscape:connector-curvature="0"
             id="path4840"
             d="m 137.93008,329.70806 c -0.2022,0 -0.36615,0.16395 -0.36615,0.36615 v 8.05528 c 0,0.2022 0.16395,0.36615 0.36615,0.36615 0.20221,0 0.36616,-0.16395 0.36616,-0.36615 v -8.05528 c 0,-0.2022 -0.16395,-0.36615 -0.36616,-0.36615 z" />
          <path
             style="fill:#f44336;stroke-width:0.04576862"
             inkscape:connector-curvature="0"
             id="path4842"
             d="m 136.09934,329.70806 c -0.2022,0 -0.36615,0.16395 -0.36615,0.36615 v 8.05528 c 0,0.2022 0.16395,0.36615 0.36615,0.36615 0.2022,0 0.36615,-0.16395 0.36615,-0.36615 v -8.05528 c 0,-0.2022 -0.16395,-0.36615 -0.36615,-0.36615 z" />
          <path
             style="fill:#f44336;stroke-width:0.04576862"
             inkscape:connector-curvature="0"
             id="path4844"
             d="m 134.26859,329.70806 c -0.2022,0 -0.36614,0.16395 -0.36614,0.36615 v 8.05528 c 0,0.2022 0.16394,0.36615 0.36614,0.36615 0.20221,0 0.36615,-0.16395 0.36615,-0.36615 v -8.05528 c 0,-0.2022 -0.16394,-0.36615 -0.36615,-0.36615 z" />
        </g>
      </g>
      <text
         xml:space="preserve"
         style="font-style:normal;font-variant:normal;font-weight:normal;font-stretch:normal;font-size:6.3499999px;line-height:1.25;font-family:sans-serif;-inkscape-font-specification:'sans-serif, Normal';font-variant-ligatures:normal;font-variant-caps:normal;font-variant-numeric:normal;font-feature-settings:normal;text-align:center;letter-spacing:0px;word-spacing:0px;writing-mode:lr-tb;text-anchor:middle;fill:#000000;fill-opacity:1;stroke:none;stroke-width:0.26458332"
         x="80.224815"
         y="213.2569"
         id="text4852"><tspan
           sodipodi:role="line"
           x="80.224815"
           y="213.2569"
           style="font-style:normal;font-variant:normal;font-weight:normal;font-stretch:normal;font-size:6.3499999px;font-family:sans-serif;-inkscape-font-specification:'sans-serif, Normal';font-variant-ligatures:normal;font-variant-caps:normal;font-variant-numeric:normal;font-feature-settings:normal;text-align:center;writing-mode:lr-tb;text-anchor:middle;stroke-width:0.26458332"
           id="tspan4850">red container can</tspan><tspan
           sodipodi:role="line"
           x="80.224815"
           y="221.1944"
           style="font-style:normal;font-variant:normal;font-weight:normal;font-stretch:normal;font-size:6.3499999px;font-family:sans-serif;-inkscape-font-specification:'sans-serif, Normal';font-variant-ligatures:normal;font-variant-caps:normal;font-variant-numeric:normal;font-feature-settings:normal;text-align:center;writing-mode:lr-tb;text-anchor:middle;stroke-width:0.26458332"
           id="tspan4858">take free memory</tspan></text>
    </g>
  </g>
</svg>
