<?xml version="1.0" encoding="UTF-8" standalone="no"?>
<!-- Created with matplotlib (https://matplotlib.org/) -->

<svg
   xmlns:dc="http://purl.org/dc/elements/1.1/"
   xmlns:cc="http://creativecommons.org/ns#"
   xmlns:rdf="http://www.w3.org/1999/02/22-rdf-syntax-ns#"
   xmlns:svg="http://www.w3.org/2000/svg"
   xmlns="http://www.w3.org/2000/svg"
   xmlns:xlink="http://www.w3.org/1999/xlink"
   xmlns:sodipodi="http://sodipodi.sourceforge.net/DTD/sodipodi-0.dtd"
   xmlns:inkscape="http://www.inkscape.org/namespaces/inkscape"
   height="288pt"
   version="1.1"
   viewBox="0 0 432 288"
   width="432pt"
   id="svg5094"
   sodipodi:docname="soft_stacked_transactions.svg"
   inkscape:version="0.92.4 (5da689c313, 2019-01-14)">
  <metadata
     id="metadata5098">
    <rdf:RDF>
      <cc:Work
         rdf:about="">
        <dc:format>image/svg+xml</dc:format>
        <dc:type
           rdf:resource="http://purl.org/dc/dcmitype/StillImage" />
      </cc:Work>
    </rdf:RDF>
  </metadata>
  <sodipodi:namedview
     pagecolor="#ffffff"
     bordercolor="#666666"
     borderopacity="1"
     objecttolerance="10"
     gridtolerance="10"
     guidetolerance="10"
     inkscape:pageopacity="0"
     inkscape:pageshadow="2"
     inkscape:window-width="3200"
     inkscape:window-height="1657"
     id="namedview5096"
     showgrid="false"
     inkscape:zoom="2.4583333"
     inkscape:cx="-181.81673"
     inkscape:cy="134.61969"
     inkscape:window-x="0"
     inkscape:window-y="0"
     inkscape:window-maximized="1"
     inkscape:current-layer="patch_3" />
  <defs
     id="defs4139">
    <style
       type="text/css"
       id="style4137">
*{stroke-linecap:butt;stroke-linejoin:round;}
  </style>
  </defs>
  <g
     id="figure_1">
    <g
       id="patch_1">
      <path
         d="M 0 288  L 432 288  L 432 0  L 0 0  z "
         style="fill:#ffffff;"
         id="path4141" />
    </g>
    <g
       id="axes_1">
      <g
         id="patch_2">
        <path
           d="M 54 252  L 388.8 252  L 388.8 34.56  L 54 34.56  z "
           style="fill:#ffffff;"
           id="path4144" />
      </g>
      <g
         id="matplotlib.axis_1">
        <g
           id="xtick_1">
          <g
             id="line2d_1">
            <defs
               id="defs4148">
              <path
                 d="M 0 0  L 0 3.5  "
                 id="ma34d881370"
                 style="stroke:#000000;stroke-width:0.8;" />
            </defs>
            <g
               id="g4152">
              <use
                 style="stroke:#000000;stroke-width:0.8;"
                 x="83.052893"
                 xlink:href="#ma34d881370"
                 y="252"
                 id="use4150" />
            </g>
          </g>
          <g
             id="text_1">
            <!-- φ1 -->
            <defs
               id="defs4157">
              <path
                 d="M 40.484375 47.40625  Q 37.3125 47.40625 37.3125 40.328125  L 37.3125 6.84375  Q 41.9375 6.84375 46.578125 11.921875  Q 50.734375 16.453125 50.734375 27.34375  Q 50.734375 37.5 46.53125 42.96875  Q 43.109375 47.40625 40.484375 47.40625  z M 40.484375 55.078125  Q 47.3125 55.078125 53.515625 48.640625  Q 60.203125 41.75 60.203125 27.34375  Q 60.203125 14.109375 53.515625 6.25  Q 47.21875 -1.171875 37.3125 -1.171875  L 37.3125 -20.796875  L 28.375 -20.796875  L 28.375 -1.21875  Q 18.65625 -1.21875 12.109375 6.25  Q 5.46875 13.875 5.46875 27.296875  Q 5.46875 41.265625 12.109375 48.390625  Q 17.09375 53.71875 25.203125 55.078125  L 25.203125 47.125  Q 21.96875 46 19.140625 42.1875  Q 14.9375 36.578125 14.9375 27.296875  Q 14.9375 17.4375 19.140625 11.8125  Q 22.90625 6.78125 28.375 6.78125  L 28.375 40.328125  Q 28.375 55.078125 40.484375 55.078125  z "
                 id="DejaVuSans-966" />
              <path
                 d="M 12.40625 8.296875  L 28.515625 8.296875  L 28.515625 63.921875  L 10.984375 60.40625  L 10.984375 69.390625  L 28.421875 72.90625  L 38.28125 72.90625  L 38.28125 8.296875  L 54.390625 8.296875  L 54.390625 0  L 12.40625 0  z "
                 id="DejaVuSans-49" />
            </defs>
            <g
               transform="translate(76.573205 266.598437)scale(0.1 -0.1)"
               id="g4163">
              <use
                 xlink:href="#DejaVuSans-966"
                 id="use4159" />
              <use
                 x="65.966797"
                 xlink:href="#DejaVuSans-49"
                 id="use4161" />
            </g>
          </g>
        </g>
        <g
           id="xtick_2">
          <g
             id="line2d_2">
            <g
               id="g4169">
              <use
                 style="stroke:#000000;stroke-width:0.8;"
                 x="117.639669"
                 xlink:href="#ma34d881370"
                 y="252"
                 id="use4167" />
            </g>
          </g>
          <g
             id="text_2">
            <!-- φ2 -->
            <defs
               id="defs4173">
              <path
                 d="M 19.1875 8.296875  L 53.609375 8.296875  L 53.609375 0  L 7.328125 0  L 7.328125 8.296875  Q 12.9375 14.109375 22.625 23.890625  Q 32.328125 33.6875 34.8125 36.53125  Q 39.546875 41.84375 41.421875 45.53125  Q 43.3125 49.21875 43.3125 52.78125  Q 43.3125 58.59375 39.234375 62.25  Q 35.15625 65.921875 28.609375 65.921875  Q 23.96875 65.921875 18.8125 64.3125  Q 13.671875 62.703125 7.8125 59.421875  L 7.8125 69.390625  Q 13.765625 71.78125 18.9375 73  Q 24.125 74.21875 28.421875 74.21875  Q 39.75 74.21875 46.484375 68.546875  Q 53.21875 62.890625 53.21875 53.421875  Q 53.21875 48.921875 51.53125 44.890625  Q 49.859375 40.875 45.40625 35.40625  Q 44.1875 33.984375 37.640625 27.21875  Q 31.109375 20.453125 19.1875 8.296875  z "
                 id="DejaVuSans-50" />
            </defs>
            <g
               transform="translate(111.159982 266.598437)scale(0.1 -0.1)"
               id="g4179">
              <use
                 xlink:href="#DejaVuSans-966"
                 id="use4175" />
              <use
                 x="65.966797"
                 xlink:href="#DejaVuSans-50"
                 id="use4177" />
            </g>
          </g>
        </g>
        <g
           id="xtick_3">
          <g
             id="line2d_3">
            <g
               id="g4185">
              <use
                 style="stroke:#000000;stroke-width:0.8;"
                 x="152.226446"
                 xlink:href="#ma34d881370"
                 y="252"
                 id="use4183" />
            </g>
          </g>
          <g
             id="text_3">
            <!-- φ3 -->
            <defs
               id="defs4189">
              <path
                 d="M 40.578125 39.3125  Q 47.65625 37.796875 51.625 33  Q 55.609375 28.21875 55.609375 21.1875  Q 55.609375 10.40625 48.1875 4.484375  Q 40.765625 -1.421875 27.09375 -1.421875  Q 22.515625 -1.421875 17.65625 -0.515625  Q 12.796875 0.390625 7.625 2.203125  L 7.625 11.71875  Q 11.71875 9.328125 16.59375 8.109375  Q 21.484375 6.890625 26.8125 6.890625  Q 36.078125 6.890625 40.9375 10.546875  Q 45.796875 14.203125 45.796875 21.1875  Q 45.796875 27.640625 41.28125 31.265625  Q 36.765625 34.90625 28.71875 34.90625  L 20.21875 34.90625  L 20.21875 43.015625  L 29.109375 43.015625  Q 36.375 43.015625 40.234375 45.921875  Q 44.09375 48.828125 44.09375 54.296875  Q 44.09375 59.90625 40.109375 62.90625  Q 36.140625 65.921875 28.71875 65.921875  Q 24.65625 65.921875 20.015625 65.03125  Q 15.375 64.15625 9.8125 62.3125  L 9.8125 71.09375  Q 15.4375 72.65625 20.34375 73.4375  Q 25.25 74.21875 29.59375 74.21875  Q 40.828125 74.21875 47.359375 69.109375  Q 53.90625 64.015625 53.90625 55.328125  Q 53.90625 49.265625 50.4375 45.09375  Q 46.96875 40.921875 40.578125 39.3125  z "
                 id="DejaVuSans-51" />
            </defs>
            <g
               transform="translate(145.746759 266.598437)scale(0.1 -0.1)"
               id="g4195">
              <use
                 xlink:href="#DejaVuSans-966"
                 id="use4191" />
              <use
                 x="65.966797"
                 xlink:href="#DejaVuSans-51"
                 id="use4193" />
            </g>
          </g>
        </g>
        <g
           id="xtick_4">
          <g
             id="line2d_4">
            <g
               id="g4201">
              <use
                 style="stroke:#000000;stroke-width:0.8;"
                 x="186.813223"
                 xlink:href="#ma34d881370"
                 y="252"
                 id="use4199" />
            </g>
          </g>
          <g
             id="text_4">
            <!-- φ4 -->
            <defs
               id="defs4205">
              <path
                 d="M 37.796875 64.3125  L 12.890625 25.390625  L 37.796875 25.390625  z M 35.203125 72.90625  L 47.609375 72.90625  L 47.609375 25.390625  L 58.015625 25.390625  L 58.015625 17.1875  L 47.609375 17.1875  L 47.609375 0  L 37.796875 0  L 37.796875 17.1875  L 4.890625 17.1875  L 4.890625 26.703125  z "
                 id="DejaVuSans-52" />
            </defs>
            <g
               transform="translate(180.333536 266.598437)scale(0.1 -0.1)"
               id="g4211">
              <use
                 xlink:href="#DejaVuSans-966"
                 id="use4207" />
              <use
                 x="65.966797"
                 xlink:href="#DejaVuSans-52"
                 id="use4209" />
            </g>
          </g>
        </g>
        <g
           id="xtick_5">
          <g
             id="line2d_5">
            <g
               id="g4217">
              <use
                 style="stroke:#000000;stroke-width:0.8;"
                 x="221.4"
                 xlink:href="#ma34d881370"
                 y="252"
                 id="use4215" />
            </g>
          </g>
          <g
             id="text_5">
            <!-- φ5 -->
            <defs
               id="defs4221">
              <path
                 d="M 10.796875 72.90625  L 49.515625 72.90625  L 49.515625 64.59375  L 19.828125 64.59375  L 19.828125 46.734375  Q 21.96875 47.46875 24.109375 47.828125  Q 26.265625 48.1875 28.421875 48.1875  Q 40.625 48.1875 47.75 41.5  Q 54.890625 34.8125 54.890625 23.390625  Q 54.890625 11.625 47.5625 5.09375  Q 40.234375 -1.421875 26.90625 -1.421875  Q 22.3125 -1.421875 17.546875 -0.640625  Q 12.796875 0.140625 7.71875 1.703125  L 7.71875 11.625  Q 12.109375 9.234375 16.796875 8.0625  Q 21.484375 6.890625 26.703125 6.890625  Q 35.15625 6.890625 40.078125 11.328125  Q 45.015625 15.765625 45.015625 23.390625  Q 45.015625 31 40.078125 35.4375  Q 35.15625 39.890625 26.703125 39.890625  Q 22.75 39.890625 18.8125 39.015625  Q 14.890625 38.140625 10.796875 36.28125  z "
                 id="DejaVuSans-53" />
            </defs>
            <g
               transform="translate(214.920313 266.598437)scale(0.1 -0.1)"
               id="g4227">
              <use
                 xlink:href="#DejaVuSans-966"
                 id="use4223" />
              <use
                 x="65.966797"
                 xlink:href="#DejaVuSans-53"
                 id="use4225" />
            </g>
          </g>
        </g>
        <g
           id="xtick_6">
          <g
             id="line2d_6">
            <g
               id="g4233">
              <use
                 style="stroke:#000000;stroke-width:0.8;"
                 x="255.986777"
                 xlink:href="#ma34d881370"
                 y="252"
                 id="use4231" />
            </g>
          </g>
          <g
             id="text_6">
            <!-- φ6 -->
            <defs
               id="defs4237">
              <path
                 d="M 33.015625 40.375  Q 26.375 40.375 22.484375 35.828125  Q 18.609375 31.296875 18.609375 23.390625  Q 18.609375 15.53125 22.484375 10.953125  Q 26.375 6.390625 33.015625 6.390625  Q 39.65625 6.390625 43.53125 10.953125  Q 47.40625 15.53125 47.40625 23.390625  Q 47.40625 31.296875 43.53125 35.828125  Q 39.65625 40.375 33.015625 40.375  z M 52.59375 71.296875  L 52.59375 62.3125  Q 48.875 64.0625 45.09375 64.984375  Q 41.3125 65.921875 37.59375 65.921875  Q 27.828125 65.921875 22.671875 59.328125  Q 17.53125 52.734375 16.796875 39.40625  Q 19.671875 43.65625 24.015625 45.921875  Q 28.375 48.1875 33.59375 48.1875  Q 44.578125 48.1875 50.953125 41.515625  Q 57.328125 34.859375 57.328125 23.390625  Q 57.328125 12.15625 50.6875 5.359375  Q 44.046875 -1.421875 33.015625 -1.421875  Q 20.359375 -1.421875 13.671875 8.265625  Q 6.984375 17.96875 6.984375 36.375  Q 6.984375 53.65625 15.1875 63.9375  Q 23.390625 74.21875 37.203125 74.21875  Q 40.921875 74.21875 44.703125 73.484375  Q 48.484375 72.75 52.59375 71.296875  z "
                 id="DejaVuSans-54" />
            </defs>
            <g
               transform="translate(249.507089 266.598437)scale(0.1 -0.1)"
               id="g4243">
              <use
                 xlink:href="#DejaVuSans-966"
                 id="use4239" />
              <use
                 x="65.966797"
                 xlink:href="#DejaVuSans-54"
                 id="use4241" />
            </g>
          </g>
        </g>
        <g
           id="xtick_7">
          <g
             id="line2d_7">
            <g
               id="g4249">
              <use
                 style="stroke:#000000;stroke-width:0.8;"
                 x="290.573554"
                 xlink:href="#ma34d881370"
                 y="252"
                 id="use4247" />
            </g>
          </g>
          <g
             id="text_7">
            <!-- φ7 -->
            <defs
               id="defs4253">
              <path
                 d="M 8.203125 72.90625  L 55.078125 72.90625  L 55.078125 68.703125  L 28.609375 0  L 18.3125 0  L 43.21875 64.59375  L 8.203125 64.59375  z "
                 id="DejaVuSans-55" />
            </defs>
            <g
               transform="translate(284.093866 266.598437)scale(0.1 -0.1)"
               id="g4259">
              <use
                 xlink:href="#DejaVuSans-966"
                 id="use4255" />
              <use
                 x="65.966797"
                 xlink:href="#DejaVuSans-55"
                 id="use4257" />
            </g>
          </g>
        </g>
        <g
           id="xtick_8">
          <g
             id="line2d_8">
            <g
               id="g4265">
              <use
                 style="stroke:#000000;stroke-width:0.8;"
                 x="325.160331"
                 xlink:href="#ma34d881370"
                 y="252"
                 id="use4263" />
            </g>
          </g>
          <g
             id="text_8">
            <!-- φ8 -->
            <defs
               id="defs4269">
              <path
                 d="M 31.78125 34.625  Q 24.75 34.625 20.71875 30.859375  Q 16.703125 27.09375 16.703125 20.515625  Q 16.703125 13.921875 20.71875 10.15625  Q 24.75 6.390625 31.78125 6.390625  Q 38.8125 6.390625 42.859375 10.171875  Q 46.921875 13.96875 46.921875 20.515625  Q 46.921875 27.09375 42.890625 30.859375  Q 38.875 34.625 31.78125 34.625  z M 21.921875 38.8125  Q 15.578125 40.375 12.03125 44.71875  Q 8.5 49.078125 8.5 55.328125  Q 8.5 64.0625 14.71875 69.140625  Q 20.953125 74.21875 31.78125 74.21875  Q 42.671875 74.21875 48.875 69.140625  Q 55.078125 64.0625 55.078125 55.328125  Q 55.078125 49.078125 51.53125 44.71875  Q 48 40.375 41.703125 38.8125  Q 48.828125 37.15625 52.796875 32.3125  Q 56.78125 27.484375 56.78125 20.515625  Q 56.78125 9.90625 50.3125 4.234375  Q 43.84375 -1.421875 31.78125 -1.421875  Q 19.734375 -1.421875 13.25 4.234375  Q 6.78125 9.90625 6.78125 20.515625  Q 6.78125 27.484375 10.78125 32.3125  Q 14.796875 37.15625 21.921875 38.8125  z M 18.3125 54.390625  Q 18.3125 48.734375 21.84375 45.5625  Q 25.390625 42.390625 31.78125 42.390625  Q 38.140625 42.390625 41.71875 45.5625  Q 45.3125 48.734375 45.3125 54.390625  Q 45.3125 60.0625 41.71875 63.234375  Q 38.140625 66.40625 31.78125 66.40625  Q 25.390625 66.40625 21.84375 63.234375  Q 18.3125 60.0625 18.3125 54.390625  z "
                 id="DejaVuSans-56" />
            </defs>
            <g
               transform="translate(318.680643 266.598437)scale(0.1 -0.1)"
               id="g4275">
              <use
                 xlink:href="#DejaVuSans-966"
                 id="use4271" />
              <use
                 x="65.966797"
                 xlink:href="#DejaVuSans-56"
                 id="use4273" />
            </g>
          </g>
        </g>
        <g
           id="xtick_9">
          <g
             id="line2d_9">
            <g
               id="g4281">
              <use
                 style="stroke:#000000;stroke-width:0.8;"
                 x="359.747107"
                 xlink:href="#ma34d881370"
                 y="252"
                 id="use4279" />
            </g>
          </g>
          <g
             id="text_9">
            <!-- φ9 -->
            <defs
               id="defs4285">
              <path
                 d="M 10.984375 1.515625  L 10.984375 10.5  Q 14.703125 8.734375 18.5 7.8125  Q 22.3125 6.890625 25.984375 6.890625  Q 35.75 6.890625 40.890625 13.453125  Q 46.046875 20.015625 46.78125 33.40625  Q 43.953125 29.203125 39.59375 26.953125  Q 35.25 24.703125 29.984375 24.703125  Q 19.046875 24.703125 12.671875 31.3125  Q 6.296875 37.9375 6.296875 49.421875  Q 6.296875 60.640625 12.9375 67.421875  Q 19.578125 74.21875 30.609375 74.21875  Q 43.265625 74.21875 49.921875 64.515625  Q 56.59375 54.828125 56.59375 36.375  Q 56.59375 19.140625 48.40625 8.859375  Q 40.234375 -1.421875 26.421875 -1.421875  Q 22.703125 -1.421875 18.890625 -0.6875  Q 15.09375 0.046875 10.984375 1.515625  z M 30.609375 32.421875  Q 37.25 32.421875 41.125 36.953125  Q 45.015625 41.5 45.015625 49.421875  Q 45.015625 57.28125 41.125 61.84375  Q 37.25 66.40625 30.609375 66.40625  Q 23.96875 66.40625 20.09375 61.84375  Q 16.21875 57.28125 16.21875 49.421875  Q 16.21875 41.5 20.09375 36.953125  Q 23.96875 32.421875 30.609375 32.421875  z "
                 id="DejaVuSans-57" />
            </defs>
            <g
               transform="translate(353.26742 266.598437)scale(0.1 -0.1)"
               id="g4291">
              <use
                 xlink:href="#DejaVuSans-966"
                 id="use4287" />
              <use
                 x="65.966797"
                 xlink:href="#DejaVuSans-57"
                 id="use4289" />
            </g>
          </g>
        </g>
        <g
           id="text_10">
          <!-- Phases -->
          <defs
             id="defs4300">
            <path
               d="M 19.671875 64.796875  L 19.671875 37.40625  L 32.078125 37.40625  Q 38.96875 37.40625 42.71875 40.96875  Q 46.484375 44.53125 46.484375 51.125  Q 46.484375 57.671875 42.71875 61.234375  Q 38.96875 64.796875 32.078125 64.796875  z M 9.8125 72.90625  L 32.078125 72.90625  Q 44.34375 72.90625 50.609375 67.359375  Q 56.890625 61.8125 56.890625 51.125  Q 56.890625 40.328125 50.609375 34.8125  Q 44.34375 29.296875 32.078125 29.296875  L 19.671875 29.296875  L 19.671875 0  L 9.8125 0  z "
               id="DejaVuSans-80" />
            <path
               d="M 54.890625 33.015625  L 54.890625 0  L 45.90625 0  L 45.90625 32.71875  Q 45.90625 40.484375 42.875 44.328125  Q 39.84375 48.1875 33.796875 48.1875  Q 26.515625 48.1875 22.3125 43.546875  Q 18.109375 38.921875 18.109375 30.90625  L 18.109375 0  L 9.078125 0  L 9.078125 75.984375  L 18.109375 75.984375  L 18.109375 46.1875  Q 21.34375 51.125 25.703125 53.5625  Q 30.078125 56 35.796875 56  Q 45.21875 56 50.046875 50.171875  Q 54.890625 44.34375 54.890625 33.015625  z "
               id="DejaVuSans-104" />
            <path
               d="M 34.28125 27.484375  Q 23.390625 27.484375 19.1875 25  Q 14.984375 22.515625 14.984375 16.5  Q 14.984375 11.71875 18.140625 8.90625  Q 21.296875 6.109375 26.703125 6.109375  Q 34.1875 6.109375 38.703125 11.40625  Q 43.21875 16.703125 43.21875 25.484375  L 43.21875 27.484375  z M 52.203125 31.203125  L 52.203125 0  L 43.21875 0  L 43.21875 8.296875  Q 40.140625 3.328125 35.546875 0.953125  Q 30.953125 -1.421875 24.3125 -1.421875  Q 15.921875 -1.421875 10.953125 3.296875  Q 6 8.015625 6 15.921875  Q 6 25.140625 12.171875 29.828125  Q 18.359375 34.515625 30.609375 34.515625  L 43.21875 34.515625  L 43.21875 35.40625  Q 43.21875 41.609375 39.140625 45  Q 35.0625 48.390625 27.6875 48.390625  Q 23 48.390625 18.546875 47.265625  Q 14.109375 46.140625 10.015625 43.890625  L 10.015625 52.203125  Q 14.9375 54.109375 19.578125 55.046875  Q 24.21875 56 28.609375 56  Q 40.484375 56 46.34375 49.84375  Q 52.203125 43.703125 52.203125 31.203125  z "
               id="DejaVuSans-97" />
            <path
               d="M 44.28125 53.078125  L 44.28125 44.578125  Q 40.484375 46.53125 36.375 47.5  Q 32.28125 48.484375 27.875 48.484375  Q 21.1875 48.484375 17.84375 46.4375  Q 14.5 44.390625 14.5 40.28125  Q 14.5 37.15625 16.890625 35.375  Q 19.28125 33.59375 26.515625 31.984375  L 29.59375 31.296875  Q 39.15625 29.25 43.1875 25.515625  Q 47.21875 21.78125 47.21875 15.09375  Q 47.21875 7.46875 41.1875 3.015625  Q 35.15625 -1.421875 24.609375 -1.421875  Q 20.21875 -1.421875 15.453125 -0.5625  Q 10.6875 0.296875 5.421875 2  L 5.421875 11.28125  Q 10.40625 8.6875 15.234375 7.390625  Q 20.0625 6.109375 24.8125 6.109375  Q 31.15625 6.109375 34.5625 8.28125  Q 37.984375 10.453125 37.984375 14.40625  Q 37.984375 18.0625 35.515625 20.015625  Q 33.0625 21.96875 24.703125 23.78125  L 21.578125 24.515625  Q 13.234375 26.265625 9.515625 29.90625  Q 5.8125 33.546875 5.8125 39.890625  Q 5.8125 47.609375 11.28125 51.796875  Q 16.75 56 26.8125 56  Q 31.78125 56 36.171875 55.265625  Q 40.578125 54.546875 44.28125 53.078125  z "
               id="DejaVuSans-115" />
            <path
               d="M 56.203125 29.59375  L 56.203125 25.203125  L 14.890625 25.203125  Q 15.484375 15.921875 20.484375 11.0625  Q 25.484375 6.203125 34.421875 6.203125  Q 39.59375 6.203125 44.453125 7.46875  Q 49.3125 8.734375 54.109375 11.28125  L 54.109375 2.78125  Q 49.265625 0.734375 44.1875 -0.34375  Q 39.109375 -1.421875 33.890625 -1.421875  Q 20.796875 -1.421875 13.15625 6.1875  Q 5.515625 13.8125 5.515625 26.8125  Q 5.515625 40.234375 12.765625 48.109375  Q 20.015625 56 32.328125 56  Q 43.359375 56 49.78125 48.890625  Q 56.203125 41.796875 56.203125 29.59375  z M 47.21875 32.234375  Q 47.125 39.59375 43.09375 43.984375  Q 39.0625 48.390625 32.421875 48.390625  Q 24.90625 48.390625 20.390625 44.140625  Q 15.875 39.890625 15.1875 32.171875  z "
               id="DejaVuSans-101" />
          </defs>
          <g
             transform="translate(203.866406 280.276563)scale(0.1 -0.1)"
             id="g4314">
            <use
               xlink:href="#DejaVuSans-80"
               id="use4302" />
            <use
               x="60.302734"
               xlink:href="#DejaVuSans-104"
               id="use4304" />
            <use
               x="123.681641"
               xlink:href="#DejaVuSans-97"
               id="use4306" />
            <use
               x="184.960938"
               xlink:href="#DejaVuSans-115"
               id="use4308" />
            <use
               x="237.060547"
               xlink:href="#DejaVuSans-101"
               id="use4310" />
            <use
               x="298.583984"
               xlink:href="#DejaVuSans-115"
               id="use4312" />
          </g>
        </g>
      </g>
      <g
         id="matplotlib.axis_2">
        <g
           id="ytick_1">
          <g
             id="line2d_10">
            <path
               clip-path="url(#p378300a975)"
               d="M 54 252  L 388.8 252  "
               style="fill:none;stroke:#b0b0b0;stroke-dasharray:2.96,1.28;stroke-dashoffset:0;stroke-width:0.8;"
               id="path4318" />
          </g>
          <g
             id="line2d_11">
            <defs
               id="defs4322">
              <path
                 d="M 0 0  L -3.5 0  "
                 id="m9189d546a9"
                 style="stroke:#000000;stroke-width:0.8;" />
            </defs>
            <g
               id="g4326">
              <use
                 style="stroke:#000000;stroke-width:0.8;"
                 x="54"
                 xlink:href="#m9189d546a9"
                 y="252"
                 id="use4324" />
            </g>
          </g>
          <g
             id="text_11">
            <!-- 0 -->
            <defs
               id="defs4330">
              <path
                 d="M 31.78125 66.40625  Q 24.171875 66.40625 20.328125 58.90625  Q 16.5 51.421875 16.5 36.375  Q 16.5 21.390625 20.328125 13.890625  Q 24.171875 6.390625 31.78125 6.390625  Q 39.453125 6.390625 43.28125 13.890625  Q 47.125 21.390625 47.125 36.375  Q 47.125 51.421875 43.28125 58.90625  Q 39.453125 66.40625 31.78125 66.40625  z M 31.78125 74.21875  Q 44.046875 74.21875 50.515625 64.515625  Q 56.984375 54.828125 56.984375 36.375  Q 56.984375 17.96875 50.515625 8.265625  Q 44.046875 -1.421875 31.78125 -1.421875  Q 19.53125 -1.421875 13.0625 8.265625  Q 6.59375 17.96875 6.59375 36.375  Q 6.59375 54.828125 13.0625 64.515625  Q 19.53125 74.21875 31.78125 74.21875  z "
                 id="DejaVuSans-48" />
            </defs>
            <g
               transform="translate(40.6375 255.799219)scale(0.1 -0.1)"
               id="g4334">
              <use
                 xlink:href="#DejaVuSans-48"
                 id="use4332" />
            </g>
          </g>
        </g>
        <g
           id="ytick_2">
          <g
             id="line2d_12">
            <path
               clip-path="url(#p378300a975)"
               d="M 54 208.512  L 388.8 208.512  "
               style="fill:none;stroke:#b0b0b0;stroke-dasharray:2.96,1.28;stroke-dashoffset:0;stroke-width:0.8;"
               id="path4338" />
          </g>
          <g
             id="line2d_13">
            <g
               id="g4343">
              <use
                 style="stroke:#000000;stroke-width:0.8;"
                 x="54"
                 xlink:href="#m9189d546a9"
                 y="208.512"
                 id="use4341" />
            </g>
          </g>
          <g
             id="text_12">
            <!-- 200000 -->
            <g
               transform="translate(8.825 212.311219)scale(0.1 -0.1)"
               id="g4358">
              <use
                 xlink:href="#DejaVuSans-50"
                 id="use4346" />
              <use
                 x="63.623047"
                 xlink:href="#DejaVuSans-48"
                 id="use4348" />
              <use
                 x="127.246094"
                 xlink:href="#DejaVuSans-48"
                 id="use4350" />
              <use
                 x="190.869141"
                 xlink:href="#DejaVuSans-48"
                 id="use4352" />
              <use
                 x="254.492188"
                 xlink:href="#DejaVuSans-48"
                 id="use4354" />
              <use
                 x="318.115234"
                 xlink:href="#DejaVuSans-48"
                 id="use4356" />
            </g>
          </g>
        </g>
        <g
           id="ytick_3">
          <g
             id="line2d_14">
            <path
               clip-path="url(#p378300a975)"
               d="M 54 165.024  L 388.8 165.024  "
               style="fill:none;stroke:#b0b0b0;stroke-dasharray:2.96,1.28;stroke-dashoffset:0;stroke-width:0.8;"
               id="path4362" />
          </g>
          <g
             id="line2d_15">
            <g
               id="g4367">
              <use
                 style="stroke:#000000;stroke-width:0.8;"
                 x="54"
                 xlink:href="#m9189d546a9"
                 y="165.024"
                 id="use4365" />
            </g>
          </g>
          <g
             id="text_13">
            <!-- 400000 -->
            <g
               transform="translate(8.825 168.823219)scale(0.1 -0.1)"
               id="g4382">
              <use
                 xlink:href="#DejaVuSans-52"
                 id="use4370" />
              <use
                 x="63.623047"
                 xlink:href="#DejaVuSans-48"
                 id="use4372" />
              <use
                 x="127.246094"
                 xlink:href="#DejaVuSans-48"
                 id="use4374" />
              <use
                 x="190.869141"
                 xlink:href="#DejaVuSans-48"
                 id="use4376" />
              <use
                 x="254.492188"
                 xlink:href="#DejaVuSans-48"
                 id="use4378" />
              <use
                 x="318.115234"
                 xlink:href="#DejaVuSans-48"
                 id="use4380" />
            </g>
          </g>
        </g>
        <g
           id="ytick_4">
          <g
             id="line2d_16">
            <path
               clip-path="url(#p378300a975)"
               d="M 54 121.536  L 388.8 121.536  "
               style="fill:none;stroke:#b0b0b0;stroke-dasharray:2.96,1.28;stroke-dashoffset:0;stroke-width:0.8;"
               id="path4386" />
          </g>
          <g
             id="line2d_17">
            <g
               id="g4391">
              <use
                 style="stroke:#000000;stroke-width:0.8;"
                 x="54"
                 xlink:href="#m9189d546a9"
                 y="121.536"
                 id="use4389" />
            </g>
          </g>
          <g
             id="text_14">
            <!-- 600000 -->
            <g
               transform="translate(8.825 125.335219)scale(0.1 -0.1)"
               id="g4406">
              <use
                 xlink:href="#DejaVuSans-54"
                 id="use4394" />
              <use
                 x="63.623047"
                 xlink:href="#DejaVuSans-48"
                 id="use4396" />
              <use
                 x="127.246094"
                 xlink:href="#DejaVuSans-48"
                 id="use4398" />
              <use
                 x="190.869141"
                 xlink:href="#DejaVuSans-48"
                 id="use4400" />
              <use
                 x="254.492188"
                 xlink:href="#DejaVuSans-48"
                 id="use4402" />
              <use
                 x="318.115234"
                 xlink:href="#DejaVuSans-48"
                 id="use4404" />
            </g>
          </g>
        </g>
        <g
           id="ytick_5">
          <g
             id="line2d_18">
            <path
               clip-path="url(#p378300a975)"
               d="M 54 78.048  L 388.8 78.048  "
               style="fill:none;stroke:#b0b0b0;stroke-dasharray:2.96,1.28;stroke-dashoffset:0;stroke-width:0.8;"
               id="path4410" />
          </g>
          <g
             id="line2d_19">
            <g
               id="g4415">
              <use
                 style="stroke:#000000;stroke-width:0.8;"
                 x="54"
                 xlink:href="#m9189d546a9"
                 y="78.048"
                 id="use4413" />
            </g>
          </g>
          <g
             id="text_15">
            <!-- 800000 -->
            <g
               transform="translate(8.825 81.847219)scale(0.1 -0.1)"
               id="g4430">
              <use
                 xlink:href="#DejaVuSans-56"
                 id="use4418" />
              <use
                 x="63.623047"
                 xlink:href="#DejaVuSans-48"
                 id="use4420" />
              <use
                 x="127.246094"
                 xlink:href="#DejaVuSans-48"
                 id="use4422" />
              <use
                 x="190.869141"
                 xlink:href="#DejaVuSans-48"
                 id="use4424" />
              <use
                 x="254.492188"
                 xlink:href="#DejaVuSans-48"
                 id="use4426" />
              <use
                 x="318.115234"
                 xlink:href="#DejaVuSans-48"
                 id="use4428" />
            </g>
          </g>
        </g>
        <g
           id="ytick_6">
          <g
             id="line2d_20">
            <path
               clip-path="url(#p378300a975)"
               d="M 54 34.56  L 388.8 34.56  "
               style="fill:none;stroke:#b0b0b0;stroke-dasharray:2.96,1.28;stroke-dashoffset:0;stroke-width:0.8;"
               id="path4434" />
          </g>
          <g
             id="line2d_21">
            <g
               id="g4439">
              <use
                 style="stroke:#000000;stroke-width:0.8;"
                 x="54"
                 xlink:href="#m9189d546a9"
                 y="34.56"
                 id="use4437" />
            </g>
          </g>
          <g
             id="text_16">
            <!-- 1000000 -->
            <g
               transform="translate(2.4625 38.359219)scale(0.1 -0.1)"
               id="g4456">
              <use
                 xlink:href="#DejaVuSans-49"
                 id="use4442" />
              <use
                 x="63.623047"
                 xlink:href="#DejaVuSans-48"
                 id="use4444" />
              <use
                 x="127.246094"
                 xlink:href="#DejaVuSans-48"
                 id="use4446" />
              <use
                 x="190.869141"
                 xlink:href="#DejaVuSans-48"
                 id="use4448" />
              <use
                 x="254.492188"
                 xlink:href="#DejaVuSans-48"
                 id="use4450" />
              <use
                 x="318.115234"
                 xlink:href="#DejaVuSans-48"
                 id="use4452" />
              <use
                 x="381.738281"
                 xlink:href="#DejaVuSans-48"
                 id="use4454" />
            </g>
          </g>
        </g>
      </g>
      <g
         id="patch_3">
        <path
           d="M 54 252  L 54 34.56  "
           style="fill:none;stroke:#000000;stroke-linecap:square;stroke-linejoin:miter;stroke-width:0.8;"
           id="path4509" />
      </g>
      <g
         id="patch_4">
        <path
           d="M 388.8 252  L 388.8 34.56  "
           style="fill:none;stroke:#000000;stroke-linecap:square;stroke-linejoin:miter;stroke-width:0.8;"
           id="path4512" />
      </g>
      <g
         id="patch_5">
        <path
           d="M 54 252  L 388.8 252  "
           style="fill:none;stroke:#000000;stroke-linecap:square;stroke-linejoin:miter;stroke-width:0.8;"
           id="path4515" />
      </g>
      <g
         id="patch_6">
        <path
           d="M 54 34.56  L 388.8 34.56  "
           style="fill:none;stroke:#000000;stroke-linecap:square;stroke-linejoin:miter;stroke-width:0.8;"
           id="path4518" />
      </g>
      <g
         id="legend_1">
        <g
           id="patch_7">
          <path
             d="M 395.8 203.4925  L 435.548438 203.4925  Q 437.548438 203.4925 437.548438 201.4925  L 437.548438 85.0675  Q 437.548438 83.0675 435.548438 83.0675  L 395.8 83.0675  Q 393.8 83.0675 393.8 85.0675  L 393.8 201.4925  Q 393.8 203.4925 395.8 203.4925  z "
             style="fill:#ffffff;opacity:0.8;stroke:#cccccc;stroke-linejoin:miter;"
             id="path4521" />
        </g>
        <g
           id="patch_8">
          <path
             d="M 397.8 94.665938  L 417.8 94.665938  L 417.8 87.665938  L 397.8 87.665938  z "
             style="fill:#1f77b4;"
             id="path4524" />
        </g>
        <g
           id="text_18">
          <!-- A -->
          <defs
             id="defs4528">
            <path
               d="M 34.1875 63.1875  L 20.796875 26.90625  L 47.609375 26.90625  z M 28.609375 72.90625  L 39.796875 72.90625  L 67.578125 0  L 57.328125 0  L 50.6875 18.703125  L 17.828125 18.703125  L 11.1875 0  L 0.78125 0  z "
               id="DejaVuSans-65" />
          </defs>
          <g
             transform="translate(425.8 94.665938)scale(0.1 -0.1)"
             id="g4532">
            <use
               xlink:href="#DejaVuSans-65"
               id="use4530" />
          </g>
        </g>
        <g
           id="patch_9">
          <path
             d="M 397.8 109.344063  L 417.8 109.344063  L 417.8 102.344063  L 397.8 102.344063  z "
             style="fill:#ff7f0e;"
             id="path4535" />
        </g>
        <g
           id="text_19">
          <!-- B -->
          <defs
             id="defs4539">
            <path
               d="M 19.671875 34.8125  L 19.671875 8.109375  L 35.5 8.109375  Q 43.453125 8.109375 47.28125 11.40625  Q 51.125 14.703125 51.125 21.484375  Q 51.125 28.328125 47.28125 31.5625  Q 43.453125 34.8125 35.5 34.8125  z M 19.671875 64.796875  L 19.671875 42.828125  L 34.28125 42.828125  Q 41.5 42.828125 45.03125 45.53125  Q 48.578125 48.25 48.578125 53.8125  Q 48.578125 59.328125 45.03125 62.0625  Q 41.5 64.796875 34.28125 64.796875  z M 9.8125 72.90625  L 35.015625 72.90625  Q 46.296875 72.90625 52.390625 68.21875  Q 58.5 63.53125 58.5 54.890625  Q 58.5 48.1875 55.375 44.234375  Q 52.25 40.28125 46.1875 39.3125  Q 53.46875 37.75 57.5 32.78125  Q 61.53125 27.828125 61.53125 20.40625  Q 61.53125 10.640625 54.890625 5.3125  Q 48.25 0 35.984375 0  L 9.8125 0  z "
               id="DejaVuSans-66" />
          </defs>
          <g
             transform="translate(425.8 109.344063)scale(0.1 -0.1)"
             id="g4543">
            <use
               xlink:href="#DejaVuSans-66"
               id="use4541" />
          </g>
        </g>
        <g
           id="patch_10">
          <path
             d="M 397.8 124.022188  L 417.8 124.022188  L 417.8 117.022188  L 397.8 117.022188  z "
             style="fill:#2ca02c;"
             id="path4546" />
        </g>
        <g
           id="text_20">
          <!-- C -->
          <defs
             id="defs4550">
            <path
               d="M 64.40625 67.28125  L 64.40625 56.890625  Q 59.421875 61.53125 53.78125 63.8125  Q 48.140625 66.109375 41.796875 66.109375  Q 29.296875 66.109375 22.65625 58.46875  Q 16.015625 50.828125 16.015625 36.375  Q 16.015625 21.96875 22.65625 14.328125  Q 29.296875 6.6875 41.796875 6.6875  Q 48.140625 6.6875 53.78125 8.984375  Q 59.421875 11.28125 64.40625 15.921875  L 64.40625 5.609375  Q 59.234375 2.09375 53.4375 0.328125  Q 47.65625 -1.421875 41.21875 -1.421875  Q 24.65625 -1.421875 15.125 8.703125  Q 5.609375 18.84375 5.609375 36.375  Q 5.609375 53.953125 15.125 64.078125  Q 24.65625 74.21875 41.21875 74.21875  Q 47.75 74.21875 53.53125 72.484375  Q 59.328125 70.75 64.40625 67.28125  z "
               id="DejaVuSans-67" />
          </defs>
          <g
             transform="translate(425.8 124.022188)scale(0.1 -0.1)"
             id="g4554">
            <use
               xlink:href="#DejaVuSans-67"
               id="use4552" />
          </g>
        </g>
        <g
           id="patch_11">
          <path
             d="M 397.8 138.700313  L 417.8 138.700313  L 417.8 131.700313  L 397.8 131.700313  z "
             style="fill:#d62728;"
             id="path4557" />
        </g>
        <g
           id="text_21">
          <!-- D -->
          <defs
             id="defs4561">
            <path
               d="M 19.671875 64.796875  L 19.671875 8.109375  L 31.59375 8.109375  Q 46.6875 8.109375 53.6875 14.9375  Q 60.6875 21.78125 60.6875 36.53125  Q 60.6875 51.171875 53.6875 57.984375  Q 46.6875 64.796875 31.59375 64.796875  z M 9.8125 72.90625  L 30.078125 72.90625  Q 51.265625 72.90625 61.171875 64.09375  Q 71.09375 55.28125 71.09375 36.53125  Q 71.09375 17.671875 61.125 8.828125  Q 51.171875 0 30.078125 0  L 9.8125 0  z "
               id="DejaVuSans-68" />
          </defs>
          <g
             transform="translate(425.8 138.700313)scale(0.1 -0.1)"
             id="g4565">
            <use
               xlink:href="#DejaVuSans-68"
               id="use4563" />
          </g>
        </g>
        <g
           id="patch_12">
          <path
             d="M 397.8 153.378438  L 417.8 153.378438  L 417.8 146.378438  L 397.8 146.378438  z "
             style="fill:#9467bd;"
             id="path4568" />
        </g>
        <g
           id="text_22">
          <!-- E -->
          <defs
             id="defs4572">
            <path
               d="M 9.8125 72.90625  L 55.90625 72.90625  L 55.90625 64.59375  L 19.671875 64.59375  L 19.671875 43.015625  L 54.390625 43.015625  L 54.390625 34.71875  L 19.671875 34.71875  L 19.671875 8.296875  L 56.78125 8.296875  L 56.78125 0  L 9.8125 0  z "
               id="DejaVuSans-69" />
          </defs>
          <g
             transform="translate(425.8 153.378438)scale(0.1 -0.1)"
             id="g4576">
            <use
               xlink:href="#DejaVuSans-69"
               id="use4574" />
          </g>
        </g>
        <g
           id="patch_13">
          <path
             d="M 397.8 168.056563  L 417.8 168.056563  L 417.8 161.056563  L 397.8 161.056563  z "
             style="fill:#8c564b;"
             id="path4579" />
        </g>
        <g
           id="text_23">
          <!-- F -->
          <defs
             id="defs4583">
            <path
               d="M 9.8125 72.90625  L 51.703125 72.90625  L 51.703125 64.59375  L 19.671875 64.59375  L 19.671875 43.109375  L 48.578125 43.109375  L 48.578125 34.8125  L 19.671875 34.8125  L 19.671875 0  L 9.8125 0  z "
               id="DejaVuSans-70" />
          </defs>
          <g
             transform="translate(425.8 168.056563)scale(0.1 -0.1)"
             id="g4587">
            <use
               xlink:href="#DejaVuSans-70"
               id="use4585" />
          </g>
        </g>
        <g
           id="patch_14">
          <path
             d="M 397.8 182.734688  L 417.8 182.734688  L 417.8 175.734688  L 397.8 175.734688  z "
             style="fill:#e377c2;"
             id="path4590" />
        </g>
        <g
           id="text_24">
          <!-- G -->
          <defs
             id="defs4594">
            <path
               d="M 59.515625 10.40625  L 59.515625 29.984375  L 43.40625 29.984375  L 43.40625 38.09375  L 69.28125 38.09375  L 69.28125 6.78125  Q 63.578125 2.734375 56.6875 0.65625  Q 49.8125 -1.421875 42 -1.421875  Q 24.90625 -1.421875 15.25 8.5625  Q 5.609375 18.5625 5.609375 36.375  Q 5.609375 54.25 15.25 64.234375  Q 24.90625 74.21875 42 74.21875  Q 49.125 74.21875 55.546875 72.453125  Q 61.96875 70.703125 67.390625 67.28125  L 67.390625 56.78125  Q 61.921875 61.421875 55.765625 63.765625  Q 49.609375 66.109375 42.828125 66.109375  Q 29.4375 66.109375 22.71875 58.640625  Q 16.015625 51.171875 16.015625 36.375  Q 16.015625 21.625 22.71875 14.15625  Q 29.4375 6.6875 42.828125 6.6875  Q 48.046875 6.6875 52.140625 7.59375  Q 56.25 8.5 59.515625 10.40625  z "
               id="DejaVuSans-71" />
          </defs>
          <g
             transform="translate(425.8 182.734688)scale(0.1 -0.1)"
             id="g4598">
            <use
               xlink:href="#DejaVuSans-71"
               id="use4596" />
          </g>
        </g>
        <g
           id="patch_15">
          <path
             d="M 397.8 197.412813  L 417.8 197.412813  L 417.8 190.412813  L 397.8 190.412813  z "
             style="fill:#7f7f7f;"
             id="path4601" />
        </g>
        <g
           id="text_25">
          <!-- H -->
          <defs
             id="defs4605">
            <path
               d="M 9.8125 72.90625  L 19.671875 72.90625  L 19.671875 43.015625  L 55.515625 43.015625  L 55.515625 72.90625  L 65.375 72.90625  L 65.375 0  L 55.515625 0  L 55.515625 34.71875  L 19.671875 34.71875  L 19.671875 0  L 9.8125 0  z "
               id="DejaVuSans-72" />
          </defs>
          <g
             transform="translate(425.8 197.412813)scale(0.1 -0.1)"
             id="g4609">
            <use
               xlink:href="#DejaVuSans-72"
               id="use4607" />
          </g>
        </g>
      </g>
      <g
         id="patch_16">
        <path
           clip-path="url(#p378300a975)"
           d="M 69.218182 252  L 96.887603 252  L 96.887603 215.400573  L 69.218182 215.400573  z "
           style="fill:#1f77b4;"
           id="path4613" />
      </g>
      <g
         id="patch_17">
        <path
           clip-path="url(#p378300a975)"
           d="M 103.804959 252  L 131.47438 252  L 131.47438 213.342886  L 103.804959 213.342886  z "
           style="fill:#1f77b4;"
           id="path4616" />
      </g>
      <g
         id="patch_18">
        <path
           clip-path="url(#p378300a975)"
           d="M 138.391736 252  L 166.061157 252  L 166.061157 208.730775  L 138.391736 208.730775  z "
           style="fill:#1f77b4;"
           id="path4619" />
      </g>
      <g
         id="patch_19">
        <path
           clip-path="url(#p378300a975)"
           d="M 172.978512 252  L 200.647934 252  L 200.647934 245.507248  L 172.978512 245.507248  z "
           style="fill:#1f77b4;"
           id="path4622" />
      </g>
      <g
         id="patch_20">
        <path
           clip-path="url(#p378300a975)"
           d="M 207.565289 252  L 235.234711 252  L 235.234711 208.569765  L 207.565289 208.569765  z "
           style="fill:#1f77b4;"
           id="path4625" />
      </g>
      <g
         id="patch_21">
        <path
           clip-path="url(#p378300a975)"
           d="M 242.152066 252  L 269.821488 252  L 269.821488 246.459185  L 242.152066 246.459185  z "
           style="fill:#1f77b4;"
           id="path4628" />
      </g>
      <g
         id="patch_22">
        <path
           clip-path="url(#p378300a975)"
           d="M 276.738843 252  L 304.408264 252  L 304.408264 246.860745  L 276.738843 246.860745  z "
           style="fill:#1f77b4;"
           id="path4631" />
      </g>
      <g
         id="patch_23">
        <path
           clip-path="url(#p378300a975)"
           d="M 311.32562 252  L 338.995041 252  L 338.995041 246.656066  L 311.32562 246.656066  z "
           style="fill:#1f77b4;"
           id="path4634" />
      </g>
      <g
         id="patch_24">
        <path
           clip-path="url(#p378300a975)"
           d="M 345.912397 252  L 373.581818 252  L 373.581818 207.379686  L 345.912397 207.379686  z "
           style="fill:#1f77b4;"
           id="path4637" />
      </g>
      <g
         id="patch_25">
        <path
           clip-path="url(#p378300a975)"
           d="M 69.218182 215.400573  L 96.887603 215.400573  L 96.887603 215.400573  L 69.218182 215.400573  z "
           style="fill:url(#hff154a1e97);"
           id="path4640" />
      </g>
      <g
         id="patch_26">
        <path
           clip-path="url(#p378300a975)"
           d="M 103.804959 213.342886  L 131.47438 213.342886  L 131.47438 213.342886  L 103.804959 213.342886  z "
           style="fill:url(#hff154a1e97);"
           id="path4643" />
      </g>
      <g
         id="patch_27">
        <path
           clip-path="url(#p378300a975)"
           d="M 138.391736 208.730775  L 166.061157 208.730775  L 166.061157 207.496138  L 138.391736 207.496138  z "
           style="fill:url(#hff154a1e97);"
           id="path4646" />
      </g>
      <g
         id="patch_28">
        <path
           clip-path="url(#p378300a975)"
           d="M 172.978512 245.507248  L 200.647934 245.507248  L 200.647934 245.507248  L 172.978512 245.507248  z "
           style="fill:url(#hff154a1e97);"
           id="path4649" />
      </g>
      <g
         id="patch_29">
        <path
           clip-path="url(#p378300a975)"
           d="M 207.565289 208.569765  L 235.234711 208.569765  L 235.234711 208.566321  L 207.565289 208.566321  z "
           style="fill:url(#hff154a1e97);"
           id="path4652" />
      </g>
      <g
         id="patch_30">
        <path
           clip-path="url(#p378300a975)"
           d="M 242.152066 246.459185  L 269.821488 246.459185  L 269.821488 246.459185  L 242.152066 246.459185  z "
           style="fill:url(#hff154a1e97);"
           id="path4655" />
      </g>
      <g
         id="patch_31">
        <path
           clip-path="url(#p378300a975)"
           d="M 276.738843 246.860745  L 304.408264 246.860745  L 304.408264 246.860745  L 276.738843 246.860745  z "
           style="fill:url(#hff154a1e97);"
           id="path4658" />
      </g>
      <g
         id="patch_32">
        <path
           clip-path="url(#p378300a975)"
           d="M 311.32562 246.656066  L 338.995041 246.656066  L 338.995041 246.656066  L 311.32562 246.656066  z "
           style="fill:url(#hff154a1e97);"
           id="path4661" />
      </g>
      <g
         id="patch_33">
        <path
           clip-path="url(#p378300a975)"
           d="M 345.912397 207.379686  L 373.581818 207.379686  L 373.581818 206.167247  L 345.912397 206.167247  z "
           style="fill:url(#hff154a1e97);"
           id="path4664" />
      </g>
      <g
         id="patch_34">
        <path
           clip-path="url(#p378300a975)"
           d="M 69.218182 215.400573  L 96.887603 215.400573  L 96.887603 185.583085  L 69.218182 185.583085  z "
           style="fill:#ff7f0e;"
           id="path4667" />
      </g>
      <g
         id="patch_35">
        <path
           clip-path="url(#p378300a975)"
           d="M 103.804959 213.342886  L 131.47438 213.342886  L 131.47438 180.253167  L 103.804959 180.253167  z "
           style="fill:#ff7f0e;"
           id="path4670" />
      </g>
      <g
         id="patch_36">
        <path
           clip-path="url(#p378300a975)"
           d="M 138.391736 207.496138  L 166.061157 207.496138  L 166.061157 169.917768  L 138.391736 169.917768  z "
           style="fill:#ff7f0e;"
           id="path4673" />
      </g>
      <g
         id="patch_37">
        <path
           clip-path="url(#p378300a975)"
           d="M 172.978512 245.507248  L 200.647934 245.507248  L 200.647934 234.164678  L 172.978512 234.164678  z "
           style="fill:#ff7f0e;"
           id="path4676" />
      </g>
      <g
         id="patch_38">
        <path
           clip-path="url(#p378300a975)"
           d="M 207.565289 208.566321  L 235.234711 208.566321  L 235.234711 169.642632  L 207.565289 169.642632  z "
           style="fill:#ff7f0e;"
           id="path4679" />
      </g>
      <g
         id="patch_39">
        <path
           clip-path="url(#p378300a975)"
           d="M 242.152066 246.459185  L 269.821488 246.459185  L 269.821488 241.157309  L 242.152066 241.157309  z "
           style="fill:#ff7f0e;"
           id="path4682" />
      </g>
      <g
         id="patch_40">
        <path
           clip-path="url(#p378300a975)"
           d="M 276.738843 246.860745  L 304.408264 246.860745  L 304.408264 211.094822  L 276.738843 211.094822  z "
           style="fill:#ff7f0e;"
           id="path4685" />
      </g>
      <g
         id="patch_41">
        <path
           clip-path="url(#p378300a975)"
           d="M 311.32562 246.656066  L 338.995041 246.656066  L 338.995041 207.137292  L 311.32562 207.137292  z "
           style="fill:#ff7f0e;"
           id="path4688" />
      </g>
      <g
         id="patch_42">
        <path
           clip-path="url(#p378300a975)"
           d="M 345.912397 206.167247  L 373.581818 206.167247  L 373.581818 200.742286  L 345.912397 200.742286  z "
           style="fill:#ff7f0e;"
           id="path4691" />
      </g>
      <g
         id="patch_43">
        <path
           clip-path="url(#p378300a975)"
           d="M 69.218182 185.583085  L 96.887603 185.583085  L 96.887603 185.583085  L 69.218182 185.583085  z "
           style="fill:url(#h260721e947);"
           id="path4694" />
      </g>
      <g
         id="patch_44">
        <path
           clip-path="url(#p378300a975)"
           d="M 103.804959 180.253167  L 131.47438 180.253167  L 131.47438 180.253167  L 103.804959 180.253167  z "
           style="fill:url(#h260721e947);"
           id="path4697" />
      </g>
      <g
         id="patch_45">
        <path
           clip-path="url(#p378300a975)"
           d="M 138.391736 169.917768  L 166.061157 169.917768  L 166.061157 169.917768  L 138.391736 169.917768  z "
           style="fill:url(#h260721e947);"
           id="path4700" />
      </g>
      <g
         id="patch_46">
        <path
           clip-path="url(#p378300a975)"
           d="M 172.978512 234.164678  L 200.647934 234.164678  L 200.647934 234.164678  L 172.978512 234.164678  z "
           style="fill:url(#h260721e947);"
           id="path4703" />
      </g>
      <g
         id="patch_47">
        <path
           clip-path="url(#p378300a975)"
           d="M 207.565289 169.642632  L 235.234711 169.642632  L 235.234711 169.591571  L 207.565289 169.591571  z "
           style="fill:url(#h260721e947);"
           id="path4706" />
      </g>
      <g
         id="patch_48">
        <path
           clip-path="url(#p378300a975)"
           d="M 242.152066 241.157309  L 269.821488 241.157309  L 269.821488 241.157309  L 242.152066 241.157309  z "
           style="fill:url(#h260721e947);"
           id="path4709" />
      </g>
      <g
         id="patch_49">
        <path
           clip-path="url(#p378300a975)"
           d="M 276.738843 211.094822  L 304.408264 211.094822  L 304.408264 211.094822  L 276.738843 211.094822  z "
           style="fill:url(#h260721e947);"
           id="path4712" />
      </g>
      <g
         id="patch_50">
        <path
           clip-path="url(#p378300a975)"
           d="M 311.32562 207.137292  L 338.995041 207.137292  L 338.995041 207.07143  L 311.32562 207.07143  z "
           style="fill:url(#h260721e947);"
           id="path4715" />
      </g>
      <g
         id="patch_51">
        <path
           clip-path="url(#p378300a975)"
           d="M 345.912397 200.742286  L 373.581818 200.742286  L 373.581818 200.742286  L 345.912397 200.742286  z "
           style="fill:url(#h260721e947);"
           id="path4718" />
      </g>
      <g
         id="patch_52">
        <path
           clip-path="url(#p378300a975)"
           d="M 69.218182 185.583085  L 96.887603 185.583085  L 96.887603 159.996959  L 69.218182 159.996959  z "
           style="fill:#2ca02c;"
           id="path4721" />
      </g>
      <g
         id="patch_53">
        <path
           clip-path="url(#p378300a975)"
           d="M 103.804959 180.253167  L 131.47438 180.253167  L 131.47438 154.455042  L 103.804959 154.455042  z "
           style="fill:#2ca02c;"
           id="path4724" />
      </g>
      <g
         id="patch_54">
        <path
           clip-path="url(#p378300a975)"
           d="M 138.391736 169.917768  L 166.061157 169.917768  L 166.061157 149.262305  L 138.391736 149.262305  z "
           style="fill:#2ca02c;"
           id="path4727" />
      </g>
      <g
         id="patch_55">
        <path
           clip-path="url(#p378300a975)"
           d="M 172.978512 234.164678  L 200.647934 234.164678  L 200.647934 201.996921  L 172.978512 201.996921  z "
           style="fill:#2ca02c;"
           id="path4730" />
      </g>
      <g
         id="patch_56">
        <path
           clip-path="url(#p378300a975)"
           d="M 207.565289 169.591571  L 235.234711 169.591571  L 235.234711 139.183776  L 207.565289 139.183776  z "
           style="fill:#2ca02c;"
           id="path4733" />
      </g>
      <g
         id="patch_57">
        <path
           clip-path="url(#p378300a975)"
           d="M 242.152066 241.157309  L 269.821488 241.157309  L 269.821488 211.126144  L 242.152066 211.126144  z "
           style="fill:#2ca02c;"
           id="path4736" />
      </g>
      <g
         id="patch_58">
        <path
           clip-path="url(#p378300a975)"
           d="M 276.738843 211.094822  L 304.408264 211.094822  L 304.408264 180.321811  L 276.738843 180.321811  z "
           style="fill:#2ca02c;"
           id="path4739" />
      </g>
      <g
         id="patch_59">
        <path
           clip-path="url(#p378300a975)"
           d="M 311.32562 207.07143  L 338.995041 207.07143  L 338.995041 192.802762  L 311.32562 192.802762  z "
           style="fill:#2ca02c;"
           id="path4742" />
      </g>
      <g
         id="patch_60">
        <path
           clip-path="url(#p378300a975)"
           d="M 345.912397 200.742286  L 373.581818 200.742286  L 373.581818 171.008634  L 345.912397 171.008634  z "
           style="fill:#2ca02c;"
           id="path4745" />
      </g>
      <g
         id="patch_61">
        <path
           clip-path="url(#p378300a975)"
           d="M 69.218182 159.996959  L 96.887603 159.996959  L 96.887603 159.996959  L 69.218182 159.996959  z "
           style="fill:url(#h6ee14825a2);"
           id="path4748" />
      </g>
      <g
         id="patch_62">
        <path
           clip-path="url(#p378300a975)"
           d="M 103.804959 154.455042  L 131.47438 154.455042  L 131.47438 154.455042  L 103.804959 154.455042  z "
           style="fill:url(#h6ee14825a2);"
           id="path4751" />
      </g>
      <g
         id="patch_63">
        <path
           clip-path="url(#p378300a975)"
           d="M 138.391736 149.262305  L 166.061157 149.262305  L 166.061157 149.262305  L 138.391736 149.262305  z "
           style="fill:url(#h6ee14825a2);"
           id="path4754" />
      </g>
      <g
         id="patch_64">
        <path
           clip-path="url(#p378300a975)"
           d="M 172.978512 201.996921  L 200.647934 201.996921  L 200.647934 201.996921  L 172.978512 201.996921  z "
           style="fill:url(#h6ee14825a2);"
           id="path4757" />
      </g>
      <g
         id="patch_65">
        <path
           clip-path="url(#p378300a975)"
           d="M 207.565289 139.183776  L 235.234711 139.183776  L 235.234711 139.183776  L 207.565289 139.183776  z "
           style="fill:url(#h6ee14825a2);"
           id="path4760" />
      </g>
      <g
         id="patch_66">
        <path
           clip-path="url(#p378300a975)"
           d="M 242.152066 211.126144  L 269.821488 211.126144  L 269.821488 211.126144  L 242.152066 211.126144  z "
           style="fill:url(#h6ee14825a2);"
           id="path4763" />
      </g>
      <g
         id="patch_67">
        <path
           clip-path="url(#p378300a975)"
           d="M 276.738843 180.321811  L 304.408264 180.321811  L 304.408264 180.321811  L 276.738843 180.321811  z "
           style="fill:url(#h6ee14825a2);"
           id="path4766" />
      </g>
      <g
         id="patch_68">
        <path
           clip-path="url(#p378300a975)"
           d="M 311.32562 192.802762  L 338.995041 192.802762  L 338.995041 192.802762  L 311.32562 192.802762  z "
           style="fill:url(#h6ee14825a2);"
           id="path4769" />
      </g>
      <g
         id="patch_69">
        <path
           clip-path="url(#p378300a975)"
           d="M 345.912397 171.008634  L 373.581818 171.008634  L 373.581818 171.008634  L 345.912397 171.008634  z "
           style="fill:url(#h6ee14825a2);"
           id="path4772" />
      </g>
      <g
         id="patch_70">
        <path
           clip-path="url(#p378300a975)"
           d="M 69.218182 159.996959  L 96.887603 159.996959  L 96.887603 136.408807  L 69.218182 136.408807  z "
           style="fill:#d62728;"
           id="path4775" />
      </g>
      <g
         id="patch_71">
        <path
           clip-path="url(#p378300a975)"
           d="M 103.804959 154.455042  L 131.47438 154.455042  L 131.47438 129.117548  L 103.804959 129.117548  z "
           style="fill:#d62728;"
           id="path4778" />
      </g>
      <g
         id="patch_72">
        <path
           clip-path="url(#p378300a975)"
           d="M 138.391736 149.262305  L 166.061157 149.262305  L 166.061157 134.515122  L 138.391736 134.515122  z "
           style="fill:#d62728;"
           id="path4781" />
      </g>
      <g
         id="patch_73">
        <path
           clip-path="url(#p378300a975)"
           d="M 172.978512 201.996921  L 200.647934 201.996921  L 200.647934 196.868877  L 172.978512 196.868877  z "
           style="fill:#d62728;"
           id="path4784" />
      </g>
      <g
         id="patch_74">
        <path
           clip-path="url(#p378300a975)"
           d="M 207.565289 139.183776  L 235.234711 139.183776  L 235.234711 133.916118  L 207.565289 133.916118  z "
           style="fill:#d62728;"
           id="path4787" />
      </g>
      <g
         id="patch_75">
        <path
           clip-path="url(#p378300a975)"
           d="M 242.152066 211.126144  L 269.821488 211.126144  L 269.821488 181.033729  L 242.152066 181.033729  z "
           style="fill:#d62728;"
           id="path4790" />
      </g>
      <g
         id="patch_76">
        <path
           clip-path="url(#p378300a975)"
           d="M 276.738843 180.321811  L 304.408264 180.321811  L 304.408264 170.340273  L 276.738843 170.340273  z "
           style="fill:#d62728;"
           id="path4793" />
      </g>
      <g
         id="patch_77">
        <path
           clip-path="url(#p378300a975)"
           d="M 311.32562 192.802762  L 338.995041 192.802762  L 338.995041 163.553342  L 311.32562 163.553342  z "
           style="fill:#d62728;"
           id="path4796" />
      </g>
      <g
         id="patch_78">
        <path
           clip-path="url(#p378300a975)"
           d="M 345.912397 171.008634  L 373.581818 171.008634  L 373.581818 142.749907  L 345.912397 142.749907  z "
           style="fill:#d62728;"
           id="path4799" />
      </g>
      <g
         id="patch_79">
        <path
           clip-path="url(#p378300a975)"
           d="M 69.218182 136.408807  L 96.887603 136.408807  L 96.887603 136.408807  L 69.218182 136.408807  z "
           style="fill:url(#h1196a1b026);"
           id="path4802" />
      </g>
      <g
         id="patch_80">
        <path
           clip-path="url(#p378300a975)"
           d="M 103.804959 129.117548  L 131.47438 129.117548  L 131.47438 129.117548  L 103.804959 129.117548  z "
           style="fill:url(#h1196a1b026);"
           id="path4805" />
      </g>
      <g
         id="patch_81">
        <path
           clip-path="url(#p378300a975)"
           d="M 138.391736 134.515122  L 166.061157 134.515122  L 166.061157 134.515122  L 138.391736 134.515122  z "
           style="fill:url(#h1196a1b026);"
           id="path4808" />
      </g>
      <g
         id="patch_82">
        <path
           clip-path="url(#p378300a975)"
           d="M 172.978512 196.868877  L 200.647934 196.868877  L 200.647934 196.868877  L 172.978512 196.868877  z "
           style="fill:url(#h1196a1b026);"
           id="path4811" />
      </g>
      <g
         id="patch_83">
        <path
           clip-path="url(#p378300a975)"
           d="M 207.565289 133.916118  L 235.234711 133.916118  L 235.234711 133.916118  L 207.565289 133.916118  z "
           style="fill:url(#h1196a1b026);"
           id="path4814" />
      </g>
      <g
         id="patch_84">
        <path
           clip-path="url(#p378300a975)"
           d="M 242.152066 181.033729  L 269.821488 181.033729  L 269.821488 181.033729  L 242.152066 181.033729  z "
           style="fill:url(#h1196a1b026);"
           id="path4817" />
      </g>
      <g
         id="patch_85">
        <path
           clip-path="url(#p378300a975)"
           d="M 276.738843 170.340273  L 304.408264 170.340273  L 304.408264 170.340273  L 276.738843 170.340273  z "
           style="fill:url(#h1196a1b026);"
           id="path4820" />
      </g>
      <g
         id="patch_86">
        <path
           clip-path="url(#p378300a975)"
           d="M 311.32562 163.553342  L 338.995041 163.553342  L 338.995041 163.553342  L 311.32562 163.553342  z "
           style="fill:url(#h1196a1b026);"
           id="path4823" />
      </g>
      <g
         id="patch_87">
        <path
           clip-path="url(#p378300a975)"
           d="M 345.912397 142.749907  L 373.581818 142.749907  L 373.581818 142.749907  L 345.912397 142.749907  z "
           style="fill:url(#h1196a1b026);"
           id="path4826" />
      </g>
      <g
         id="patch_88">
        <path
           clip-path="url(#p378300a975)"
           d="M 69.218182 136.408807  L 96.887603 136.408807  L 96.887603 109.077862  L 69.218182 109.077862  z "
           style="fill:#9467bd;"
           id="path4829" />
      </g>
      <g
         id="patch_89">
        <path
           clip-path="url(#p378300a975)"
           d="M 103.804959 129.117548  L 131.47438 129.117548  L 131.47438 101.472433  L 103.804959 101.472433  z "
           style="fill:#9467bd;"
           id="path4832" />
      </g>
      <g
         id="patch_90">
        <path
           clip-path="url(#p378300a975)"
           d="M 138.391736 134.515122  L 166.061157 134.515122  L 166.061157 129.166318  L 138.391736 129.166318  z "
           style="fill:#9467bd;"
           id="path4835" />
      </g>
      <g
         id="patch_91">
        <path
           clip-path="url(#p378300a975)"
           d="M 172.978512 196.868877  L 200.647934 196.868877  L 200.647934 165.569448  L 172.978512 165.569448  z "
           style="fill:#9467bd;"
           id="path4838" />
      </g>
      <g
         id="patch_92">
        <path
           clip-path="url(#p378300a975)"
           d="M 207.565289 133.916118  L 235.234711 133.916118  L 235.234711 103.700003  L 207.565289 103.700003  z "
           style="fill:#9467bd;"
           id="path4841" />
      </g>
      <g
         id="patch_93">
        <path
           clip-path="url(#p378300a975)"
           d="M 242.152066 181.033729  L 269.821488 181.033729  L 269.821488 149.722369  L 242.152066 149.722369  z "
           style="fill:#9467bd;"
           id="path4844" />
      </g>
      <g
         id="patch_94">
        <path
           clip-path="url(#p378300a975)"
           d="M 276.738843 170.340273  L 304.408264 170.340273  L 304.408264 139.028913  L 276.738843 139.028913  z "
           style="fill:#9467bd;"
           id="path4847" />
      </g>
      <g
         id="patch_95">
        <path
           clip-path="url(#p378300a975)"
           d="M 311.32562 163.553342  L 338.995041 163.553342  L 338.995041 132.414173  L 311.32562 132.414173  z "
           style="fill:#9467bd;"
           id="path4850" />
      </g>
      <g
         id="patch_96">
        <path
           clip-path="url(#p378300a975)"
           d="M 345.912397 142.749907  L 373.581818 142.749907  L 373.581818 137.635738  L 345.912397 137.635738  z "
           style="fill:#9467bd;"
           id="path4853" />
      </g>
      <g
         id="patch_97">
        <path
           clip-path="url(#p378300a975)"
           d="M 69.218182 109.077862  L 96.887603 109.077862  L 96.887603 109.077862  L 69.218182 109.077862  z "
           style="fill:url(#h41f57142e6);"
           id="path4856" />
      </g>
      <g
         id="patch_98">
        <path
           clip-path="url(#p378300a975)"
           d="M 103.804959 101.472433  L 131.47438 101.472433  L 131.47438 101.472433  L 103.804959 101.472433  z "
           style="fill:url(#h41f57142e6);"
           id="path4859" />
      </g>
      <g
         id="patch_99">
        <path
           clip-path="url(#p378300a975)"
           d="M 138.391736 129.166318  L 166.061157 129.166318  L 166.061157 129.166318  L 138.391736 129.166318  z "
           style="fill:url(#h41f57142e6);"
           id="path4862" />
      </g>
      <g
         id="patch_100">
        <path
           clip-path="url(#p378300a975)"
           d="M 172.978512 165.569448  L 200.647934 165.569448  L 200.647934 160.509996  L 172.978512 160.509996  z "
           style="fill:url(#h41f57142e6);"
           id="path4865" />
      </g>
      <g
         id="patch_101">
        <path
           clip-path="url(#p378300a975)"
           d="M 207.565289 103.700003  L 235.234711 103.700003  L 235.234711 103.651867  L 207.565289 103.651867  z "
           style="fill:url(#h41f57142e6);"
           id="path4868" />
      </g>
      <g
         id="patch_102">
        <path
           clip-path="url(#p378300a975)"
           d="M 242.152066 149.722369  L 269.821488 149.722369  L 269.821488 144.776168  L 242.152066 144.776168  z "
           style="fill:url(#h41f57142e6);"
           id="path4871" />
      </g>
      <g
         id="patch_103">
        <path
           clip-path="url(#p378300a975)"
           d="M 276.738843 139.028913  L 304.408264 139.028913  L 304.408264 134.618976  L 276.738843 134.618976  z "
           style="fill:url(#h41f57142e6);"
           id="path4874" />
      </g>
      <g
         id="patch_104">
        <path
           clip-path="url(#p378300a975)"
           d="M 311.32562 132.414173  L 338.995041 132.414173  L 338.995041 129.555272  L 311.32562 129.555272  z "
           style="fill:url(#h41f57142e6);"
           id="path4877" />
      </g>
      <g
         id="patch_105">
        <path
           clip-path="url(#p378300a975)"
           d="M 345.912397 137.635738  L 373.581818 137.635738  L 373.581818 137.635738  L 345.912397 137.635738  z "
           style="fill:url(#h41f57142e6);"
           id="path4880" />
      </g>
      <g
         id="patch_106">
        <path
           clip-path="url(#p378300a975)"
           d="M 69.218182 109.077862  L 96.887603 109.077862  L 96.887603 88.434541  L 69.218182 88.434541  z "
           style="fill:#8c564b;"
           id="path4883" />
      </g>
      <g
         id="patch_107">
        <path
           clip-path="url(#p378300a975)"
           d="M 103.804959 101.472433  L 131.47438 101.472433  L 131.47438 79.763191  L 103.804959 79.763191  z "
           style="fill:#8c564b;"
           id="path4886" />
      </g>
      <g
         id="patch_108">
        <path
           clip-path="url(#p378300a975)"
           d="M 138.391736 129.166318  L 166.061157 129.166318  L 166.061157 115.350821  L 138.391736 115.350821  z "
           style="fill:#8c564b;"
           id="path4889" />
      </g>
      <g
         id="patch_109">
        <path
           clip-path="url(#p378300a975)"
           d="M 172.978512 160.509996  L 200.647934 160.509996  L 200.647934 136.037556  L 172.978512 136.037556  z "
           style="fill:#8c564b;"
           id="path4892" />
      </g>
      <g
         id="patch_110">
        <path
           clip-path="url(#p378300a975)"
           d="M 207.565289 103.651867  L 235.234711 103.651867  L 235.234711 98.371728  L 207.565289 98.371728  z "
           style="fill:#8c564b;"
           id="path4895" />
      </g>
      <g
         id="patch_111">
        <path
           clip-path="url(#p378300a975)"
           d="M 242.152066 144.776168  L 269.821488 144.776168  L 269.821488 119.647294  L 242.152066 119.647294  z "
           style="fill:#8c564b;"
           id="path4898" />
      </g>
      <g
         id="patch_112">
        <path
           clip-path="url(#p378300a975)"
           d="M 276.738843 134.618976  L 304.408264 134.618976  L 304.408264 110.0033  L 276.738843 110.0033  z "
           style="fill:#8c564b;"
           id="path4901" />
      </g>
      <g
         id="patch_113">
        <path
           clip-path="url(#p378300a975)"
           d="M 311.32562 129.555272  L 338.995041 129.555272  L 338.995041 106.361241  L 311.32562 106.361241  z "
           style="fill:#8c564b;"
           id="path4904" />
      </g>
      <g
         id="patch_114">
        <path
           clip-path="url(#p378300a975)"
           d="M 345.912397 137.635738  L 373.581818 137.635738  L 373.581818 113.978194  L 345.912397 113.978194  z "
           style="fill:#8c564b;"
           id="path4907" />
      </g>
      <g
         id="patch_115">
        <path
           clip-path="url(#p378300a975)"
           d="M 69.218182 88.434541  L 96.887603 88.434541  L 96.887603 88.434541  L 69.218182 88.434541  z "
           style="fill:url(#h8b536455a5);"
           id="path4910" />
      </g>
      <g
         id="patch_116">
        <path
           clip-path="url(#p378300a975)"
           d="M 103.804959 79.763191  L 131.47438 79.763191  L 131.47438 79.763191  L 103.804959 79.763191  z "
           style="fill:url(#h8b536455a5);"
           id="path4913" />
      </g>
      <g
         id="patch_117">
        <path
           clip-path="url(#p378300a975)"
           d="M 138.391736 115.350821  L 166.061157 115.350821  L 166.061157 115.350821  L 138.391736 115.350821  z "
           style="fill:url(#h8b536455a5);"
           id="path4916" />
      </g>
      <g
         id="patch_118">
        <path
           clip-path="url(#p378300a975)"
           d="M 172.978512 136.037556  L 200.647934 136.037556  L 200.647934 136.037556  L 172.978512 136.037556  z "
           style="fill:url(#h8b536455a5);"
           id="path4919" />
      </g>
      <g
         id="patch_119">
        <path
           clip-path="url(#p378300a975)"
           d="M 207.565289 98.371728  L 235.234711 98.371728  L 235.234711 98.371728  L 207.565289 98.371728  z "
           style="fill:url(#h8b536455a5);"
           id="path4922" />
      </g>
      <g
         id="patch_120">
        <path
           clip-path="url(#p378300a975)"
           d="M 242.152066 119.647294  L 269.821488 119.647294  L 269.821488 119.647294  L 242.152066 119.647294  z "
           style="fill:url(#h8b536455a5);"
           id="path4925" />
      </g>
      <g
         id="patch_121">
        <path
           clip-path="url(#p378300a975)"
           d="M 276.738843 110.0033  L 304.408264 110.0033  L 304.408264 110.0033  L 276.738843 110.0033  z "
           style="fill:url(#h8b536455a5);"
           id="path4928" />
      </g>
      <g
         id="patch_122">
        <path
           clip-path="url(#p378300a975)"
           d="M 311.32562 106.361241  L 338.995041 106.361241  L 338.995041 106.361241  L 311.32562 106.361241  z "
           style="fill:url(#h8b536455a5);"
           id="path4931" />
      </g>
      <g
         id="patch_123">
        <path
           clip-path="url(#p378300a975)"
           d="M 345.912397 113.978194  L 373.581818 113.978194  L 373.581818 113.978194  L 345.912397 113.978194  z "
           style="fill:url(#h8b536455a5);"
           id="path4934" />
      </g>
      <g
         id="patch_124">
        <path
           clip-path="url(#p378300a975)"
           d="M 69.218182 88.434541  L 96.887603 88.434541  L 96.887603 72.581519  L 69.218182 72.581519  z "
           style="fill:#e377c2;"
           id="path4937" />
      </g>
      <g
         id="patch_125">
        <path
           clip-path="url(#p378300a975)"
           d="M 103.804959 79.763191  L 131.47438 79.763191  L 131.47438 74.560104  L 103.804959 74.560104  z "
           style="fill:#e377c2;"
           id="path4940" />
      </g>
      <g
         id="patch_126">
        <path
           clip-path="url(#p378300a975)"
           d="M 138.391736 115.350821  L 166.061157 115.350821  L 166.061157 95.811006  L 138.391736 95.811006  z "
           style="fill:#e377c2;"
           id="path4943" />
      </g>
      <g
         id="patch_127">
        <path
           clip-path="url(#p378300a975)"
           d="M 172.978512 136.037556  L 200.647934 136.037556  L 200.647934 130.922826  L 172.978512 130.922826  z "
           style="fill:#e377c2;"
           id="path4946" />
      </g>
      <g
         id="patch_128">
        <path
           clip-path="url(#p378300a975)"
           d="M 207.565289 98.371728  L 235.234711 98.371728  L 235.234711 93.251816  L 207.565289 93.251816  z "
           style="fill:#e377c2;"
           id="path4949" />
      </g>
      <g
         id="patch_129">
        <path
           clip-path="url(#p378300a975)"
           d="M 242.152066 119.647294  L 269.821488 119.647294  L 269.821488 114.528457  L 242.152066 114.528457  z "
           style="fill:#e377c2;"
           id="path4952" />
      </g>
      <g
         id="patch_130">
        <path
           clip-path="url(#p378300a975)"
           d="M 276.738843 110.0033  L 304.408264 110.0033  L 304.408264 104.772213  L 276.738843 104.772213  z "
           style="fill:#e377c2;"
           id="path4955" />
      </g>
      <g
         id="patch_131">
        <path
           clip-path="url(#p378300a975)"
           d="M 311.32562 106.361241  L 338.995041 106.361241  L 338.995041 87.534424  L 311.32562 87.534424  z "
           style="fill:#e377c2;"
           id="path4958" />
      </g>
      <g
         id="patch_132">
        <path
           clip-path="url(#p378300a975)"
           d="M 345.912397 113.978194  L 373.581818 113.978194  L 373.581818 95.511898  L 345.912397 95.511898  z "
           style="fill:#e377c2;"
           id="path4961" />
      </g>
      <g
         id="patch_133">
        <path
           clip-path="url(#p378300a975)"
           d="M 69.218182 72.581519  L 96.887603 72.581519  L 96.887603 72.581519  L 69.218182 72.581519  z "
           style="fill:url(#h5496634910);"
           id="path4964" />
      </g>
      <g
         id="patch_134">
        <path
           clip-path="url(#p378300a975)"
           d="M 103.804959 74.560104  L 131.47438 74.560104  L 131.47438 74.560104  L 103.804959 74.560104  z "
           style="fill:url(#h5496634910);"
           id="path4967" />
      </g>
      <g
         id="patch_135">
        <path
           clip-path="url(#p378300a975)"
           d="M 138.391736 95.811006  L 166.061157 95.811006  L 166.061157 95.811006  L 138.391736 95.811006  z "
           style="fill:url(#h5496634910);"
           id="path4970" />
      </g>
      <g
         id="patch_136">
        <path
           clip-path="url(#p378300a975)"
           d="M 172.978512 130.922826  L 200.647934 130.922826  L 200.647934 130.922826  L 172.978512 130.922826  z "
           style="fill:url(#h5496634910);"
           id="path4973" />
      </g>
      <g
         id="patch_137">
        <path
           clip-path="url(#p378300a975)"
           d="M 207.565289 93.251816  L 235.234711 93.251816  L 235.234711 93.251816  L 207.565289 93.251816  z "
           style="fill:url(#h5496634910);"
           id="path4976" />
      </g>
      <g
         id="patch_138">
        <path
           clip-path="url(#p378300a975)"
           d="M 242.152066 114.528457  L 269.821488 114.528457  L 269.821488 114.528457  L 242.152066 114.528457  z "
           style="fill:url(#h5496634910);"
           id="path4979" />
      </g>
      <g
         id="patch_139">
        <path
           clip-path="url(#p378300a975)"
           d="M 276.738843 104.772213  L 304.408264 104.772213  L 304.408264 104.772213  L 276.738843 104.772213  z "
           style="fill:url(#h5496634910);"
           id="path4982" />
      </g>
      <g
         id="patch_140">
        <path
           clip-path="url(#p378300a975)"
           d="M 311.32562 87.534424  L 338.995041 87.534424  L 338.995041 87.534424  L 311.32562 87.534424  z "
           style="fill:url(#h5496634910);"
           id="path4985" />
      </g>
      <g
         id="patch_141">
        <path
           clip-path="url(#p378300a975)"
           d="M 345.912397 95.511898  L 373.581818 95.511898  L 373.581818 95.511898  L 345.912397 95.511898  z "
           style="fill:url(#h5496634910);"
           id="path4988" />
      </g>
      <g
         id="patch_142">
        <path
           clip-path="url(#p378300a975)"
           d="M 69.218182 72.581519  L 96.887603 72.581519  L 96.887603 56.644024  L 69.218182 56.644024  z "
           style="fill:#7f7f7f;"
           id="path4991" />
      </g>
      <g
         id="patch_143">
        <path
           clip-path="url(#p378300a975)"
           d="M 103.804959 74.560104  L 131.47438 74.560104  L 131.47438 56.58049  L 103.804959 56.58049  z "
           style="fill:#7f7f7f;"
           id="path4994" />
      </g>
      <g
         id="patch_144">
        <path
           clip-path="url(#p378300a975)"
           d="M 138.391736 95.811006  L 166.061157 95.811006  L 166.061157 86.197442  L 138.391736 86.197442  z "
           style="fill:#7f7f7f;"
           id="path4997" />
      </g>
      <g
         id="patch_145">
        <path
           clip-path="url(#p378300a975)"
           d="M 172.978512 130.922826  L 200.647934 130.922826  L 200.647934 125.685995  L 172.978512 125.685995  z "
           style="fill:#7f7f7f;"
           id="path5000" />
      </g>
      <g
         id="patch_146">
        <path
           clip-path="url(#p378300a975)"
           d="M 207.565289 93.251816  L 235.234711 93.251816  L 235.234711 74.575005  L 207.565289 74.575005  z "
           style="fill:#7f7f7f;"
           id="path5003" />
      </g>
      <g
         id="patch_147">
        <path
           clip-path="url(#p378300a975)"
           d="M 242.152066 114.528457  L 269.821488 114.528457  L 269.821488 109.212812  L 242.152066 109.212812  z "
           style="fill:#7f7f7f;"
           id="path5006" />
      </g>
      <g
         id="patch_148">
        <path
           clip-path="url(#p378300a975)"
           d="M 276.738843 104.772213  L 304.408264 104.772213  L 304.408264 86.044152  L 276.738843 86.044152  z "
           style="fill:#7f7f7f;"
           id="path5009" />
      </g>
      <g
         id="patch_149">
        <path
           clip-path="url(#p378300a975)"
           d="M 311.32562 87.534424  L 338.995041 87.534424  L 338.995041 69.271811  L 311.32562 69.271811  z "
           style="fill:#7f7f7f;"
           id="path5012" />
      </g>
      <g
         id="patch_150">
        <path
           clip-path="url(#p378300a975)"
           d="M 345.912397 95.511898  L 373.581818 95.511898  L 373.581818 76.523759  L 345.912397 76.523759  z "
           style="fill:#7f7f7f;"
           id="path5015" />
      </g>
      <g
         id="patch_151">
        <path
           clip-path="url(#p378300a975)"
           d="M 69.218182 56.644024  L 96.887603 56.644024  L 96.887603 56.644024  L 69.218182 56.644024  z "
           style="fill:url(#hde6c39ae71);"
           id="path5018" />
      </g>
      <g
         id="patch_152">
        <path
           clip-path="url(#p378300a975)"
           d="M 103.804959 56.58049  L 131.47438 56.58049  L 131.47438 56.58049  L 103.804959 56.58049  z "
           style="fill:url(#hde6c39ae71);"
           id="path5021" />
      </g>
      <g
         id="patch_153">
        <path
           clip-path="url(#p378300a975)"
           d="M 138.391736 86.197442  L 166.061157 86.197442  L 166.061157 86.197442  L 138.391736 86.197442  z "
           style="fill:url(#hde6c39ae71);"
           id="path5024" />
      </g>
      <g
         id="patch_154">
        <path
           clip-path="url(#p378300a975)"
           d="M 172.978512 125.685995  L 200.647934 125.685995  L 200.647934 125.685995  L 172.978512 125.685995  z "
           style="fill:url(#hde6c39ae71);"
           id="path5027" />
      </g>
      <g
         id="patch_155">
        <path
           clip-path="url(#p378300a975)"
           d="M 207.565289 74.575005  L 235.234711 74.575005  L 235.234711 74.575005  L 207.565289 74.575005  z "
           style="fill:url(#hde6c39ae71);"
           id="path5030" />
      </g>
      <g
         id="patch_156">
        <path
           clip-path="url(#p378300a975)"
           d="M 242.152066 109.212812  L 269.821488 109.212812  L 269.821488 109.212812  L 242.152066 109.212812  z "
           style="fill:url(#hde6c39ae71);"
           id="path5033" />
      </g>
      <g
         id="patch_157">
        <path
           clip-path="url(#p378300a975)"
           d="M 276.738843 86.044152  L 304.408264 86.044152  L 304.408264 86.044152  L 276.738843 86.044152  z "
           style="fill:url(#hde6c39ae71);"
           id="path5036" />
      </g>
      <g
         id="patch_158">
        <path
           clip-path="url(#p378300a975)"
           d="M 311.32562 69.271811  L 338.995041 69.271811  L 338.995041 69.271811  L 311.32562 69.271811  z "
           style="fill:url(#hde6c39ae71);"
           id="path5039" />
      </g>
      <g
         id="patch_159">
        <path
           clip-path="url(#p378300a975)"
           d="M 345.912397 76.523759  L 373.581818 76.523759  L 373.581818 76.523759  L 345.912397 76.523759  z "
           style="fill:url(#hde6c39ae71);"
           id="path5042" />
      </g>
    </g>
  </g>
  <defs
     id="defs5050">
    <clipPath
       id="p378300a975">
      <rect
         height="217.44"
         width="334.8"
         x="54"
         y="34.56"
         id="rect5047" />
    </clipPath>
  </defs>
  <defs
     id="defs5092">
    <pattern
       height="72"
       id="hff154a1e97"
       patternUnits="userSpaceOnUse"
       width="72"
       x="0"
       y="0">
      <rect
         fill="#1f77b4"
         height="73"
         width="73"
         x="0"
         y="0"
         id="rect5052" />
      <path
         d="M -36 36  L 36 -36  M -32 40  L 40 -32  M -28 44  L 44 -28  M -24 48  L 48 -24  M -20 52  L 52 -20  M -16 56  L 56 -16  M -12 60  L 60 -12  M -8 64  L 64 -8  M -4 68  L 68 -4  M 0 72  L 72 0  M 4 76  L 76 4  M 8 80  L 80 8  M 12 84  L 84 12  M 16 88  L 88 16  M 20 92  L 92 20  M 24 96  L 96 24  M 28 100  L 100 28  M 32 104  L 104 32  M 36 108  L 108 36  "
         style="fill:#000000;stroke:#000000;stroke-linecap:butt;stroke-linejoin:miter;stroke-width:1.0;"
         id="path5054" />
    </pattern>
    <pattern
       height="72"
       id="h260721e947"
       patternUnits="userSpaceOnUse"
       width="72"
       x="0"
       y="0">
      <rect
         fill="#ff7f0e"
         height="73"
         width="73"
         x="0"
         y="0"
         id="rect5057" />
      <path
         d="M -36 36  L 36 -36  M -32 40  L 40 -32  M -28 44  L 44 -28  M -24 48  L 48 -24  M -20 52  L 52 -20  M -16 56  L 56 -16  M -12 60  L 60 -12  M -8 64  L 64 -8  M -4 68  L 68 -4  M 0 72  L 72 0  M 4 76  L 76 4  M 8 80  L 80 8  M 12 84  L 84 12  M 16 88  L 88 16  M 20 92  L 92 20  M 24 96  L 96 24  M 28 100  L 100 28  M 32 104  L 104 32  M 36 108  L 108 36  "
         style="fill:#000000;stroke:#000000;stroke-linecap:butt;stroke-linejoin:miter;stroke-width:1.0;"
         id="path5059" />
    </pattern>
    <pattern
       height="72"
       id="h6ee14825a2"
       patternUnits="userSpaceOnUse"
       width="72"
       x="0"
       y="0">
      <rect
         fill="#2ca02c"
         height="73"
         width="73"
         x="0"
         y="0"
         id="rect5062" />
      <path
         d="M -36 36  L 36 -36  M -32 40  L 40 -32  M -28 44  L 44 -28  M -24 48  L 48 -24  M -20 52  L 52 -20  M -16 56  L 56 -16  M -12 60  L 60 -12  M -8 64  L 64 -8  M -4 68  L 68 -4  M 0 72  L 72 0  M 4 76  L 76 4  M 8 80  L 80 8  M 12 84  L 84 12  M 16 88  L 88 16  M 20 92  L 92 20  M 24 96  L 96 24  M 28 100  L 100 28  M 32 104  L 104 32  M 36 108  L 108 36  "
         style="fill:#000000;stroke:#000000;stroke-linecap:butt;stroke-linejoin:miter;stroke-width:1.0;"
         id="path5064" />
    </pattern>
    <pattern
       height="72"
       id="h1196a1b026"
       patternUnits="userSpaceOnUse"
       width="72"
       x="0"
       y="0">
      <rect
         fill="#d62728"
         height="73"
         width="73"
         x="0"
         y="0"
         id="rect5067" />
      <path
         d="M -36 36  L 36 -36  M -32 40  L 40 -32  M -28 44  L 44 -28  M -24 48  L 48 -24  M -20 52  L 52 -20  M -16 56  L 56 -16  M -12 60  L 60 -12  M -8 64  L 64 -8  M -4 68  L 68 -4  M 0 72  L 72 0  M 4 76  L 76 4  M 8 80  L 80 8  M 12 84  L 84 12  M 16 88  L 88 16  M 20 92  L 92 20  M 24 96  L 96 24  M 28 100  L 100 28  M 32 104  L 104 32  M 36 108  L 108 36  "
         style="fill:#000000;stroke:#000000;stroke-linecap:butt;stroke-linejoin:miter;stroke-width:1.0;"
         id="path5069" />
    </pattern>
    <pattern
       height="72"
       id="h41f57142e6"
       patternUnits="userSpaceOnUse"
       width="72"
       x="0"
       y="0">
      <rect
         fill="#9467bd"
         height="73"
         width="73"
         x="0"
         y="0"
         id="rect5072" />
      <path
         d="M -36 36  L 36 -36  M -32 40  L 40 -32  M -28 44  L 44 -28  M -24 48  L 48 -24  M -20 52  L 52 -20  M -16 56  L 56 -16  M -12 60  L 60 -12  M -8 64  L 64 -8  M -4 68  L 68 -4  M 0 72  L 72 0  M 4 76  L 76 4  M 8 80  L 80 8  M 12 84  L 84 12  M 16 88  L 88 16  M 20 92  L 92 20  M 24 96  L 96 24  M 28 100  L 100 28  M 32 104  L 104 32  M 36 108  L 108 36  "
         style="fill:#000000;stroke:#000000;stroke-linecap:butt;stroke-linejoin:miter;stroke-width:1.0;"
         id="path5074" />
    </pattern>
    <pattern
       height="72"
       id="h8b536455a5"
       patternUnits="userSpaceOnUse"
       width="72"
       x="0"
       y="0">
      <rect
         fill="#8c564b"
         height="73"
         width="73"
         x="0"
         y="0"
         id="rect5077" />
      <path
         d="M -36 36  L 36 -36  M -32 40  L 40 -32  M -28 44  L 44 -28  M -24 48  L 48 -24  M -20 52  L 52 -20  M -16 56  L 56 -16  M -12 60  L 60 -12  M -8 64  L 64 -8  M -4 68  L 68 -4  M 0 72  L 72 0  M 4 76  L 76 4  M 8 80  L 80 8  M 12 84  L 84 12  M 16 88  L 88 16  M 20 92  L 92 20  M 24 96  L 96 24  M 28 100  L 100 28  M 32 104  L 104 32  M 36 108  L 108 36  "
         style="fill:#000000;stroke:#000000;stroke-linecap:butt;stroke-linejoin:miter;stroke-width:1.0;"
         id="path5079" />
    </pattern>
    <pattern
       height="72"
       id="h5496634910"
       patternUnits="userSpaceOnUse"
       width="72"
       x="0"
       y="0">
      <rect
         fill="#e377c2"
         height="73"
         width="73"
         x="0"
         y="0"
         id="rect5082" />
      <path
         d="M -36 36  L 36 -36  M -32 40  L 40 -32  M -28 44  L 44 -28  M -24 48  L 48 -24  M -20 52  L 52 -20  M -16 56  L 56 -16  M -12 60  L 60 -12  M -8 64  L 64 -8  M -4 68  L 68 -4  M 0 72  L 72 0  M 4 76  L 76 4  M 8 80  L 80 8  M 12 84  L 84 12  M 16 88  L 88 16  M 20 92  L 92 20  M 24 96  L 96 24  M 28 100  L 100 28  M 32 104  L 104 32  M 36 108  L 108 36  "
         style="fill:#000000;stroke:#000000;stroke-linecap:butt;stroke-linejoin:miter;stroke-width:1.0;"
         id="path5084" />
    </pattern>
    <pattern
       height="72"
       id="hde6c39ae71"
       patternUnits="userSpaceOnUse"
       width="72"
       x="0"
       y="0">
      <rect
         fill="#7f7f7f"
         height="73"
         width="73"
         x="0"
         y="0"
         id="rect5087" />
      <path
         d="M -36 36  L 36 -36  M -32 40  L 40 -32  M -28 44  L 44 -28  M -24 48  L 48 -24  M -20 52  L 52 -20  M -16 56  L 56 -16  M -12 60  L 60 -12  M -8 64  L 64 -8  M -4 68  L 68 -4  M 0 72  L 72 0  M 4 76  L 76 4  M 8 80  L 80 8  M 12 84  L 84 12  M 16 88  L 88 16  M 20 92  L 92 20  M 24 96  L 96 24  M 28 100  L 100 28  M 32 104  L 104 32  M 36 108  L 108 36  "
         style="fill:#000000;stroke:#000000;stroke-linecap:butt;stroke-linejoin:miter;stroke-width:1.0;"
         id="path5089" />
    </pattern>
  </defs>
  <text
     xml:space="preserve"
     style="font-style:normal;font-weight:normal;font-size:10px;line-height:1.25;font-family:sans-serif;letter-spacing:0px;word-spacing:0px;display:inline;fill:#000000;fill-opacity:1;stroke:none;stroke-width:0.75;stroke-linecap:butt;stroke-linejoin:round"
     x="-176.19934"
     y="-2.6485357"
     id="text4111"
     transform="rotate(-90)"><tspan
       sodipodi:role="line"
       id="tspan4109"
       style="fill:#000000;stroke-width:0.75;stroke-linecap:butt;stroke-linejoin:round"
       x="-176.19934"
       y="-2.6485357">Transactions</tspan></text>
</svg>
