time;transactions_avg;transactions_std;queries_avg;queries_std;latencies_avg;latencies_std
0;258.451;18.9638574398778;4153.868;301.779705705986;11.911;1.08187291305403
1;346;17.8986949244911;5536.414;289.150061151655;9.343;0.621418538506871
2;360.3;25.502784161734;5760.889;403.628215452037;9.121;0.958972888042209
3;371.03;23.9796025821943;5939.092;383.380581949583;8.967;1.00502786031034
4;374.774;25.342825099029;5997.087;409.726476568189;8.909;1.09587818666125
5;382.627;26.2833274339443;6123.425;418.68893857492;8.821;0.587732081819583
6;387.266;25.6420109195827;6198.34;407.874551032525;8.511;0.627637634308216
7;393.339;27.1086375349248;6287.93;431.983423385675;8.378;0.872178880734916
8;396.696;25.2924191013838;6345.733;406.672352909555;8.266;0.785050316858734
9;401.582;34.4181561969844;6427.317;550.119125463738;8.368;1.02108569669739
10;404.79;29.0986003099807;6478.843;467.928850661089;8.246;1.02580894907384
11;408.127;36.4007346217087;6528.069;582.975225347523;8.198;1.37142845238094
12;415.024;34.044055046366;6640.372;541.722102129867;7.879;0.779505612551962
13;421.609;45.4214813606948;6746.462;727.136839746125;8.269;1.3244127000297
14;403.919;93.1115019157141;6461.622;1488.77818449761;14.952;21.2293088912475
15;426.825;40.2789243277428;6828.49;639.469246109618;8.131;1.11514528201486
16;437.515;45.1379654503836;7001.635;723.24761755916;7.981;1.61768012907373
17;452.415;37.7676499798428;7237.447;605.117627458491;7.602;1.24919814281001
18;452.227;39.646497966403;7236.639;630.724196038983;7.567;0.82342030579771
19;465.449;36.0345998867758;7447.509;577.526462760796;7.358;0.979773443200015
20;461.298;25.3246302243481;7379.451;407.054128770392;7.37;0.700999286732869
21;484.095;19.6704647886123;7746.417;313.033687294174;7.021;0.528894129292415
22;463.131;39.0201582390441;7410.006;627.315341725345;7.328;0.813729684846275
23;470.045;43.5337409947735;7522.497;696.173080103658;7.615;1.38699855803818
24;463.187;45.6912672290886;7409.392;726.926991902215;7.413;1.28181160862273
25;482.943;46.3066746916691;7724.161;738.431603406191;7.211;1.07932803169379
26;479.574;47.9126376230729;7674.474;765.668077305036;7.124;1.26994645556418
27;465.885;44.3932925676835;7453.243;710.180472951064;7.546;1.50107428197274
28;477.81;28.0150320363899;7647.965;450.224877261335;7.085;0.348633044905371
29;484.322;19.1246232904092;7748.84;304.274819168481;6.965;0.426667317707823
30;484.807;20.796108313818;7756.517;332.820037769689;7.019;0.503754900720584
31;488.522;17.7060254150968;7818.157;279.743761969731;7.097;0.31141772589242
32;487.686;9.37843931579237;7804.616;149.674341635495;7.073;0.346729000806137
33;492.674;18.7411708278856;7882.271;296.170446582712;7.034;0.708225952645069
34;487.853;24.1667519745629;7803.653;390.136060395613;7.204;0.413526299042787
35;479.334;40.5874453987931;7669.827;646.136071768939;7.351;1.31171223978433
36;480.381;21.7035326387212;7684.302;349.796624592051;7.311;0.652678328121902
37;488.043;24.1992995973026;7810.38;390.56279528395;7.08;0.7631382574606
38;479.614;35.8387388729027;7669.726;570.258028881662;7.19;0.747957218027887
39;478.088;45.3331639751735;7653.499;724.646733815169;7.234;1.3312114783159
40;487.39;29.7876873892554;7793.58;480.385711194661;7.032;0.790086071260596
41;492.166;16.2184143491252;7877.456;260.035900952118;7.202;0.563964537892226
42;504.161;24.3182221595266;8067.654;390.3030797265;6.927;0.952281996049489
43;475.812;52.4445731796912;7615.093;840.343249048277;7.701;1.6487901625131
44;478.481;53.4341780979189;7654.688;855.446398365219;7.275;1.46634409331508
45;491.041;36.8166949765992;7858.776;588.087289697695;7.084;0.830448071826285
46;494.248;15.6933099121875;7902.473;250.286459843516;7.169;0.631639929073531
47;500.613;39.2852753713137;8009.794;630.489200703716;6.972;0.908259874705481
48;500.074;15.8781964970822;8002.586;258.177211782892;6.95;0.391739709501095
49;505.46;14.2075029473853;8090.666;223.370744467605;6.818;0.640746439709182
50;498.246;34.9152726467946;7970.135;560.261663997268;7.081;0.910839722453955
51;505.517;17.9018032890555;8089.376;285.361592832688;6.77;0.618902253994921
52;503.882;27.0039363056588;8060.602;435.449032030136;6.959;0.785906482986358
53;496.318;40.4772174933009;7939.789;644.375537003863;6.985;0.700174978130473
54;507.029;17.249196763905;8115.584;274.571143902635;6.956;0.781309157760226
55;492.553;43.2234144995507;7881.435;693.053128486557;7.24;0.973889110730791
56;511.798;16.231123066504;8186.076;257.523937807728;6.644;0.538557332138366
57;505.509;18.5619855888322;8089.654;300.066941471395;6.863;0.823663159307233
58;504.513;11.5818125092724;8072.59;189.30717566955;6.936;0.374731904166179
59;506.575;15.2540284843041;8104.095;246.232505378582;6.832;0.632989731354323
60;502.672;25.3346544480101;8042.654;405.799282680491;7.087;0.720930648537012
61;499.38;20.0275430345298;7988.08;319.827921076281;7.374;0.74989599278834
62;496.531;37.3678844597882;7941.094;596.012035167058;7.23;1.2386363469558
63;492.745;39.1926246250477;7887.909;633.209308150941;7.404;1.13668993133572
64;503.2;12.7434853945055;8051.918;202.304215022841;7.026;0.604618888226282
65;491.167;33.203679028083;7857.589;527.054777370441;7.533;0.841285326152777
66;493.23;23.7699280604737;7894.885;382.157337604557;7.426;0.993440486390605
67;502.536;14.854880140882;8043.604;238.4329801936;6.901;0.595036973641125
68;491.602;37.3471644974555;7859.123;602.887330668813;7.534;1.70396126716542
69;490.592;44.0313315265391;7849.978;699.997151205618;7.438;1.29215169388118
70;490.39;32.5862342101698;7849.631;523.867134747905;7.38;1.16173146638972
71;484.405;49.2995716512824;7747.05;791.140014801425;7.871;2.11374761975029
72;510.329;22.3884302486798;8168.633;357.348878690011;6.642;0.778791371292718
73;508.1;14.9677246099716;8127.396;235.941590110745;6.631;0.540156458815395
74;497.097;17.4729602815333;7953.542;280.102194521903;7.236;1.0208447482355
75;510.54;13.7738680115661;8166.953;218.457224510902;6.894;0.503869030602199
76;484.266;34.758844111967;7751.475;553.937287429721;7.426;0.736616589549822
77;491.517;27.7664812498818;7865.163;448.903998513033;7.025;0.595403224714134
78;486.19;47.9662450062547;7775.755;765.437567084998;7.433;1.42004964701942
79;498.969;15.7063633282797;7983.008;250.953725088885;7.086;0.811531884771012
80;506.084;21.7584274247934;8096.25;348.714241722353;6.817;0.76265391889113
81;503.848;18.3125911874885;8063.781;295.469002518049;7.214;0.724474982314765
82;508.473;15.4175822034475;8138.048;245.998769866861;6.87;0.671058864780131
83;489.095;45.9803077958387;7822.216;735.071604555628;6.766;0.399429593295226
84;478.482;37.0586734247198;7659.413;592.103052602328;7.301;0.50642768486725
85;493.635;27.1438642238;7892.936;436.117053007573;7.21;0.916209583010344
86;505.995;10.8970658894929;8099.221;170.815933592291;7.051;0.595406583772803
87;507.27;12.7388044964955;8115.616;203.784037510343;6.851;0.41471556517691
88;509.657;9.1863486217339;8155.931;146.11678825173;7.058;0.521455654873942
89;500.511;16.5774216632121;8005.076;259.73727923424;6.969;0.519335151901
90;500.881;27.9293213129135;8016.99;448.921134187273;7.038;0.719232924719118
91;502.833;33.2045195869482;8045.427;533.701126306673;6.757;0.456706689243774
92;497.314;12.7513177358262;7953.242;196.969150975442;7.38;0.707855917542543
93;513.061;15.245240863954;8212.27;245.513189014386;6.887;0.705323330111811
94;499.693;26.2795289341349;7995.094;421.087518651413;6.827;0.576750379280328
95;447.481;97.2009804940262;7157.092;1553.33939651835;11.915;13.3526104189406
96;493.368;41.7081526323093;7896.803;666.973111782613;7.081;0.785664686746197
97;483.093;41.7789667296837;7728.089;670.089595359459;7.486;1.27496823489843
98;487.072;32.0742319627468;7793.044;513.730508811789;7.492;0.58620474238956
99;493.956;24.3175616376314;7898.312;384.312549828918;6.92;0.508684578103172
100;486.519;36.5401126024538;7789.575;581.816202958435;7.01;0.698126063114675
101;494.093;31.6794416143965;7903.606;510.789902077145;7.324;0.786055977650445
102;504.689;20.2729551126628;8077.276;319.60825030653;7.022;0.699039340809948
103;509.031;20.9353344611427;8146.219;336.113093956436;6.994;0.996525965542295
104;506.318;36.0190871066993;8099.521;573.836629093152;6.889;0.985397889179809
105;499.358;22.6906556978856;7989.692;359.289087749682;7.112;0.383713434740041
106;507.411;17.8898694517299;8118.168;285.365206947177;6.874;0.532657488448245
107;513.861;13.8173546310422;8219.455;218.266020546049;6.679;0.539730488299503
108;515.267;19.3301060783401;8247.381;316.335542152653;6.621;0.692090312025826
109;510.011;8.35512830541969;8159.356;134.656436177476;6.962;0.573947732811965
110;506.317;16.8845154209434;8102.358;269.806764511173;6.931;0.51104696457371
111;505.06;10.4743753990369;8075.355;167.911726109238;7.279;0.55534583819456
112;508.526;22.8719960650575;8141.011;360.958509317873;6.993;0.977333617553386
113;499.956;27.1118362343824;7998.704;430.429815956095;7.186;0.679517475860605
114;508.335;26.1911306552424;8133.064;421.227647316731;6.684;0.590511642560916
115;515.999;20.9207200879891;8252.582;333.750706480137;6.656;0.677867243639924
116;511.698;10.2126331570293;8192.756;159.21091854533;6.876;0.596610425654793
117;504.597;27.8829284868011;8075.061;448.291416568508;6.813;0.580690106683425
118;499.051;41.3110027595559;7981.225;658.842062398122;6.933;0.801049936021473
119;515.837;14.5582059677737;8258.99;229.88249802888;6.729;0.697903288428985
120;506.298;17.5784634140788;8093.479;285.857915771085;6.912;0.688633429336676
121;503.009;22.9473843607516;8054.364;368.045481841591;6.836;0.378502311749878
122;513.777;16.6588277198604;8213.216;268.313001369728;6.701;0.657258700969409
123;494.953;29.1686091715045;7920.96;465.082865756178;7.298;0.629615755838428
124;492.373;42.7084448440818;7881.292;684.999799602874;7.173;0.975510635513529
125;511.004;16.8513964999902;8175.783;267.610915436924;6.849;0.543570602589953
126;499.572;29.1589189785916;7987.438;468.053324457793;7.223;0.812207485806415
127;510.98;12.8896757135291;8180.695;205.465005013002;6.821;0.645158120153508
128;511.526;8.34017529791398;8182.618;136.061889212202;6.813;0.380973752376735
129;500.23;30.7807764684386;8004.496;489.4883798866;7.46;1.53195952949156
130;495.694;32.9794563933378;7932.267;529.725453212336;7.378;1.28667633847832
131;496.929;25.7030213982717;7950.688;413.052698231101;7.186;0.518443825307984
132;501.777;24.2570126149132;8027.309;384.084700722398;7.24;0.945600338409418
133;506.484;11.9287268390254;8101.835;190.544315436038;6.874;0.699531271638375
134;493.798;49.7071435107671;7902.491;796.693722210111;6.888;0.609849161678524
135;512.762;9.18875377839662;8207.013;145.691376549934;6.914;0.42429235204045
136;498.752;17.8924262189324;7976.935;286.702454480245;7.199;0.510263657338058
137;499.832;37.096180342456;8001.004;595.815093971293;7.038;0.857482361334618
138;495.843;33.5367553737665;7933.387;535.157638701913;7.121;0.79600816578727
139;500.495;26.3015776142777;8003.805;424.694250284811;7.06;0.69059394726568
140;512.739;13.3373628952669;8204.338;214.314803259162;6.749;0.788586710514447
141;514.959;15.1087017642164;8237.743;243.416933882995;6.794;0.621211719142524
142;498.528;27.6267098294384;7977.148;439.967995899711;7.29;0.703775532396506
143;513.744;11.1879642473505;8217.033;178.31531650706;6.818;0.466707617250878
144;509.567;12.2272016831339;8157.765;195.205220844645;6.854;0.616428422446591
145;511.347;17.6006875149833;8180.151;278.439217835737;6.781;0.734853046533794
146;499.09;17.3995298787065;7987.733;281.858453165698;7.413;0.72436247832147
147;508.384;18.6749084067371;8132.626;301.692385392819;6.531;0.477188641943643
148;490.735;34.5752067961999;7852.549;557.821859171012;7.495;0.998881874898125
149;471.233;55.3823488216236;7539.632;887.577099724867;8.141;1.61802626678309
150;495.745;29.4684730686878;7932.639;472.40912360897;7.404;1.05678947761606
151;497.097;28.0876197104694;7949.372;454.217568326018;7.295;1.03268823949922
152;510.321;8.00869583639916;8168.428;121.759970827833;6.886;0.367700965459708
153;513.304;13.4505986483897;8212.074;215.146726082367;6.956;0.783022349617169
154;509.66;13.3736509600034;8153.158;217.44414596855;6.844;0.646625084573753
155;487.884;40.9742148674011;7806.933;657.770199416929;7.131;0.775466956098061
156;490.205;35.0553782606888;7842.087;562.511638369348;7.207;1.39598746412709
157;483.389;51.0295344775942;7735.349;820.270053938939;7.697;1.57909499397598
158;477.05;78.2852913387944;7635.485;1248.71801829917;7.98;3.49196219910812
159;501.098;24.8969619833428;8018.957;400.336443708287;6.865;0.856915981879207
160;459.492;55.6207205634738;7351.386;893.583225001449;8.415;2.02156004115634
161;481.772;56.2448768867002;7703.163;901.461746720858;7.831;2.57170546525064
162;497.084;35.2715985461417;7952.358;562.813759405365;7.486;1.53028886162058
163;485.993;44.7633028383747;7778.586;712.566744595904;7.525;1.54787757913861
164;482.07;45.2796294154459;7713.595;725.377263349892;7.565;0.64602244543049
165;474.903;47.9324337062062;7596.358;770.13596026675;7.487;0.926812278727471
166;503.636;25.9690890098199;8060.579;417.586144560626;6.867;0.754586641811272
167;511.405;16.371019668914;8183.272;264.440349409796;6.815;0.582773540923063
168;504.526;13.8111630212669;8072.992;217.277029379537;7.143;0.626690513730662
169;500.821;29.4664906122198;8009.631;474.026565973908;7.014;0.439299442294209
170;506.28;21.3366581263352;8104.092;341.132861120143;7.113;0.929010764200291
171;498.352;39.0967079944074;7970.945;627.517408559321;6.874;0.701686539702728
172;499.778;25.2126665785281;7997.522;403.075519643652;7.166;0.939395550340753
173;508.356;12.7118473873822;8132.284;201.238073097464;7.042;0.487315093137908
174;508.485;11.1872876516146;8137.786;182.122714849068;6.811;0.51286352960607
175;504.982;20.6442126514891;8080.792;328.066051971263;6.972;0.675482050094583
176;503.32;30.0819487400666;8047.231;479.405140720237;7.012;0.835066464420647
177;488.877;35.410110152327;7828.92;568.530726117765;7.183;0.778370734290546
178;501.6;28.1498642980731;8020.196;447.595605456511;7.051;0.851779901148179
179;502.157;20.2083482996504;8033.903;325.926102576959;2.797;2.11747514743385
180;187.01;9.37723200096932;2981.514;146.605931544392;13.876;5.8073456931717
181;198.694;10.680952391992;3180.912;176.510988088563;10.701;2.46463161547522
182;187.402;13.2276685776448;2999.268;209.853607488647;9.641;2.28354745954622
183;187.406;17.911998325145;2995.313;280.589390499714;10.708;2.26328875753845
184;190.687;14.0856842574298;3057.304;222.873231017094;11.71;5.25798820843105
185;193.203;12.2594959521178;3092.886;196.317596776246;11.074;2.45464946580973
186;184.804;11.0131822830645;2952.355;178.977522289804;15.596;10.9144960488334
187;192.088;13.5043635910767;3075.441;211.845698915508;14.303;7.83271223778839
188;188.57;12.8386954165912;3016.033;201.556691233507;13.63;12.3328431434118
189;185.326;16.4548170454738;2966.228;269.22108768817;8.771;1.17110588761221
190;196.108;13.4216249388815;3137.25;212.637614875651;10.367;2.32128003480837
191;188.4;15.2667298397527;3011.487;243.219399022773;10.208;2.64361797542685
192;192.513;19.8467267074449;3083.695;309.77741952086;12.039;5.20419916990117
193;188.201;13.0554168451261;3011.463;213.077065309726;39.291;77.7713536528714
194;185.71;16.9472806078145;2965.152;266.404148083324;9.758;2.20861857277349
195;196.984;12.8356653119346;3159.938;212.18631726858;12.291;5.97016993057987
196;192.304;28.594518076023;3073.634;452.110331715609;49.324;105.07913277145
197;186.97;9.67731884356386;2990.818;148.408619075843;16.789;21.6291171572027
198;192.036;10.4952591201932;3071.875;165.471016812613;11.043;4.08950865019258
199;189.105;15.7787618335535;3025.192;250.95910725853;9.773;2.52730706484194
200;187.988;12.7145261807113;3008.999;200.543436963172;12.837;7.52867325629158
201;190.816;11.708095660696;3057.674;183.569926088122;11.566;4.23158173736488
202;189.509;15.2169461128046;3026.332;245.555567104472;14.482;9.62080641110713
203;193.938;12.035146696239;3103.306;197.691368208121;12.424;5.87482118876822
204;187.939;15.2058583776123;3008.219;242.666455632004;17.311;11.1043797215333
205;186.805;13.2490831758276;2985.185;211.705513307986;13.486;8.80275093365705
206;196.567;13.4040471873234;3149.837;213.124101642682;12.91;6.60512679666333
207;202.127;14.425017885604;3232.728;229.247764691396;14.782;10.7944724743732
208;191.172;9.99469839464971;3055.852;156.11364692429;13.484;10.1493400770691
209;191.338;17.1630975059863;3064.328;277.718618958108;14.061;7.81616331712689
210;184.916;13.6377866239359;2956.938;214.980253595534;14.441;9.14789314541879
211;197.783;7.07208745703943;3166.439;115.027443721052;12.289;7.19067097008339
212;187.801;10.4014801350581;3008.141;164.694308307848;10.336;3.39320851112926
213;185.485;15.2135447874583;2961.758;241.109451693621;12.636;5.66034309914161
214;184.503;9.03189133016937;2954.04;143.829328789373;10.934;4.56588260909104
215;187.105;13.4857548917369;2993.57;219.041351438484;12.978;7.64398299317836
216;190.297;15.0037922206354;3049.453;242.5151590334;14.949;9.54482943797321
217;191.113;12.8632033724108;3053.1;208.133319197101;13.209;6.43370725165515
218;182.79;14.2011591076218;2925.133;228.890688934694;15.24;12.7747900178437
219;182.591;16.2184410163246;2919.628;253.726126514405;10.557;3.58261371068665
220;197.122;14.9497470212708;3152.753;232.408240217513;10.38;3.84936098593
221;193.197;13.2707671594375;3097.362;217.602500987478;15.594;13.9773854493607
222;188.486;12.8674171456431;3013.007;210.769140153393;12.394;3.96216657903224
223;194.794;10.342035776383;3119.768;166.430560222586;14.718;7.98410145226124
224;191.522;13.2260869496613;3059.963;205.794738224771;15.039;7.71450380776365
225;186.801;19.0023848240161;2993.235;299.999694408181;11.643;4.3829534562895
226;182.301;18.4100382672065;2911.406;291.212603717626;10.783;4.38258154516262
227;187.248;12.8366107676444;2994.466;202.274681569389;10.802;3.73199892818849
228;194.937;9.58853695826475;3124.795;156.042998385056;11.073;5.13660792741669
229;194.423;13.9499921505357;3111.949;222.052423425187;13.152;8.5917190363745
230;182.495;9.95124238474801;2918.709;163.791955385492;17.4;14.7982269208172
231;191.195;11.7043054044229;3058.125;189.442756591533;11.824;4.52604065381654
232;193.214;16.032377365818;3088.714;252.851518017984;13.895;6.26675554014994
233;187.366;10.3739926739899;2999.835;164.764644341554;15.83;12.8036939982179
234;197.303;13.0084188508824;3155.143;207.929117732461;12.403;5.0199781872036
235;182.573;12.9064015511683;2926.69;207.144427634439;15.763;7.31179464974229
236;193.456;17.5232663621828;3090.577;275.218940047737;15.666;8.940018120787
237;184.012;15.1815953048421;2944.79;243.982199760556;20.803;14.1055315745278
238;193.682;14.321800026533;3103.2;229.78963301245;13.487;8.13781303545369
239;191.86;10.6949417950732;3065.776;172.525427123074;15.014;7.18723896917307
240;194.84;12.3788747469226;3120.063;195.858307357642;14.373;5.925333830258
241;186.613;10.4521261473446;2983.107;163.672477958264;12.196;6.23540728421167
242;191.698;11.5991782467548;3065.668;184.969226132352;10.993;3.91637600339906
243;189.104;8.25962008811621;3025.578;132.894505364219;14.563;8.13487436903607
244;191.685;6.41870119260887;3070.878;101.203876091787;22.348;19.0615968900824
245;195.397;8.73068846082604;3127.644;138.327970577186;14.522;6.89838357878134
246;190.362;11.9421277836066;3043.51;195.59088163818;14.191;6.4827038340495
247;187.205;12.3948128263393;2993.981;202.622622056367;12.04;3.32438565753132
248;194.941;10.4105931147083;3116.73;167.314602172067;16.688;9.22795513643191
249;196.383;20.4073188096823;3147.828;321.737429056673;12.287;3.43750214545388
250;187.705;10.6833770409926;2998.394;174.293507004709;12.619;2.96165646218462
251;188.518;11.3392290743241;3016.984;179.277362664673;17.235;13.9661678709659
252;193.069;16.27515496086;3089.701;264.509063680246;12.185;2.68677967090716
253;185.194;12.5480135479689;2966.598;201.334274320098;11.167;3.35532427642993
254;183.275;6.34394396255053;2927.608;100.935857731529;10.864;2.54201573559252
255;197.229;14.4511013075128;3158.774;229.115349690933;29.769;58.1714855320027
256;187.634;14.70932302997;3001.248;232.748195387205;14.333;10.7518603506556
257;198.026;10.173880478952;3167.606;153.41681799593;14.788;7.43130917133717
258;192.043;9.41346275288738;3075.012;157.079629411314;12.06;4.22504437846515
259;189.798;9.43693679114156;3030.595;150.41124972886;12.993;5.823035376846
260;188.695;12.1099556151127;3021.241;194.185638009109;35.03;65.8314192464358
261;187.502;11.3879478397117;2998.047;180.255264669309;12.974;4.85619645401625
262;187.2;15.1305095750278;3002.886;241.266683410708;14.389;5.18105481538268
263;191.391;14.3441245463079;3053.782;230.487643608065;13.438;9.63486668304237
264;184.712;11.2013265285858;2960.013;186.061131247237;16.907;14.5995013955957
265;187.195;14.5846612919192;2997.623;234.105766569294;12.31;3.68474422450189
266;194.408;17.2432553771032;3108.438;279.732937095365;12.746;5.00714130018317
267;188.102;7.73612797205455;3007.227;128.615755726118;12.288;5.49014899615666
268;177.896;23.0261421866539;2847.024;368.014489937557;44.095;95.9757700932897
269;199.693;18.9633436134031;3195.79;304.448486250132;11.372;2.53205766127078
270;181.489;13.7615859914473;2906.141;226.826897190347;10.031;1.834303410017
271;191.515;9.87788869141612;3060.647;150.503397506503;11.877;3.71938986931997
272;192.795;7.10285611567572;3089.322;111.422908488342;16.796;10.346354140469
273;188.685;10.7817422061558;3015.776;176.00392843343;11.882;5.95195396487574
274;190.614;11.0082561743452;3049.228;177.076544737024;14.361;8.69960050806932
275;194.597;10.8689401967255;3114.339;173.267054540094;21.814;18.9740908609609
276;194.381;9.70061178483043;3112.108;158.291260200941;12.846;4.11074494465419
277;195.014;20.2925741097577;3123.326;325.363156986163;13.915;4.07181838985974
278;193.384;11.2245981665267;3087.866;187.553390542525;14.793;4.05123697159275
279;193.262;17.9957371618949;3091.72;287.348887417365;12.95;8.17890701744433
280;190.246;11.5199671874531;3044.346;181.641087653643;11.388;3.09700435905409
281;195.297;11.8128794542228;3128.079;188.900060002641;11.802;5.26607785738115
282;196.889;10.954302761928;3149.446;178.082131400099;13.13;4.91011201501554
283;190.612;9.43473560837875;3047.792;153.701120932811;11.635;2.79336803876611
284;187.498;12.5711660557006;2999.583;204.878185078345;9.946;1.54517442381111
285;194.701;10.7294990097399;3118.002;174.839899897015;13.788;6.57481528257638
286;185.214;24.5196440430933;2962.625;395.021937447784;36.985;72.2190232902661
287;190.28;11.2672498862846;3039.913;182.18012959981;11.605;4.43838315155418
288;185.508;11.6716381026833;2974.931;185.830569791402;16.439;10.3462702941688
289;196.995;13.1167231044953;3153.306;205.543230888294;13.742;4.61741875943692
290;188.412;11.9676554094781;3006.794;186.695622026866;15.308;7.77870143404412
291;186.295;18.4496922738563;2983.124;297.228442151824;14.734;6.88367808660458
292;192.892;14.9186063692289;3087.473;237.367986386123;13.199;5.77055361295604
293;191.272;9.46770067122987;3062.159;154.306427698252;15.06;13.1774724435303
294;192.301;11.7462619160311;3073.144;191.510475076422;11.871;5.93780338172291
295;200.49;6.60391096245269;3206.749;104.106474385585;10.436;2.16569249894809
296;188.444;13.7076279494304;3021.099;219.318555323081;10.432;2.39513590428602
297;184.902;11.9612188342159;2955.499;190.308258541247;12.183;4.66888434211001
298;196.092;9.54603771205602;3133.27;150.68832297163;12.521;3.94286050983293
299;191.498;13.8732071274091;3067.081;223.082135342574;10.721;1.71193720679235
300;183.212;16.4893352200749;2935.273;263.653283387479;11.764;3.46223684920601
301;191.976;14.1158323877835;3075.045;223.502369081396;12.963;4.1690575673646
302;193.991;11.5690608521176;3098.062;186.757962229186;12.963;5.55847649990535
303;189.455;15.3536290498371;3027.877;245.134838815297;12.039;9.56938916545879
304;190.859;11.3298203427951;3058.154;185.155836213727;11.895;4.24580793253769
305;187.706;13.2092847648916;2998.503;211.731928298499;12.012;5.97539421293692
306;189.373;10.7470666230375;3033.948;167.186226514028;11.206;5.18874589857703
307;189.294;10.6503936077496;3025.916;171.820284262362;12.434;4.29329057949727
308;188.137;12.321990951141;3011.676;197.456313305005;13.739;7.94252409502168
309;194.698;14.1637945480723;3120.889;222.031106219377;14.016;6.35024755422968
310;190.695;8.81924855075535;3042.918;141.501622450066;11.604;5.2269057768435
311;189.161;16.2008663039975;3029.475;264.469556972064;13.088;4.7611864067688
312;189.55;14.0756051379681;3034.605;219.680793618838;12.287;6.22773000378147
313;187.196;14.8971186475776;2994.121;244.820702288431;11.335;3.85059800550512
314;200.399;13.3211924766515;3204.596;211.191092009109;13.74;3.88890730154371
315;197.299;10.6503037045899;3163.993;170.114935561225;12.318;8.35083205435243
316;192.612;13.4840719369188;3071.592;218.544396487312;12.88;5.22439470178125
317;189.681;16.016159620833;3041.889;253.010009385005;14.863;9.64020751851328
318;196.214;12.6249651088627;3135.315;205.249665980245;14.359;6.26688032437193
319;183.902;10.9452618059135;2942.826;172.876646554707;11.403;3.09355151888569
320;197.586;12.774466094519;3158.179;200.289453613998;12.837;6.1859341250938
321;185.216;12.6828507836368;2967.662;199.5334186446;14.688;7.90778198991348
322;190.025;14.0038096602317;3040.8;222.018228170571;14.93;8.20880502874809
323;192.271;13.6265310699383;3072.736;220.290706440372;13.251;5.75908056897974
324;195.784;12.6359829059713;3137.737;197.104330903712;14.567;4.96391790826561
325;194.622;14.1521007627843;3111.664;225.062701894385;11.552;3.07566513131712
326;194.281;9.22728936362074;3108.712;152.878960606094;12.128;4.27443750685396
327;183.198;9.20507447009546;2931.857;144.821178565156;14.434;16.352442141772
328;193.509;12.1822349755699;3096.844;198.437133379813;13.931;9.30719447524333
329;189.014;15.7490591465017;3019.197;253.219597505808;11.778;5.87596255944505
330;188.498;16.8036982834139;3015.247;270.556370098727;10.193;4.46326797313359
331;188.16;15.4343208467364;3023.867;244.847232496107;12.236;7.71383069557532
332;188.232;11.6885480706547;3003.921;187.263975310261;12.946;6.93323330056042
333;186.809;14.3044765370844;2985.362;232.740036212076;10.313;4.62655173968692
334;190.077;12.1129402293576;3043.321;188.727893722688;12.649;4.07338299205954
335;185.576;13.9251766236557;2967.443;219.155346138302;14.378;7.71130702280749
336;189.603;10.8939295481471;3039.553;175.176164991128;11.033;3.8287153197907
337;187.145;9.95433699449636;2987.754;160.263418857839;13.086;5.98862788959207
338;183.269;13.4031536960522;2932.484;215.808163432246;11.999;5.06863778544097
339;192.015;11.9728403062935;3074.019;187.336304780995;13.107;6.25807326579036
340;185.613;12.9942049006471;2969.007;207.673142897671;14.275;9.0192086681704
341;186.999;13.4399579240414;2995.471;214.804417619837;12.573;7.39959059678304
342;191.401;9.62475397088141;3059.526;154.966274279266;14.467;6.41800288251727
343;191.89;13.065190392796;3073.73;203.635612504285;14.176;7.11993707837366
344;196.995;10.4352022021618;3150.123;164.885928207969;17.479;6.4262157604612
345;190.573;15.6458237558781;3046.785;252.273269144793;13.034;5.68204751828072
346;188.78;10.8070301193249;3022.374;174.060524197761;14.057;6.19904678156246
347;195.043;7.26303800072623;3121.865;113.31228585198;13.522;3.94829279562698
348;198.454;8.1331078930506;3171.869;130.735647812682;13.286;4.04198515583617
349;184.664;13.7873124284616;2952.313;222.84870266843;12.983;3.22081371705972
350;182.326;12.9279094984459;2919.928;202.840989486835;13.321;6.29292213522462
351;200.194;15.659988633457;3203.704;254.273447028978;14.914;12.8678857626263
352;195.521;12.0532472388145;3128.727;194.629372246324;15.239;11.2002914694217
353;191.404;10.3678013098244;3060.752;162.701975329134;15.316;7.4475300603623
354;188.687;6.4425616799526;3024.492;105.886871688622;14.309;10.5936485216379
355;194.299;8.45346964269759;3105.79;132.301545644788;10.7;3.10836613030062
356;192.811;10.5820418162093;3089.065;165.952725753456;11.965;5.03862530855391
357;187.812;12.9863827142127;3002.029;207.560614830945;24.043;20.8673309505552
358;188.792;12.5481981176579;3019.86;203.958019405958;15.954;6.61655529713158
359;182.311;9.14683273051393;2916.572;145.977068116888;2.278;4.62892168868733
360;483.468;33.4502582351765;7744.913;538.462814965894;7.438;0.743072001894839
361;493.655;32.8750863877183;7902.473;528.563860135175;7.724;1.13850955200209
362;497.467;37.5002360125919;7955.89;602.581822211708;6.897;0.537829898759825
363;494.346;37.6561836090695;7910.955;604.819527747761;7.258;1.07952582183104
364;506.813;16.1417452897785;8111.007;252.732637585663;6.834;0.77092412077973
365;507.788;10.0167677421486;8121.077;162.533652395414;7.014;0.424245212112083
366;503.771;10.3452650521846;8063.648;161.873071064995;7.233;0.623458900008663
367;507.647;7.8637943131753;8123.315;128.022242618198;7.094;0.642918346292909
368;486.669;37.2918303251526;7783.082;595.446580959208;7.486;0.684108178579957
369;481.266;64.2147058235105;7699.141;1026.37258794698;9.35;7.21600166297099
370;501.11;15.8463244949745;8017.959;248.924115041123;7.264;0.709847871025893
371;509.608;20.4418574498499;8155.53;321.795520229803;6.962;0.834143872482436
372;504.632;15.195303748196;8075.825;241.402037532821;7.279;0.725113094627326
373;503.592;20.7487155265091;8051.692;331.451194953352;7.287;0.658119290098703
374;471.907;53.7336285858309;7556.59;854.935432041517;8.51;2.04383463127524
375;484.007;57.7789499818062;7743.531;926.642648084471;8.506;3.26600428658629
376;505.407;13.5204378997109;8083.929;211.463108907936;7.338;0.632784323446775
377;504.025;11.0927852679124;8067.38;175.498770423065;7.151;0.573959057773273
378;500.512;28.2765948444987;8007;454.174550740126;7.279;0.5600794586485
379;503.491;18.5311032860978;8056.765;295.677536963803;7.222;0.768554487333189
380;507.656;18.6085513675851;8121.68;297.277279219251;7.196;0.762760775079573
381;498.592;27.7871372400978;7973.651;441.828518238688;7.266;0.542092243073083
382;476.964;30.9922784577072;7636.834;490.931388855902;7.789;0.976385681992526
383;505.636;12.1352916734586;8087.751;195.301338676945;7.141;0.595893446851023
384;487.368;49.8207309862064;7796.8;795.090270522785;7.343;0.795827242559582
385;492.464;26.2870459352148;7879.628;423.0328081792;7.293;0.39980120059848
386;477.856;43.4969764926241;7643.706;690.552902436879;7.567;0.926984897395839
387;488.261;43.1446380098387;7811.476;695.814153322562;7.267;1.17305626463525
388;502.825;22.1533262739483;8047.119;352.610877695253;7.132;0.790478336199035
389;509.241;17.0570574543196;8150.153;275.27835330987;7.001;0.827012091810028
390;506.451;15.2941253100664;8102.903;248.15665403328;6.973;0.710746790355032
391;513.18;13.8233230447645;8212.187;218.966328052896;6.955;0.632886245702965
392;471.942;95.0898308758618;7544.587;1519.30729244646;10.889;11.6650790395951
393;490.791;23.4759623657899;7856.751;375.751025293361;7.54;0.97572537119826
394;509.77;12.8588047656036;8156.698;211.133718898779;7.01;0.805121108902258
395;501.337;39.7281336208993;8019.703;634.294542701585;6.892;0.728749614065077
396;492.355;30.5939069914255;7879.805;491.250139160317;7.362;0.789288287002923
397;500.885;21.9881596546881;8008.143;349.877244474419;7.158;0.761679722718144
398;503.662;14.5233162879543;8064.998;233.641699266222;7.162;0.561369753371152
399;511.534;11.2856911175194;8184.133;178.263462776358;6.897;0.539185496837589
400;508.777;13.5916739587119;8138.432;213.105890289294;7.145;0.642903569752122
401;491.688;34.8607394643324;7869.931;560.963424876356;7.254;0.706161454626347
402;495.017;32.1832506282394;7919.364;514.232529507821;7.384;0.699731377029795
403;503.107;22.5998796678189;8047.616;359.793989282741;7.253;1.13755922922721
404;499.701;18.8276713642414;7998.115;304.54240598808;7.112;0.5562517415703
405;504.74;16.2505446062603;8073.743;260.293466689054;7.094;0.758975625432076
406;491.684;28.6828262903083;7867.845;461.810682125267;7.437;1.03655245887509
407;493.812;28.9890337196676;7900.912;459.812411724589;7.285;0.637138132589777
408;494.563;19.1025045740082;7913.495;307.70754755936;7.493;0.742294415983303
409;482.956;45.6797570483903;7728.217;730.070940690693;7.74;1.6966496397312
410;487.58;31.599545566354;7799.688;503.034589800751;7.606;1.2124784534168
411;503.125;16.0741184828263;8052.409;256.835069351934;7.193;0.791783429985743
412;501.092;29.9135019013155;8015.391;473.934921807817;7.235;1.30760276842778
413;497.068;17.5830644655593;7956.061;282.888160178209;7.284;0.436215543051808
414;503.099;23.9713334839758;8049.698;385.149779613041;7.119;0.764544962706574
415;494.114;28.1970701314848;7905.042;450.399060607384;7.004;0.474050630207367
416;500.878;15.0826680663605;8012.251;244.070265065237;7.358;0.711938199565107
417;494.596;35.1841587081459;7913.54;562.088854488343;7.269;0.963321856909719
418;503.144;28.7725814622187;8046.113;465.900776647773;6.98;0.649199507085465
419;497.948;39.3043287183488;7972.68;625.586687246452;7.136;1.51939593259953
420;503.076;12.1347650986794;8042.81;194.152090279749;7.194;0.458741757419142
421;500.356;34.2390581646154;8010.995;547.764439576897;7.423;1.73997155149157
422;474.109;73.2194534874438;7584.819;1165.09464945515;8.416;4.26239416290892
423;466.062;62.1338414714553;7455.786;995.432427723749;8.462;2.5822424363332
424;494.969;31.8152801182086;7919.403;505.742210460046;6.937;1.15100868806451
425;476.259;38.8293889856636;7623.139;622.530014062794;8.046;1.31988787402566
426;487.997;44.5173813358329;7807.059;709.739296523016;7.083;0.909901643036211
427;512.105;16.7336715935289;8194.673;268.06699118131;6.856;0.505098010291067
428;479.088;50.9418629027241;7662.718;811.792618281301;8.103;2.49341552894819
429;479.313;69.0310359258798;7669.49;1108.58752113669;8.208;3.21762894069531
430;498.638;26.9193334984345;7980.605;431.337883735019;7.298;1.13934893689335
431;497.029;44.6242107941407;7949.467;713.845418435256;7.838;2.31270750420367
432;494.281;29.2236884906753;7909.568;471.806428163054;7.234;0.652352665358225
433;495.585;35.2635395982875;7928.364;563.983984191045;7.11;0.69224273199506
434;498.683;31.3511467254407;7976.631;504.650758098113;7.065;1.00514924265007
435;495.058;25.2780382150199;7924.135;403.264889030763;7.182;0.76164033506636
436;503.69;22.7057644663167;8061.017;362.620236585061;7.443;1.00901982141086
437;502.626;19.346290187009;8042.723;313.173506256502;7.217;1.13950910483418
438;488.236;54.6486122788126;7808.577;871.948998853146;7.346;1.32302078592892
439;502.265;13.1050869894092;8035.729;204.421599908092;7.427;0.610574319800619
440;499.278;21.8479114791342;7987.75;352.61989509954;7.359;1.29807126152612
441;489.857;31.5615579621797;7843.219;501.343058881851;7.591;1.16234633392978
442;501.627;22.8624718917242;8020.84;367.660298454991;7.49;0.980489673581518
443;496.498;32.3221449783255;7945.887;519.325893963495;7.197;0.652212388720107
444;485.903;40.756967024056;7775.139;649.120765981952;7.476;0.960710154000656
445;473.392;52.9513183594137;7569.785;846.835302124918;7.545;1.19828418999835
446;487.65;40.9225534393934;7809.818;650.675233489038;7.377;0.878453755185773
447;489.712;50.4612226962446;7830.982;807.711583274627;7.366;1.12320256409963
448;499.058;17.1526451604413;7981.121;275.45117322136;7.331;0.57107705259447
449;490.944;32.8381315546417;7859.609;520.8807068312;7.315;0.782051788566463
450;485.958;38.1056740656822;7773.029;614.489011007508;7.236;0.797511128449006
451;493.009;20.8530503524072;7890.548;331.097591196311;7.536;1.01373763864227
452;506.624;16.8512066036806;8107.786;271.057822399576;7.071;0.92160132378377
453;502.761;32.8329929948531;8041.388;523.922457770231;7.052;0.959143367802741
454;489.72;20.3484210689642;7837.031;328.640678810478;7.285;0.646053403365384
455;486.992;27.9839567609732;7789.879;450.14484167764;7.322;0.75259285141436
456;495.563;30.5653028939677;7930.623;486.591963477608;7.331;0.949783659577265
457;465.336;93.8352585332401;7443.395;1495.43911628826;12.215;13.58560580173
458;507.753;18.7374491593725;8126.941;296.10705889759;6.917;1.06703373892301
459;489.744;23.8423061804001;7832.607;384.784375697611;7.512;0.809429428671825
460;502.099;18.5226382840006;8033.272;295.886595431426;7.046;0.794798087566894
461;487.619;23.9366624448787;7804.398;376.655409566885;7.448;0.543098517766337
462;486.343;37.6930961981111;7782.885;606.110915959272;7.372;0.731844245724456
463;497.432;34.3374724754181;7955.427;548.924878012452;7.185;1.00463177333788
464;499.581;39.301391438472;7994.41;631.116553577856;6.955;0.758949932472493
465;501.645;19.5686224604598;8024.85;313.115225532107;7.197;0.913958970632709
466;492.913;22.3028200234862;7893.022;355.847116576783;7.547;0.89436066550358
467;506.463;15.8423262496376;8098.212;251.124151239995;7.004;0.771222406313512
468;506.05;18.2457414209454;8098.893;294.544866227507;6.86;0.689478063465387
469;505.849;26.7221198448017;8092.973;423.807486768457;6.931;0.770577056497268
470;506.529;25.0593668914429;8101.265;402.335531447312;7.271;1.14658144063124
471;500.271;21.9100472158328;8006.027;349.638470539199;7.126;0.748441046442528
472;507.517;35.5749802670347;8119.943;566.673390129644;6.851;1.20244293003867
473;499.46;25.3191721823622;7992.941;398.599220030582;7.093;0.771946241651574
474;496.951;35.5987138672174;7951.226;571.062568747068;7.094;0.632126569604546
475;505.731;17.0605881786078;8090.39;273.212308361121;7.045;0.664563766692107
476;503.269;20.9511834749264;8054.672;337.360541699802;6.688;0.499415658545068
477;507.711;14.7190525849962;8124.762;237.84967251608;6.957;0.32483996059601
478;503.804;8.45261166740852;8057.707;138.686774787666;7.146;0.498301113785642
479;499.424;17.1895661376322;7992.478;276.345366952311;7.377;0.922648903971607
480;511.401;12.2281179663906;8174.923;198.061552657216;7.016;0.458567334205125
481;514.263;10.6456592562449;8231.211;176.031523282122;6.904;0.616574407512989
482;490.594;38.1246031323613;7852.874;617.372815293984;7.139;0.937917373759543
483;482.181;38.9740014496835;7717.615;621.681791582331;7.853;1.14670876860691
484;489.647;39.4081940844784;7831.656;628.48621439456;7.347;0.738079264036043
485;496.693;25.947413763225;7947.9;421.862984700003;7.255;0.59308093882706
486;494.663;22.6493960405133;7915.398;358.611986575998;7.26;0.664454663615212
487;504.252;17.2429480078102;8063.023;274.942991765583;7.311;0.858655344128246
488;516.305;17.4164016088267;8263.688;278.624719283909;6.654;0.655396063460855
489;497.797;28.3069511074596;7965.185;455.022216496066;7.15;0.559052770317793
490;487.698;37.2233256977391;7805.871;596.698599218251;7.198;0.512772854195706
491;497.16;16.0836855229126;7949.468;260.058120073209;7.413;0.720944519363321
492;503.006;28.4993874320138;8051.066;457.288773341271;6.931;0.762777162741517
493;507.869;11.2117924079968;8126.222;182.12583467484;7.049;0.713602830711863
494;489.368;44.9576771641958;7829.292;718.086376765368;7.411;1.20417980384991
495;488.311;23.808099651169;7810.072;383.16152906571;7.549;1.21178752262927
496;498.637;16.7364112341934;7979.601;264.81195140893;7.554;0.682043986851294
497;505.993;16.1659760299198;8101.363;258.333155481474;7.202;0.837840080206242
498;500.063;23.0974782389745;7997.803;371.890505338606;7.129;0.869591283304978
499;513.69;10.9023648810621;8219.534;176.03798744577;6.923;0.552866168254127
500;499.842;13.8313822881163;7996.859;221.933687098187;7.239;0.863776012632907
501;492.237;33.8740989695671;7876.49;547.294029622116;7.652;0.705617460101443
502;500.819;23.0623626066343;8011.9;370.560566088707;7.59;1.19854912289818
503;510.118;13.675881543797;8164.387;220.810433496688;6.883;0.658620528073626
504;492.69;32.5458359855767;7881.927;521.085712854409;7.186;0.695660836902582
505;506.478;26.148645777555;8103.678;420.821809791287;6.874;0.68282062066109
506;510.589;16.2678556976626;8171.624;256.113675941015;6.922;0.817823941933718
507;491.794;47.4788441729578;7864.115;757.63020007455;7.434;1.05785821356172
508;464.866;36.1618794312462;7437.258;580.188267440833;7.844;1.0036652828508
509;478.036;51.6572367050358;7648.959;827.117893307227;7.74;1.67771868917289
510;477.525;49.1623708236293;7644.895;782.614469368539;7.773;1.64310103158632
511;479.235;40.9569904289855;7668.053;656.88797350918;7.473;1.03505603713035
512;487.359;41.3783132691504;7793.539;664.063265712689;7.307;0.851845643294611
513;480.174;63.9689756366328;7684.6;1027.5311219131;7.975;2.87126191769403
514;492.697;33.7436906843355;7880.377;541.86108922954;7.386;0.727491580707295
515;509.116;21.8646080230159;8145.26;350.435862320065;6.846;0.515134933779502
516;483.125;55.8326379906946;7732.384;897.343407945922;7.734;2.08680233850741
517;471.771;88.1780012758284;7546.859;1408.57021554803;8.442;3.76167462707768
518;455.029;93.7450479172102;7281.848;1498.15866756362;9.281;5.71070127042205
519;474.251;60.5674426486701;7590.737;969.69182965568;7.548;1.8806849815958
520;463.944;61.95550019167;7416.616;995.593557996439;8.31;2.46143860374375
521;443.89;60.8924791743607;7108.036;974.68320847546;8.378;1.96206931579902
522;478.793;48.0219849756338;7654.825;765.7065951688;7.696;1.18296407384163
523;479.572;54.7458158766494;7678.849;876.283060437101;7.781;1.76986694415145
524;474.096;56.1529335297808;7581.421;898.955622313473;7.88;1.66878398841791
525;497.019;29.0347245380431;7955.915;464.993422367448;7.371;0.705669185950469
526;494.627;26.4891068365859;7913.633;423.802829793536;7.433;0.938115664510511
527;501.869;23.0098346147906;8031.891;369.434069854133;7.491;0.944112811055955
528;497.439;19.3292304295853;7956.133;309.580026359923;7.645;1.00303788562546
529;490.765;37.8258578884871;7854.228;600.084302607552;7.446;1.12779608085859
530;504.482;23.9875133350643;8072.043;381.476984523288;7.263;0.803181797602504
531;505.067;15.0605677515819;8078.466;242.750681037097;7.233;0.626131775267782
532;509.568;15.5598102816176;8151.517;250.344807857087;7.026;0.723825945929007
533;509.117;19.3500718603303;8149.073;310.18608479592;6.687;0.759329309325015
534;508.729;19.688400874628;8137.85;317.196435572672;7.016;0.862649407349246
535;513.001;20.6858944452512;8204.926;332.569245306842;6.854;0.88117194689798
536;514.714;9.93588667406532;8238.339;159.498735132946;6.732;0.709729525946326
537;510.057;12.3139701558808;8162.008;193.901049445273;7.016;0.629558575511456
538;507.1;22.4975949825748;8112.286;361.238187078823;7.06;0.534677472875002
539;504.807;25.9304111228483;8075.518;412.597526502519;3.895;2.90067664519849
540;191.771;15.3045394899682;3059.721;245.761038020677;8.691;2.12808106048619
541;200.687;11.5250180477085;3207.395;184.016874185502;8.213;2.52052395346682
542;189.515;10.8148289399329;3036.121;170.412960214303;8.571;3.35117128777387
543;191.185;11.3946594946931;3057.659;184.561503269228;11.005;4.33901428898316
544;195.014;13.5493285442491;3122.53;220.463737879946;9.719;2.44676705062006
545;191.2;9.02729416824359;3058.598;140.165638784968;10.82;3.47651549687327
546;187.997;15.0789973473037;3008.342;241.299922246157;11.245;3.15342432920151
547;194.166;14.9647426974206;3104.668;244.808381956173;10.172;3.82071668669636
548;192.63;15.3913209309663;3090.369;244.249732137003;9.243;2.04552218272009
549;195.199;12.5726229960178;3112.871;200.138164299068;11.56;6.08270334637487
550;199.103;13.8940980635663;3191.545;218.751592508475;10.625;5.07988238052812
551;185.704;6.66697712610375;2966.236;105.097534814101;9.358;2.17109096999642
552;182.099;28.460049701292;2919.683;453.809789538523;59.919;150.51949199024
553;199.905;12.8939204666386;3188.268;208.968352331158;9.853;2.9375705948964
554;202.098;9.22337009991461;3239.985;149.718916790766;9.998;3.37463420239883
555;202.499;6.37158763574681;3242.994;97.7481261406204;12.002;3.87051624463713
556;191.103;21.2523758907092;3053.919;341.74826230575;54.253;134.923111885992
557;196.9;17.8912274592885;3154.529;290.184989186206;8.976;3.13994012681771
558;200.397;6.99045213130067;3199.352;112.640706567385;10.788;5.68227384063809
559;196.485;12.1334943441696;3147.375;188.47105895866;11.163;3.38145249855738
560;190.059;13.8457260192445;3042.136;229.862312665649;10.657;2.66468778658965
561;197.759;9.80016066194785;3162.854;154.977915923517;9.041;1.67423684107118
562;189.395;8.6330820104988;3029.429;138.977942742723;10.683;3.93068709006453
563;200.106;15.7750107448457;3201.162;251.198659622221;11.112;4.02871145653297
564;198.802;9.45922597256238;3182.426;151.338456527081;11.188;6.6487258929813
565;195.246;9.63499683445736;3123.75;159.830377901081;12.078;8.76117206770875
566;194.632;20.5847957483185;3113.705;328.948797026223;9.653;2.10595845163193
567;197.917;14.7434887662319;3164.541;240.535383361785;9.867;2.9075730429346
568;190.5;11.0372106983603;3047.777;166.684061508588;11.568;3.82249342707087
569;193.902;7.38135597299028;3109.042;117.779229815797;9.963;2.61649020636424
570;197.69;11.4979241604731;3158.23;178.014834999776;11.488;4.94155805389353
571;191.942;15.9518505509554;3070.47;256.966036588494;10.629;4.67885124790263
572;200.764;18.9948973148052;3211.929;301.118991843756;12.411;3.47941791108801
573;188.503;9.50984232256262;3019.461;146.913511866676;13.696;6.69655612983271
574;193.998;4.79563301348247;3100.354;79.7238864080187;9.968;2.83565089529723
575;195.089;13.2383756178774;3119.458;212.438701973073;12.681;6.11436905984583
576;191.814;14.3504802707083;3072.833;230.048825602311;12.686;7.39010717107675
577;191.198;11.7377560035977;3061.461;183.709303436154;8.56;1.91736277214303
578;187.867;12.8222471119534;3002.478;202.783195201181;9.396;2.0526870194942
579;194.529;11.1331464106067;3113.089;176.667713770795;12.088;6.23398075069213
580;189.107;13.3598248865768;3024.305;212.538667552522;10.233;6.05701419843143
581;189.702;13.2457259521701;3035.936;211.728523170591;10.774;4.46332656210589
582;200.999;14.8234283821256;3214.073;236.699079425751;13.559;5.76823621222293
583;191.496;9.70917421823279;3066.957;163.635750742316;12.933;5.49114569101931
584;195;14.0745891591905;3120.813;221.487064726142;9.953;2.38502012570125
585;196.101;13.0278865899271;3137.209;209.574293864962;11.278;5.67181064564042
586;191.4;10.8647162871379;3058.796;173.340963606411;11.469;6.29481604179185
587;194.789;7.75267495771596;3120.043;128.553056288044;11.71;3.74764726194982
588;196.313;11.7896845165593;3138.594;184.670104196649;12.783;6.70898062301569
589;188.885;13.1431360412957;3022.861;205.603494642003;12.758;5.58207989910571
590;195.113;13.4667843600468;3125.415;217.357378262158;11.717;4.89842229702584
591;186.082;16.4503658317984;2978.328;260.080690432789;12.038;6.67516112165092
592;190.684;10.8662460859301;3051.037;168.390054281733;13.722;7.7437094470286
593;196.732;8.96280067835893;3142.104;140.0101475751;11.872;6.16114080345515
594;193.602;13.3057016350135;3101.13;207.839114316821;10.483;2.73545626907103
595;189.901;15.3624974857602;3035.608;239.422939201738;12.108;6.91679087438676
596;187.781;9.31922040730862;3011.184;149.34222840174;11.501;3.22132721094893
597;199.922;12.9421047747267;3195.434;205.328044660248;13.003;2.94811821336933
598;186.031;10.1517461059659;2975.208;167.017919685277;13.763;8.44402635002994
599;193.045;6.03188403403074;3086.629;94.8923343005006;10.243;3.74075406836643
600;191.621;10.5516912862347;3066.65;162.580853116222;11.93;3.38574364062018
601;195.4;14.2834911698789;3123.887;228.407685993711;12.377;7.47091968903427
602;197.187;14.1220338832617;3160.697;229.081252923504;9.849;2.11846383023171
603;197.211;10.7704321640319;3151.603;174.916190905821;11.763;5.49172113275974
604;198.9;14.4474246840051;3182.171;228.286735333004;11.715;4.69226650990755
605;191.591;13.6474579684276;3063.446;220.126865793339;11.986;6.39589118106304
606;190.974;10.9234034989102;3065.685;173.120997932086;14.38;6.97003299848716
607;198.997;12.0906724792293;3181.656;193.277562650199;15.348;4.92478791421519
608;185.021;14.0727704806127;2956.341;228.94067381966;11.418;6.74591550495557
609;182.287;14.7312117967258;2919.268;233.77379274846;9.632;5.29259822771387
610;194.439;16.4611758085506;3106.017;262.777692129686;11.656;4.82253916521162
611;188.992;10.7601271367948;3024.976;174.709256434804;12.674;7.06084584168214
612;187.306;13.7219023462495;2996.999;220.094183950867;9.811;1.35674205359751
613;190.274;14.5556437164418;3041.487;231.762400705984;12.437;4.94223643707987
614;190.92;11.3289258096251;3057.641;177.285667297163;11.844;4.18934410140776
615;196.504;16.1942633052571;3146.863;258.595874485649;24.421;39.0679847061504
616;187.6;14.8342185503656;2997.301;239.917320360581;12.174;3.79981104793384
617;199.648;11.6189481451636;3194.568;179.766564121357;11.192;5.96772117311122
618;184.147;14.3707515809023;2946.151;230.441760861619;12.296;3.82489790713425
619;197.202;14.1784073858809;3160.525;228.402800125127;11.125;6.82595524450607
620;194.898;15.1926178126088;3110.176;237.808637025653;34.391;70.146830641163
621;196.992;12.9986220808205;3158.889;208.251269405499;10.557;2.88200988894903
622;201.872;14.8446197660969;3227.245;238.176184462258;11.623;5.38117654421409
623;198.833;9.71392716670238;3182.11;154.892099733981;11.689;3.31765715528292
624;197.294;12.6450244760535;3157.923;200.537634226092;12.013;3.61113292472044
625;188.307;20.9597328465799;3007.918;331.347614954446;15.7;6.90499094858205
626;198.901;12.9247912555675;3190.392;203.255181523129;13.375;5.89365803215626
627;195.099;12.0093392407745;3120.78;188.036870373876;13.19;9.04190466660648
628;195.604;13.8045370802503;3121.838;218.915843958357;10.376;1.46993333182155
629;192.492;8.43388143146406;3085.17;132.483539732306;10.239;2.94474939510988
630;193.007;10.4246055560868;3088.789;167.844694670391;13.335;5.23343338545548
631;186.717;12.6077833499784;2984.146;199.778248675879;11.79;6.34770982323546
632;177.867;16.7538831618227;2849.784;268.21613468246;49.181;120.931775927587
633;192.101;10.3180341635414;3070.681;156.11462368722;9.664;2.65382817831147
634;193.265;12.2503512194547;3094.024;196.632141228238;11.604;5.95919826822367
635;193.302;14.7812176764977;3089.722;239.80223330069;10.723;3.76421585459707
636;202.024;12.1384580569363;3235.661;200.034253189306;11.73;3.53097153769328
637;190.813;9.41315680311368;3049.505;153.122602854718;10.678;2.91573592768618
638;185.081;12.356159152423;2970.503;198.258324064841;9.959;3.51321633265018
639;189.018;13.2040461980408;3018.275;208.001799283079;12.446;2.80792165132861
640;192.195;14.3779026634625;3070.513;226.042858858669;14.018;8.63260540045704
641;196.305;15.5987520334159;3144.48;248.902528713545;11.787;4.10256761065555
642;198;13.4891845565254;3165.908;214.863342746034;13.425;6.49861716059655
643;190.399;16.5052376232517;3048.002;259.469925340108;11.567;4.82997732913934
644;201.681;16.4778842391857;3229.787;266.864252534889;13.628;7.15619423995744
645;188.978;31.1301139734501;3026.035;495.733643144176;35.911;74.1400327016383
646;200.171;14.0179609430188;3195.037;225.518081494589;53.307;124.619061708071
647;197.202;13.5605027930384;3161.651;212.531031120168;10.538;3.3303987749217
648;188.192;13.0366949799402;3005.89;212.760955628615;12.743;3.91633770249707
649;192.106;5.40620236395264;3073.002;92.3701481865329;9.355;2.18414857553235
650;198.396;7.52165699829483;3182.443;124.553916200969;11.318;3.61305355620422
651;188.781;9.72085433488222;3013.993;158.562235734123;11.616;4.23706077369678
652;198.223;10.6151175688259;3174.656;172.382921091395;11.392;4.81425549799759
653;195.983;15.3475170956087;3133.943;245.291481957682;10.339;2.52186617408616
654;187.912;15.4430844069442;3005.201;245.447642092973;11.548;5.86895186553784
655;191.298;10.9125283962971;3062.566;173.0635356856;10.5;2.67991417773033
656;193.302;10.47916485222;3093.203;163.6983920538;10.23;2.00457476787473
657;196.598;14.9650564983897;3148.55;244.55303482067;11.499;4.81776805170195
658;195.308;12.3911894505735;3119.421;195.957422694324;12.575;4.82866907128662
659;197.395;14.0144983856005;3162.312;226.298186462017;10.182;1.89410031413333
660;191.903;11.9845225603689;3069.443;190.850651193536;15.517;13.4712902500095
661;191.403;9.18017652335728;3059.832;151.441040329244;10.948;2.08951094756644
662;196.096;12.7627968721589;3141.347;203.409331990936;11.317;4.08406672325513
663;198.381;12.2273205977437;3170.012;194.808904252344;8.945;1.73986350039305
664;203.821;16.3729908385731;3262.432;261.791646803333;10.428;3.73863023044537
665;198.393;10.2224371360266;3173.779;158.631995224791;10.147;2.72656212106015
666;190.972;10.1661790265568;3056.649;159.376417982722;12.246;3.85238938841857
667;190.736;10.4519406810411;3054.577;164.611872600366;11.629;3.65411671953703
668;199.004;10.3061168244883;3179.141;169.423774863504;12.078;4.84963256340107
669;194.297;11.8989016720028;3109.461;190.492923776706;10.395;3.09248524652908
670;191.199;12.1052256897589;3059.899;194.031910903854;11.61;3.05789470060694
671;190.078;14.7162921960663;3046.357;230.484602351221;13.31;6.2547549912047
672;199.927;14.1253701190448;3190.826;226.019778037233;13.984;7.13635509206205
673;190.107;14.618311838239;3044.222;229.066250146105;13.511;8.98898709532949
674;191.497;11.6501081969227;3067.163;191.013474605841;12.472;5.17089702082724
675;191.4;9.70670592940765;3057.599;157.694756567877;14.129;7.53845534575884
676;182.201;12.4506083787099;2916.014;203.095133728019;12.732;6.58629607594435
677;192.096;12.5611728751735;3074.639;206.445513414549;13.709;7.04938075294561
678;190.995;12.127274425855;3054.715;202.860129017509;13.648;8.85836869858102
679;182.006;9.56559898804074;2910.674;152.313919600279;11.6;8.21540382452378
680;193.603;12.5931124429189;3101.332;205.038051726993;14.089;11.5360161667709
681;189.604;10.4889105249307;3032.547;163.328398023737;12.852;7.45516706720916
682;205.989;8.24490078776032;3299.936;135.111662205749;12.986;3.18967772666769
683;193.197;9.10024730433274;3090.567;150.037020968164;13.306;6.63120230425825
684;189.211;12.6988262843464;3029.279;200.899795194034;14.806;9.80093485336986
685;201.798;11.6814971643192;3225.774;189.894234888795;15.081;8.91619139543337
686;193.4;16.3516372268955;3094.502;266.932177071253;11.525;4.62066066704752
687;197.454;12.4466784324168;3158.356;197.854099639105;11.604;2.53214217610308
688;193.954;13.7948462840292;3100.379;219.705279611118;10.662;2.59993384531223
689;184.896;8.54911129884274;2960.228;137.280731481154;10.027;2.58468586098969
690;196.2;10.8765877001938;3138.003;174.996612712933;13.103;6.38589547361997
691;193.092;12.7051916947362;3091.88;201.843401328847;12.405;2.53149856804225
692;189.277;12.7812558459648;3027.344;205.087467447432;11.407;3.78919001898823
693;193.48;9.74680050067698;3093.077;155.271104398083;14.493;7.26582280268381
694;191.35;14.0591116362309;3065.382;232.090392898974;11.978;5.17733676710334
695;192.102;13.3519150686336;3074.237;204.400612036753;10.891;4.17975226538607
696;196.067;11.0573858122069;3134.577;175.249573183501;11.846;3.77012784929106
697;195.133;16.2330083779934;3118.914;255.781904254382;10.373;1.97602656864729
698;191.3;14.2960882761684;3065.076;232.680613210474;12.866;3.90399334015825
699;191.587;11.5827855458004;3064.88;187.385951607902;14.283;12.678680570154
700;191.116;13.6058099354649;3062.157;214.309660447213;18.273;21.7174740934576
701;188.097;9.61710460585732;3003.632;155.300141262002;11.724;3.15937082343938
702;190.303;11.1779354533834;3045.864;180.653160071996;12.137;4.8247114939652
703;200.289;11.0689750654699;3205.316;174.868637565468;9.704;2.37945035670005
704;193.407;14.0315231176089;3096.2;228.060381697478;11.035;4.68682248437041
705;192.403;7.68281725671036;3076.626;127.712251894637;11.525;5.00716137147586
706;189.992;10.5305439555604;3037.356;176.327587756442;10.573;2.96323488775358
707;191.208;14.3524630638787;3060.418;227.707049596631;12.032;5.70919223708573
708;193.502;17.3844780191983;3096.899;278.386497030653;12.515;6.36054911151545
709;191.198;19.4645065696512;3060.172;310.084259252231;36.499;72.4141318321224
710;189.004;11.704451460876;3024.876;190.681583599465;14.164;6.00545951614029
711;185.482;12.455653174362;2967.431;196.50838818993;10.249;4.03155912768249
712;199.017;12.9532953722208;3182.108;207.373876310396;11.118;2.84531825987885
713;196.799;18.1593399935128;3146.079;292.732108162053;13.449;8.48215473803679
714;193.125;22.2470844157158;3091.799;355.690041818717;28.359;50.5989662839074
715;194.973;16.0327041075424;3120.781;255.507074205397;12.677;7.09845201434792
716;193.295;8.55366266578236;3091.32;133.347432971159;9.835;3.4006859602145
717;194.604;10.5396054954636;3112.776;169.130884477078;8.479;1.64788622180052
718;192.396;10.6754533393196;3078.011;168.216321708091;15.015;14.47670905282
719;191.359;7.20442565372128;3062.526;115.064963060017;1.388;2.98440546843086
720;526.96;40.5501610354402;8445.976;652.818183971614;6.084;0.516801702783563
721;554.301;26.6788423474466;8869.105;425.14062786919;5.819;0.521487296106037
722;530.712;41.4880878807378;8492.97;663.307206096823;6.062;0.823732966439975
723;532.587;43.738972793151;8515.267;704.419964751888;6.026;0.912383691217686
724;536.575;35.472831928111;8586.96;564.182797504486;5.861;0.542686834187082
725;526.058;47.2025068825798;8418.998;759.803839721793;6.082;0.818129574089578
726;553.864;19.6926621867165;8860.033;319.500492145192;5.92;0.486456575657054
727;544.978;19.6889699070355;8720.388;312.553645437095;5.82;0.560517617921144
728;515.633;60.3801909652486;8250.517;963.463394385572;6.798;1.97420768917559
729;498.675;79.9018963792474;7979.794;1278.76164101994;7.005;2.16445027662915
730;524.302;41.9823719672921;8388.806;672.026607735158;6.274;0.7800666638179
731;527.51;40.987412701951;8436.068;657.775454829362;6.064;0.552941226533162
732;521.084;44.4696730817746;8343.633;707.358177560019;6.432;0.650289166448283
733;523.397;37.0030177282888;8371.759;597.421630047797;6.332;0.69631602020921
734;543.704;31.4161449576499;8696.751;500.207519644586;5.995;0.607227305051421
735;534.689;33.1581725823347;8555.031;531.479961549828;6.234;0.460134762868434
736;533.123;38.7185278774916;8527.376;616.422213538734;6.13;0.544113958652063
737;523.884;34.7950160798931;8387.454;558.224021324767;6.349;0.642953342008569
738;538.805;32.9075448035869;8621.012;525.927557117906;6.185;0.566696567838558
739;550.304;23.7687173402351;8803.657;379.54386492338;5.949;0.453992290683441
740;551.976;13.5498281907939;8829.518;219.968386765015;6.116;0.6247111332448
741;546.626;28.4444758081429;8746.892;453.343874333834;5.966;0.537200148920307
742;532.098;46.6926944606979;8516.558;746.606471881923;6.247;0.717175710687417
743;519.994;45.4740513260031;8315.785;725.295170165224;6.321;0.598856410168582
744;516.101;42.7970294413063;8258.52;683.737037098345;6.314;0.488900807935509
745;533.387;43.0302398436271;8534.379;688.55510439545;5.864;0.562462443190654
746;527.106;55.5375086225521;8434.877;892.572954419417;6.042;0.754596580962307
747;504.902;39.6216952691323;8076.952;634.524430732177;6.664;0.653011485350759
748;516.487;32.6447793835391;8262.989;523.309361017973;6.333;0.545454856060514
749;512.119;37.2281813818523;8195.116;592.453123769331;6.304;0.640518539934636
750;525.186;35.6445988054289;8402.38;568.093424605498;6.139;0.538784743659285
751;522.117;29.5977854070196;8355.853;475.568876442738;6.597;0.701883893532256
752;544.082;31.5447113792473;8705.016;506.902942232558;5.906;0.570582158851798
753;556.661;20.9968856976464;8906.843;337.457159771458;5.727;0.415428694242467
754;536.456;29.1750126649514;8582.905;466.921689842083;6.071;0.325344432870775
755;541.297;29.6779564828843;8662.051;468.493884921686;5.965;0.512840131034997
756;540.704;26.8252799426189;8648.587;434.631490668857;6.298;0.557795661510555
757;545.379;27.6467569345846;8725.853;442.38991604804;6.202;0.613087269481269
758;542.104;31.5912206791701;8678.686;508.747110698422;6.346;0.91169293076123
759;550.206;27.319306433366;8798.418;429.883951358924;6.015;0.787607135569514
760;546.002;29.4116336846499;8737.044;472.604785316476;6.014;0.693861657681128
761;539.297;39.2784187690889;8628.549;624.928653982971;6.227;0.945748909594927
762;521.506;42.998422110583;8341.162;688.070213085848;6.09;0.598230724720823
763;526.597;43.9104538919836;8428.568;700.520411948153;6.266;0.81207388826387
764;521.889;36.1572281708667;8348.439;576.070833621183;6.221;0.450121094817823
765;532.012;40.6324310865115;8512.41;649.94827232634;6.038;0.762427701490435
766;539.801;41.6592526217154;8640.429;666.74453540243;5.808;0.672514683854564
767;537.494;28.2870522324266;8598.715;450.818061311854;6.283;0.497595217018816
768;551.41;34.1565367096841;8822.478;549.540922585385;5.979;0.871853772143008
769;546.9;25.3516524116276;8748.713;399.903186885276;6.166;0.582995711819562
770;546.078;25.2492280278069;8741.038;402.810571380645;6.062;0.652852203795023
771;554.832;24.7764447812811;8875.899;397.488218931071;5.847;0.509726397197565
772;538.09;44.7030001230355;8605.647;714.976621240852;6.021;0.651804418518323
773;543.403;32.5465515992081;8696.054;523.684273932292;6.165;0.67287814647229
774;550.137;32.533335534496;8800.911;519.381828377736;5.874;0.684225109156337
775;541.127;38.673504638188;8661.106;621.169468988903;5.979;0.687305608881527
776;547.917;25.7396888287322;8762.574;411.951452144566;5.885;0.426878202769833
777;544.299;33.7781957629473;8714.174;544.089117446734;6.11;0.861266509275716
778;546.107;32.2884533695869;8735.94;516.105879854153;5.945;0.641174703181584
779;546.878;37.2938739741548;8749.144;593.912067585759;5.955;0.534120772859474
780;531.891;47.9931581478026;8513.442;771.054397339121;5.958;0.451836253525542
781;532.937;44.691606605714;8524.914;711.509975899154;6.381;0.898971078511424
782;508.541;76.876849369625;8131.549;1229.83435475229;6.882;1.99487242699878
783;500.154;68.6961562534613;8009.867;1100.97045391827;7.27;2.17501724131097
784;520.305;45.7988345375718;8322.363;733.44007691223;6.356;1.18078956634957
785;510.297;47.8375994485503;8164.134;764.935708255256;6.415;0.730003424649501
786;516.59;45.1768859041875;8265.243;723.523376858685;6.008;0.519861520022389
787;515.009;72.4414261938568;8243.471;1161.48613050219;6.62;1.49293000505718
788;521.1;47.5786542474678;8332.511;756.894713939121;6.52;1.78728844901991
789;518.882;40.9732819774061;8302.615;658.139856219796;6.528;1.43136158953634
790;544.401;20.5308253365499;8710.529;332.827137578985;6.352;0.661434804043444
791;549.218;33.8940185873546;8791.582;540.567441672203;6.236;1.38021157798361
792;527.391;70.1823458499359;8436.744;1122.67916629997;6.18;1.12737748780078
793;543.691;41.1523419625176;8698.562;658.095835525465;6.005;0.613925891293078
794;531.898;32.2931753780895;8507.855;517.673619711292;6.344;0.68775286258947
795;530.405;40.3356403816756;8489.281;640.560795669708;6.274;0.765548169614432
796;544.005;30.0056812120637;8706.296;479.660765399897;5.918;0.699654200301831
797;552.603;32.1752579010656;8839.126;513.251776600941;5.918;1.0135659820653
798;547.996;32.9891600984325;8764.218;531.020580105886;6.126;0.939140032157077
799;544.202;38.0726008567837;8710.246;609.18548500766;6.039;0.97494051100567
800;525.599;43.101005429109;8413.674;688.897634546693;6.322;0.798683917454215
801;536.229;34.950037896974;8575.553;560.778587894546;5.964;0.386760908055597
802;544.98;35.336541992676;8719.171;570.792150672205;6.133;0.895578583933315
803;548.492;23.0175019496043;8775.461;366.494544200883;6.06;0.51328354736929
804;556.301;19.5903830743574;8904.015;313.023944842924;5.929;0.471750993639654
805;559.295;16.1009734177778;8944.624;262.09342934154;5.835;0.475988445237915
806;569.617;11.919465633998;9117.561;190.437295373095;5.583;0.382126942258713
807;562.893;10.5669854263173;9004.09;166.389296891359;5.706;0.393044526739651
808;551.563;23.1407303471578;8822.197;372.132157305707;5.784;0.34874632614554
809;552.802;25.1832626162714;8852.338;400.187974676904;5.88;0.623281637785045
810;558.991;22.4136339980816;8938.679;356.927071359138;5.662;0.367554077653874
811;548.936;19.6800072154442;8787.888;317.18841885544;5.98;0.565119456398376
812;552.404;21.0565031284863;8837.08;336.476715152801;5.825;0.328306259459071
813;550.7;34.8236770028662;8810.3;554.988669668135;5.902;0.677433391559639
814;549.493;42.4148497698614;8791.777;679.736871326691;5.946;0.976393363353115
815;542.309;37.1445469618357;8678.048;591.264983197893;6.079;0.692364788243889
816;543.901;32.5070526040111;8697.909;522.538824996772;6.092;0.739497126431192
817;537.493;23.8785150501441;8601.812;381.489345507844;6.162;0.531183584083689
818;527.4;30.1493827465851;8438.509;483.926498477788;6.428;0.626159724032121
819;530.193;38.9163844800621;8483.672;622.085443115299;6.189;0.813577900388157
820;545.111;34.6386158643793;8718.99;549.916032153995;6.066;0.690379605724277
821;533.199;46.269976107624;8534.97;740.061468338954;5.875;0.45242126386808
822;530.54;67.7172858286575;8486.593;1077.39600604465;6.419;1.92618508975644
823;544.785;20.4975770519324;8713.781;327.640566702292;6.081;0.478172562993742
824;555.58;24.5268746480259;8894.596;394.57491943099;5.795;0.611134191483334
825;557.52;19.3991448265098;8916.498;308.255432386844;6.046;0.773630402711789
826;547.801;18.8416907150102;8768.011;301.685065273402;6.195;0.639675699085097
827;553.212;19.7970597816956;8848.594;320.49284036304;6.103;0.795173565959033
828;562.981;12.6408009635486;9013.96;200.616157923468;5.511;0.483434587095287
829;557.414;29.2233325272822;8913.323;466.302108917634;5.754;0.609790127830887
830;548.201;24.0003310185488;8773.008;382.204081867271;6.029;0.502562433932344
831;548.294;26.6071825641102;8773.102;426.925546642528;5.955;0.517073495743108
832;542.401;34.6097597362352;8680.906;549.012911400097;6.033;0.690580190854037
833;534.7;32.876279290698;8550.093;522.849348857755;6.066;0.684078942812891
834;548.587;19.2001099215655;8778.178;305.316525618848;6.004;0.476743117412307
835;545.823;20.1089477845052;8734.047;329.060497721873;6.077;0.678454862168448
836;544.68;23.9812430870477;8710.487;382.802757541001;6.365;0.791988004959668
837;541.911;34.9735061010466;8674.957;556.23395205704;6.536;0.856716989442842
838;545.611;26.5700061911939;8728.971;424.007564164791;6.152;0.527499763033128
839;549.896;17.1285120194371;8800.013;273.57251912603;6.047;0.479396495606725
840;540.494;30.6982218377546;8645.005;490.60982114607;6.235;0.814791384343261
841;530.067;27.7634569353302;8482.55;447.363707960334;6.605;0.507193257052981
842;528.932;40.4855665144997;8459.438;643.898371807215;6.38;0.817116882704058
843;533.4;33.688015376392;8537.607;537.876100157832;6.392;0.700139986002792
844;532.609;34.6294985380961;8516.917;559.261636518197;6.233;0.741782313081136
845;520.201;41.7871813957345;8330.2;670.861732058107;6.788;1.01469995565191
846;536.397;24.9658058351839;8579.077;398.308897742689;6.326;0.733473925916925
847;535.187;33.4434633523503;8562.894;537.700305638712;6.199;0.573819658080839
848;537.085;28.3787551700216;8593.772;450.845491843889;6.345;0.434977010886784
849;538.718;33.3207508318756;8620.089;532.647633927895;6.303;0.751266264383006
850;535.018;41.0396259242198;8558.075;658.121605757633;6.638;1.08703081833037
851;541.587;32.4645009356373;8665.678;517.255315425575;6.154;0.741393282947707
852;532.298;43.955227857446;8520.08;701.922690472427;6.245;0.947420181334554
853;539.592;27.7421714362803;8631.874;444.40686824577;6.139;0.508614785471295
854;542.591;28.4375700262864;8681.165;455.890116349346;6.196;0.683479333996279
855;534.879;36.7881772992329;8558.875;585.337909745277;6.15;0.501417989306323
856;542.527;34.2949599941451;8678.654;551.656496222076;6.048;0.804957141716245
857;528.899;32.4863098704668;8463.576;520.793466821533;6.492;0.794478445270855
858;534.404;40.4853156588894;8549.581;651.717502764044;6.339;0.959577511199586
859;541.808;26.2169112597194;8671.835;416.013394718227;6.191;0.634420207748778
860;555.41;23.0424512584908;8883.986;368.319993163519;6.025;0.78895183629928
861;548.58;18.7050977008943;8777.165;299.418367915195;6.113;0.718902635966781
862;558.309;12.9271562611446;8931.246;210.733504132542;5.918;0.43762541059678
863;549.302;26.2864135248608;8791.14;420.521840122482;5.818;0.538029738955027
864;534.683;38.914825979312;8556.245;621.876704954465;6.314;0.93564095677776
865;535.393;47.8798126667177;8566.592;767.787288365723;6.045;0.8722413656781
866;540.721;39.6173359654601;8650.336;634.262830697192;5.986;0.734604655580141
867;546.001;27.8168393064356;8735.894;442.604101295961;5.884;0.575207788542545
868;529.387;58.4521654089903;8472.384;938.834256567149;6.481;1.53149240938374
869;523.387;63.7899242905969;8369.298;1012.08245042388;6.539;1.87758062410113
870;535.833;41.77825392474;8575.427;668.640718683057;6.248;1.02197651636424
871;522.004;45.4043634907477;8354.464;727.068684626178;6.306;1.0862798902677
872;522.49;43.9259226425585;8356.443;702.959939001508;6.111;0.610695505141478
873;523.306;41.7034193322335;8372.508;666.943156075517;6.09;0.442221663874586
874;527.198;41.3088036137582;8434.062;661.12565006661;6.13;0.543175846296575
875;530.588;46.8156138056519;8491.727;751.23750730446;5.941;0.595809533324202
876;524.6;43.5305019497831;8396.013;696.081572045237;6.305;0.725565296854806
877;520.002;52.14069232375;8316.238;834.6007848283;6.538;1.30176649211753
878;502.487;50.6579123237415;8041.402;807.955489080938;6.74;1.27539797710362
879;520.394;52.8261937300042;8328.426;846.531198387855;6.251;0.737488304992023
880;510.539;48.4595281549468;8167.032;775.104673702843;6.83;1.52622409887932
881;517.569;52.7702805469125;8280.625;839.861330771351;6.372;1.52891988017685
882;536.811;34.8357765666287;8592.977;557.172489271521;6.088;0.98037543828882
883;535.79;39.6063217176261;8568.838;633.960795046506;6.285;1.31578303682636
884;536.488;73.5395198243773;8584.995;1175.33711287655;6.547;2.5089362287631
885;542.329;29.3521728156549;8677.148;474.789234540961;6.071;0.601472360129709
886;553.672;25.2772011108813;8862.145;397.883550558447;5.927;0.678381161295023
887;539.121;34.7184629412094;8622.939;556.098535881003;6.003;0.709155131124345
888;537.003;26.9153343096479;8590.159;427.928439074828;6.038;0.493230169393555
889;554.976;33.7280868713304;8881.208;537.46045016914;5.916;0.773074381932283
890;555.93;30.0036374461487;8892.871;480.313114758469;5.842;0.67013133041218
891;553.269;34.64003794744;8850.802;555.934939715085;5.959;0.574377053859217
892;537.534;34.08850633278;8603.95;541.187138520486;5.868;0.507814926917274
893;536.873;39.0317734800776;8591.692;622.901040821076;5.858;0.723198451325769
894;550.32;32.2116925975648;8802.304;514.607156852684;5.858;0.466986081163014
895;545.301;24.6017013436063;8722.542;388.964007558534;5.92;0.590982233235473
896;565.502;15.5440720533609;9054.112;245.994067156123;5.495;0.535933764564251
897;555.263;32.1005788265568;8882.022;516.064685767182;5.954;0.738149036441827
898;548.016;43.440770757433;8766.052;693.932347391295;5.835;0.930669114132409
899;542.444;36.7552747779133;8677.982;585.910268024042;0.257;0.771
900;482.525;40.1549312662842;7721.078;641.280405934889;7.755;0.91700872405882
901;567.516;39.5655577996837;9084.273;636.612387831886;5.04;0.483611414257355
902;586.798;36.4755717707071;9385.17;582.247196163273;4.832;0.301124558945301
903;583.683;40.3651463641592;9337.426;646.344051959936;5.018;0.560995543654312
904;562.014;35.7126569160025;8993.626;571.660266770419;5.314;0.445919275205723
905;533.894;46.4511492215209;8543.285;740.284347561798;6.237;1.47204653459053
906;519.475;59.0769737291954;8312.418;944.940057959235;6.014;0.992513979750412
907;530.144;68.122219018467;8484.712;1093.23456627387;5.801;1.722611099465
908;565.201;48.7039182099345;9040.598;778.113564845134;5.048;0.557401112306031
909;554.395;50.0719524784072;8871.111;800.38794019462;5.162;0.590589535972311
910;560.605;44.4503145658155;8968.575;714.099476827281;5.263;0.505154431832492
911;551.402;59.3494794922413;8817.464;946.56206356689;5.306;0.719724947462567
912;546.363;71.6534338395584;8745.015;1147.55486452936;5.945;3.04634288943316
913;544.447;65.3530609918149;8712.156;1048.86206551864;5.497;1.1530572405566
914;571.203;38.8579369112657;9138.058;622.797920304819;5.014;0.383202296444042
915;576.901;41.2473796622278;9233.129;660.563303301827;4.967;0.554509693332773
916;569.44;46.3031117744807;9112.726;741.045520102508;5.07;0.426544253272742
917;566.962;47.1920283098746;9068.872;757.392813166338;4.913;0.449111344768751
918;565.404;45.3426609717619;9049.985;729.532915641908;5.07;0.510959881008284
919;590.201;35.309484405751;9439.707;559.327705071934;4.888;0.360216601505267
920;588.901;37.9603518028991;9418.381;608.124983131738;4.829;0.39272000203708
921;601.9;25.9346112367235;9633.823;414.108688632581;4.675;0.243032919580867
922;595.881;26.469060976922;9536.296;426.543661990166;4.735;0.249088337743835
923;599.513;32.6678012881208;9593.021;520.603233267915;4.663;0.320251463696892
924;586.007;40.5915286851809;9374.513;654.130838809041;5.03;0.473772097109997
925;591.898;47.1748843771764;9469.746;754.714182763253;4.801;0.627478286476908
926;590.202;43.2272749083267;9445.63;686.322907340257;4.821;0.50636844293459
927;591.794;37.8610626369608;9465.108;608.568894946179;4.779;0.397578922982583
928;582.403;44.3677337825585;9321.768;709.859113807794;4.852;0.460321626691587
929;591.493;31.6430652908333;9464.58;509.254169703133;4.846;0.398175840552906
930;599.007;23.4342198718037;9580.201;371.923647445228;4.71;0.241412510032095
931;609.774;7.52913036146848;9757.556;114.729738620971;4.613;0.100104944932744
932;603.814;13.7248768300494;9660.724;220.257805364643;4.657;0.204599608992786
933;589.912;39.6085540761074;9439.384;637.410000803224;4.903;0.459391989481748
934;604.901;10.1274295356681;9677.34;163.8487454941;4.629;0.0843148859929032
935;605.298;7.45973565215192;9686.286;117.912983186964;4.688;0.147363496158302
936;608.606;7.83880883808177;9738.077;122.29307012657;4.619;0.0830000000000062
937;580.59;47.9802717791399;9286.344;767.271392327365;4.809;0.454102411356727
938;585.905;48.5375700360032;9378.578;775.609286623114;4.87;0.551416358117892
939;598.487;27.6552591924198;9574.378;443.819830241951;4.721;0.293034127705288
940;603.815;12.5223066964608;9664.937;197.363513905172;4.77;0.282595116730639
941;602.1;10.6776458079471;9629.289;167.236727452468;4.714;0.145958898324142
942;611.502;7.01912929072581;9783.437;114.363786055735;4.531;0.116314229568004
943;605.697;14.2515480211774;9692.046;224.818028912286;4.746;0.298134197971311
944;608.406;10.2158516042496;9733.597;163.4898618294;4.648;0.169044372872906
945;610.788;13.6861914351638;9775.107;217.245613444753;4.589;0.141382460015362
946;606.209;21.7591114018962;9694.659;353.087524232993;4.635;0.266167240658962
947;599.397;39.4712619636123;9591.452;628.839411023176;4.682;0.354084735621301
948;600.498;20.9197073593323;9608.94;334.15448891201;4.691;0.367163451340127
949;585.6;45.7057587181301;9367.8;730.174284400656;4.862;0.370048645450836
950;576.605;47.3744706039024;9226.184;761.080462411162;4.99;0.533441655666296
951;576.599;48.2949213582557;9228.764;772.752577960125;4.997;0.588303493105382
952;575.398;41.834291149727;9205.364;668.094446065841;4.945;0.426010563249315
953;575.004;54.1552594306404;9200.164;870.476571852472;4.964;0.518617392689444
954;592.098;38.7832267352775;9470.45;620.057516832102;4.827;0.360916887939598
955;605.268;29.2979380844456;9684.191;471.453965715612;4.685;0.251565100918225
956;586.134;41.6353696272771;9380.658;664.780595366636;5.023;0.929419711432891
957;585.902;44.7294139912428;9372.236;714.953734016415;4.92;0.628808396890504
958;582.396;39.1613746439012;9319.936;629.518323263101;4.804;0.383071794837462
959;580.297;43.2824930081439;9287.557;685.950963685465;4.993;0.466841514863445
960;582.907;49.9485507397371;9319.017;803.722392111247;4.866;0.512800156006217
961;581.547;37.2071458324895;9313.931;594.61111577988;4.915;0.370087827413985
962;579.154;45.2778089575886;9259.346;727.194681542709;4.895;0.446458284725458
963;587.703;33.1248831092251;9402.257;528.844692060888;4.797;0.309840281435459
964;585.383;36.2262728002758;9370.718;577.766304534964;4.816;0.421454623892052
965;589.899;35.9882145847778;9431.294;579.771099679842;4.953;0.688012354540227
966;584.515;43.0191553264342;9356.836;687.993966618857;4.809;0.448340272560927
967;582.069;35.7819000194224;9314.917;570.860200785628;4.862;0.383557036175848
968;595.229;24.3072558920185;9524.478;384.608399331085;4.743;0.236349317748117
969;598.095;27.8339559710792;9566.338;450.507338160007;4.797;0.423817177565993
970;588.501;37.9868841707245;9421.316;603.523613907514;4.962;0.69019997102289
971;597.196;30.1491648972201;9553.525;485.16442188706;4.728;0.274109467184203
972;592.208;32.7445445227139;9471.235;524.209478114419;4.796;0.272624283584584
973;582.094;43.3686490912491;9319.601;691.289199893227;4.912;0.525543528168691
974;589.569;28.2280851103978;9428.914;451.683604820889;4.771;0.286546680315789
975;596.941;30.0747962420359;9549.057;482.827912781571;4.802;0.369805354206765
976;594.488;37.4594777860017;9517.912;600.527773892266;4.799;0.443654144576603
977;584.211;47.1407262247832;9342.777;753.535372587778;4.861;0.553524163880855
978;577.699;40.747533041892;9246.606;652.370771129426;5.034;0.51168740457432
979;610.384;14.8220013493447;9763.777;234.258097578349;4.582;0.173251262621692
980;585.113;59.7600378262926;9360.811;951.559154823809;5.314;1.92551915077467
981;602.399;25.3923781674734;9636.36;397.767593752939;4.657;0.196522263369835
982;596.499;26.6482109906078;9546.491;430.553683655112;4.746;0.288901367251869
983;595.698;26.1279401407758;9535.755;418.129388018803;4.759;0.226603177382831
984;599.904;33.6690835040104;9593.43;536.223145229687;4.656;0.3276339420756
985;599.002;24.5384244807985;9585.016;395.271110029556;4.685;0.283593018249735
986;591.293;43.699340738734;9462.289;698.2335802502;4.692;0.471694816592253
987;589.807;46.0718907903704;9434.801;740.672026317305;4.793;0.378524768013933
988;555.001;108.067896199565;8879.844;1731.22151451626;7.817;8.84801791363467
989;591.296;30.1031062184631;9459.617;476.470800176622;4.824;0.318691072984475
990;587.304;34.2862666967412;9399.079;545.216700852935;4.796;0.27699097458221
991;581.601;40.9938413545245;9311.507;659.21666065187;4.836;0.466308910487454
992;585.9;42.2448827670293;9368.806;676.526474192987;4.781;0.428029204611077
993;588.996;34.0937549120066;9424.32;543.767922996534;4.802;0.379889457605766
994;594.206;32.5698889159922;9506.801;524.867468956707;4.792;0.350964385657578
995;587.399;35.7084428251922;9398.172;570.485401299633;4.868;0.332439468174278
996;583.501;35.8633669501348;9339.613;576.854138826239;4.865;0.398754310321532
997;579.391;42.1268100976088;9266.56;674.686200777793;4.919;0.411034061848891
998;572.809;48.2542697489044;9168.147;773.848305755714;5.073;0.646452627808099
999;577.694;35.4988808837694;9243.303;563.767816446598;4.925;0.379690663567064
1000;577.994;48.0743025326436;9243.596;768.336146269303;4.972;0.51034890026333
1001;583.612;36.214004970453;9338.488;582.899282154278;4.854;0.36136408233248
1002;561.494;49.7102822764074;8985.909;794.806920836133;5.15;0.662314124868249
1003;550.305;47.8284139921023;8804.281;762.919815491127;5.337;0.737781132857169
1004;574.791;45.4124091961659;9197.65;728.778675195719;4.874;0.399404556809269
1005;571.009;42.0456015416599;9134.524;670.727953334257;5.082;0.533719027204394
1006;552.898;114.145678569099;8845.873;1829.08080511525;8.105;9.60734744869779
1007;590.304;39.0922468527972;9442.879;622.458679728236;4.846;0.379056723987312
1008;588.096;39.2131998694329;9412.915;626.7202099382;4.861;0.348409242127703
1009;580.204;49.6690290221173;9280.572;797.901479229101;4.821;0.389832015103948
1010;571.399;44.8150968870981;9142.2;717.268040763031;5.049;0.4798635222644
1011;592.902;39.0731434107868;9483.225;626.47128533157;4.767;0.371161689833422
1012;576.1;42.3824027162214;9217.794;674.397701748774;5.019;0.613423996922194
1013;583.988;47.3978104557593;9349.225;754.171738641118;4.86;0.441270891856692
1014;580.504;34.5946068629211;9291.465;556.823951267355;5.072;0.542047968357041
1015;587.203;35.1344728294017;9392.558;562.203575154029;5.079;0.936647745953618
1016;597.093;27.464481444221;9553.308;440.999362534706;4.728;0.40639389759197
1017;605.307;15.0725578784731;9683.806;241.809859319263;4.688;0.30934770081576
1018;606.703;11.9423557558745;9704.415;188.653784496929;4.648;0.207692079771947
1019;612.894;18.3172357084802;9809.432;297.187874476731;4.636;0.284822751900187
1020;608.201;16.241609187515;9730.205;256.394806743416;4.705;0.331881002770576
1021;588.199;29.4911656093832;9408.277;474.608487072244;4.959;0.597150734739566
1022;595.402;27.5095044666377;9532.203;440.825799246121;4.86;0.543801434348972
1023;589.204;46.509791485235;9428.245;744.362512708046;4.904;0.550367150182496
1024;584.997;52.8501330272689;9352.927;843.227310279364;4.94;0.806895284408078
1025;595.2;42.5696199184362;9532.224;678.506917535827;4.781;0.430870050015089
1026;586.299;48.2589350172574;9371.58;772.870149921733;4.903;0.54781474971015
1027;584.105;48.2917142478924;9348.774;772.090139040785;5.032;0.74963724560617
1028;587.501;44.6456634960216;9402.312;715.265844337611;4.844;0.349948567649602
1029;598.094;41.5577889690975;9570.178;667.631022987993;4.657;0.336572429055026
1030;581.706;41.947441685997;9306.379;673.7233018302;4.987;0.385046750408313
1031;599.697;34.6239888083382;9590.658;556.34847857797;4.758;0.356168499449353
1032;603.408;26.6086041723334;9657.235;426.116012847429;4.653;0.292097586433022
1033;603.797;31.9949199248861;9661.556;513.959274732936;4.692;0.38141316180752
1034;595.788;53.4264552071362;9533.894;857.665907451168;4.876;0.94732465395977
1035;584.005;50.7178955103632;9343.764;811.764656266834;4.902;0.611126828080716
1036;580.307;47.137268281053;9285.815;754.041547558883;5.139;0.636261738595045
1037;571.501;54.1479189720161;9137.321;865.611999679413;5.031;0.577883206193083
1038;589.697;37.7645651504158;9439.569;605.689835385252;4.866;0.399904988716079
1039;601.903;28.7019292208717;9632.165;457.680119368336;4.678;0.416792514328176
1040;601.792;28.2267882693;9625.495;448.707285928169;4.771;0.312552395607542
1041;598.11;33.79442143313;9573.37;539.300244724614;4.78;0.524080146542493
1042;592.198;27.0200080680961;9472.651;433.186423597256;4.811;0.377689025522323
1043;594.891;25.8349861428275;9516.64;414.59962206932;4.805;0.292275554913505
1044;587.602;41.0125911885601;9406.733;653.342003563989;4.872;0.486020575696124
1045;593.996;34.745103597485;9499.547;557.840315324177;4.808;0.339876448139603
1046;586.504;38.5532492015937;9385.755;617.597780197574;4.814;0.413623016767685
1047;591.704;37.6191558119005;9467.023;599.667099181717;4.805;0.405715417503445
1048;573.6;53.1917292443099;9173.51;853.041616440861;5.086;0.676198195797649
1049;574.187;41.7539583871997;9188.904;666.009808369214;5;0.43416586692185
1050;580.214;41.944161023915;9282.521;673.749693186591;4.994;0.560182113245328
1051;562.198;57.2338628435987;9000.455;916.049103719347;5.163;0.695097834840542
1052;552.5;54.9978568673359;8838.399;885.908534200334;5.248;0.621156984988498
1053;539.402;69.2255341330067;8630.006;1105.93331267486;5.687;1.35246478697229
1054;570.099;60.192015492091;9116.187;960.345140624438;5.078;0.747232226285783
1055;580.501;53.6252501066423;9291.333;856.265179603254;4.86;0.536954374225594
1056;576.802;37.7478073005589;9230.23;607.59977269582;5.048;0.470867284911581
1057;569.1;64.7325888560001;9108.791;1034.9270366016;5.958;3.42229981153025
1058;584.198;39.3468529364169;9346.185;634.927843195572;4.94;0.471932198520079
1059;572.106;52.2509604122255;9154.281;835.092412831634;5.096;1.06128412783759
1060;571.096;51.8980233149584;9133.55;823.228853272262;5.048;0.63596855268165
1061;582.497;38.7313201556569;9317.235;623.320084198335;4.937;0.42755233597772
1062;575.301;35.599154048939;9209.696;574.093701815306;5.083;0.466884353989295
1063;555.904;65.7244502753733;8892.342;1049.88753366063;5.698;1.72202671291708
1064;578.997;44.6637486223436;9266.761;717.190252645016;4.933;0.563614229770674
1065;585.703;39.0224333044456;9370.059;618.930484746899;4.836;0.379978946785212
1066;599.087;34.0507988305707;9584.71;548.21053160256;4.753;0.404105184327052
1067;594.502;42.1553654473556;9512.325;670.139047918396;4.848;0.688459149114886
1068;585.007;42.3573176794755;9359.83;680.97610410352;4.94;0.82098721061902
1069;580.292;49.4264481426692;9282.787;792.758969637655;5.016;0.678176968054797
1070;582.905;42.6967954886555;9327.275;680.205243779439;4.799;0.331796624455396
1071;566.403;58.7357288283712;9066.344;944.813902344805;5.073;0.687605264668618
1072;592.198;35.4781182702808;9473.271;562.615587083187;4.808;0.339994117596173
1073;593.907;33.9243788594584;9503.88;542.77884899835;4.772;0.417463770883174
1074;583.998;41.94622814986;9343.564;674.816683762329;4.9;0.605986798536071
1075;582.799;44.5426502242517;9321.372;713.994873872361;5.017;0.864905197116998
1076;586.103;43.6851176145856;9380.149;697.527928794978;4.793;0.364281484569273
1077;589.298;37.8370357718467;9428.161;607.317114651834;4.867;0.447058161764222
1078;584.689;46.4206875110644;9355.105;742.520708374526;4.857;0.500000999998997
1079;562.198888888889;49.4578005182064;8996.18;789.508701183502;5.11888888888889;0.437707270125804
