time;transactions_avg;transactions_std;queries_avg;queries_std;latencies_avg;latencies_std
0;278.255;35.4988397697728;4471.519;566.388612587681;10.884;1.75564347177893
1;362.075;24.618555704996;5792.805;393.692927222473;8.344;0.634636904064052
2;379.023;24.0405686496807;6059.848;387.491328233287;8.078;0.583845870071895
3;392.934;17.4742703424211;6291.352;281.292624034115;7.735;0.331790596611743
4;400.576;10.8187459532062;6410.21;173.354362967905;7.54;0.272690300524211
5;408.132;16.5288213735903;6525.736;260.400999621729;7.666;0.538204422129735
6;406.807;20.4802295153155;6511.723;330.360667575617;7.705;0.680077201499937
7;416.058;23.1585456365462;6657.638;369.248653424755;7.536;0.423962262471521
8;408.539;39.6592096366032;6536.23;633.225966918602;7.556;0.857382061860401
9;415.404;27.5878499343464;6645.363;443.683146108788;7.554;0.694625078729525
10;410.386;32.5884722563039;6564.703;524.589100669263;7.63;0.78140898382346
11;420.119;29.9861646263737;6725.933;481.288600988022;7.694;0.998550950127237
12;431.521;25.0372108869985;6902.61;398.007810400747;7.405;0.822523555893684
13;425.132;31.2105068206217;6802.622;499.077527660789;7.623;1.12008972854857
14;420.476;89.9053885148159;6725.716;1437.75964711213;11.753;14.3631668165485
15;453.875;23.9154666481758;7261.298;378.375295937782;7.062;0.582233630083321
16;463.502;30.9751412587571;7418.236;494.560586888975;6.92;0.80395273492911
17;446.806;32.2714059811461;7145.606;515.915182897342;7.191;0.742097702462422
18;455.59;31.8843209116965;7292.334;509.737312744522;7.261;0.815309143822146
19;463.287;42.4330206443047;7411.492;677.813670720792;7.074;1.21374791451932
20;454.195;42.8659224209626;7265.927;691.482206843395;7.492;0.73965938106672
21;455.649;38.7823373328632;7289.096;616.389526179681;7.287;0.875831604819111
22;479.277;29.4574785241383;7671.352;472.243450474418;6.844;0.751680783311645
23;490.929;30.4901415050834;7857.182;490.647699267002;6.638;0.639949998046713
24;473.57;39.6933460418738;7577.428;633.80309009661;7.004;0.879206460394823
25;495.916;33.6836673181539;7935.566;539.102898066764;6.659;0.750738969282928
26;498.77;34.3012574113562;7978.543;545.169973917311;6.587;0.818328173778727
27;501.287;44.8584299881309;8016.791;720.411289159896;6.342;0.558512309622616
28;510.142;51.8989872348201;8166.57;830.164015722211;6.322;0.711713425474034
29;512.29;28.9404115381937;8197.538;464.232040316043;6.435;0.428748177838692
30;528.229;43.2462482650241;8447.36;693.547137057017;6.177;0.786321181197613
31;522.317;39.1968149343785;8359.156;627.08268930342;6.232;0.951028916489926
32;541.916;37.5983335269005;8669.442;604.746617300187;5.979;0.777437457291575
33;545.361;31.9568676343613;8723.478;505.767838811459;5.769;0.554895485654727
34;547.036;29.3898796186689;8756.385;473.359523264334;5.843;0.566304688308328
35;545.828;53.9595557431677;8731.25;863.252710682099;5.746;0.838035798758027
36;560.569;23.8326425098018;8968.221;377.303017837099;5.737;0.380553544195802
37;544.019;65.0895491534539;8706.683;1041.64616434806;6.062;1.15350596010597
38;542.916;61.1968205383259;8691.426;983.854002961832;6.036;1.00048188389396
39;555.645;56.9418688225118;8886.518;908.277016595703;5.553;0.845411734008939
40;542.266;60.8229473471982;8674.045;972.060400049809;6.062;1.11013332532629
41;552.978;48.66894529369;8844.415;779.805195587337;6.02;0.966871242720553
42;577.211;40.0561936409342;9236.289;639.41837062207;5.348;0.606511335425807
43;591.89;32.5970928151597;9475.661;526.008172283509;5.332;0.662914775819645
44;590.697;50.7004418225339;9443.442;815.73840709874;5.237;0.724845500779301
45;601.755;32.4063525408224;9631.567;516.212281547988;5.154;0.550857513337156
46;590.429;28.3719690716063;9449.067;456.720380124443;5.35;0.407357336990505
47;584.696;71.7473818616401;9355.434;1148.51549307095;5.362;0.945926001334144
48;584.331;66.0684194528671;9347.171;1055.8955135945;5.249;0.879061431300453
49;558.924;68.3611359180055;8943.703;1090.96417133699;5.873;0.848787959386792
50;591.236;50.3237989821915;9460.207;808.3521800187;5.535;0.865970553771886
51;603.701;33.7870950068199;9658.213;543.157966692016;5.161;0.600424016841432
52;574.009;68.6943408804537;9185.924;1096.70017550104;5.714;1.23273030302658
53;592.644;55.2653673108213;9481.297;884.127878895939;5.498;0.927941808520346
54;598.862;58.6090723011395;9583.457;940.237846909513;5.313;0.840191049702388
55;606.736;51.0406714689358;9707.985;815.521053967939;5.014;0.801625847886653
56;591.921;60.0208667798115;9466.818;960.673640772954;5.328;0.862505652155394
57;586.234;60.7595586224912;9382.449;968.779349309718;5.706;1.17044606881309
58;604.281;64.9642917994196;9668.786;1039.38601030799;5.434;1.38566373987342
59;613.484;56.0893186266333;9819.327;898.793270202318;5.094;0.807170366155744
60;635.353;46.2604587201627;10162.465;738.030423888469;4.783;0.702595900927416
61;649.143;15.7150558700853;10387.292;250.148254553127;4.474;0.320193691380711
62;606.654;90.9050831582037;9701.37;1455.48053157711;5.392;2.04050385934455
63;582.394;96.1037216969253;9319.802;1533.9146391361;5.929;2.31065120691116
64;603.184;78.6029176557719;9652.133;1258.29834480578;5.251;1.43910701478383
65;587.385;49.9916681558033;9395.377;800.416805346438;5.795;1.33911351273893
66;634.83;39.5575191335338;10159.895;632.684483629075;4.78;0.73464277033127
67;623.137;54.9457208615925;9974.172;876.747885230398;4.997;0.835440602317122
68;621.205;74.8591151764437;9937.581;1196.38780203952;5.203;1.9694468766636
69;600.02;79.8618051386263;9601.838;1281.0248366273;5.727;2.18162347805482
70;621.467;35.0736861621345;9940.29;555.902957772324;5.101;0.705073755007239
71;617.238;53.6894793791104;9875.127;858.303730937365;5.1;1.21961469325357
72;608.459;48.841441512306;9736.345;778.902203119903;5.223;0.968019111381583
73;619.665;47.7941214481451;9914.63;764.290696907907;4.971;0.937352121670398
74;627.261;43.9651467528528;10031.683;706.237714272597;4.828;0.662311105146213
75;623.635;51.3329350904469;9982.976;822.35697082473;4.906;0.800014999859373
76;627.311;45.7738306131351;10037.481;733.922344658452;4.865;0.591206393740795
77;601.421;67.9819997425777;9623.213;1085.26920827092;5.38;1.09548162923894
78;585.667;101.063329160481;9368.97;1620.20288335752;6.421;4.11888443634924
79;608.94;63.3199249841627;9741.531;1014.05037512393;5.037;0.951515107604704
80;600.649;62.9466369951564;9610.885;1004.7022299393;5.28;1.13566720477436
81;598.952;49.1410756496052;9588.622;787.488901455768;5.416;0.776237077187122
82;578.99;52.0952876947617;9260.049;835.227456103418;5.733;0.898120815926224
83;579.565;87.8521190694905;9275.004;1406.439164139;5.285;0.969435402695816
84;581.134;52.1755046357947;9296.962;827.742340427263;5.527;0.914833864698945
85;598.864;49.6874415119162;9581.512;798.247840295241;5.41;1.02516340160971
86;572.219;51.4531131128134;9153.51;820.297165117643;5.392;0.779882042362822
87;586.961;62.8613148844342;9391.089;1008.8729808499;5.623;1.25337983069778
88;590.524;64.7263635932065;9448.965;1039.43731152244;5.447;1.17949183973438
89;608.874;47.3700994721341;9743.185;757.035990680126;5.002;0.658434506993675
90;605.053;57.2453970289302;9680.336;915.787948972908;5.208;1.14851033952681
91;606.634;45.0902772668338;9705.24;720.191435703038;5.376;0.976976970045864
92;603.917;66.3335634577234;9665.368;1064.56473254379;5.418;1.40086972984643
93;591.923;63.6033640698348;9470.675;1018.14070300967;5.385;1.0324267528498
94;608.563;53.3262886482822;9733.991;852.992296441791;5.054;0.922726394983907
95;575.489;129.225508430031;9205.113;2066.15311175164;9.254;12.48537640602
96;610.329;58.8149789509446;9768.674;941.715635308227;5.177;0.865090168710749
97;621.385;34.9593879380062;9943.861;562.493358244335;4.886;0.598501461986513
98;620.101;40.5469075146286;9921.192;651.378769838271;4.982;0.595899320355374
99;637.492;14.9425813031097;10198.666;242.909084358681;4.638;0.434046080502986
100;637.364;17.2259758504398;10200.034;277.48619242044;4.675;0.377312867525079
101;638.524;11.7206707999169;10214.307;185.219178545335;4.7;0.354992957676653
102;606.685;52.1080819547209;9707.571;836.235033617347;5.121;0.829402797198079
103;634.343;24.2753611919566;10149.507;384.96704596755;4.856;0.506896439127367
104;616.937;53.5208499652224;9871.284;857.020219250407;5.058;0.896624782169221
105;607.267;66.4567724238844;9717.065;1066.40951362271;5.457;1.71700349446354
106;595.199;44.9960977085782;9522.098;717.939792765355;5.277;0.69195447827151
107;584.008;51.6449644786392;9339.929;826.198718765035;5.765;1.06051166895984
108;593.098;48.6258132682628;9490.766;781.294972020183;5.493;1.17031662382451
109;601.652;72.1130803391456;9630.507;1151.61590721948;5.155;0.984715695010501
110;618.312;53.4408590499795;9888.117;855.307453773778;4.99;0.820646086933947
111;620.904;34.0898745084228;9939.98;542.740138261404;5.021;0.4631295715024
112;610.775;61.6759084651373;9767.696;990.354991689342;5.269;1.10194782090623
113;591.152;62.5574457279059;9459.028;1001.62607213269;5.44;0.984113814556023
114;593.505;64.4682879018836;9498.088;1027.28264627414;5.496;0.974804595803691
115;587.154;84.9889769558381;9397.204;1361.12258890374;5.408;1.30792813258221
116;607.814;61.690209790532;9723.611;986.552117066806;5.195;0.978859029687119
117;599.837;77.6072141041022;9598.096;1245.32290456892;5.371;1.23590007686706
118;620.413;70.3683289626805;9924.405;1124.94641570387;5.254;1.79930097537905
119;617.446;48.1255703758411;9878.944;771.456016480522;4.805;0.713600028026896
120;617.071;67.1111034702901;9872.838;1072.27203673135;4.965;1.10588652220741
121;601.527;51.9903527685671;9626.03;832.314798811086;5.27;0.974648654644326
122;604.745;65.2215664102004;9673.499;1041.56481006656;5.131;0.893940154596496
123;575.252;84.5393980106315;9201.455;1352.70197072565;5.634;1.23389788880604
124;587.493;87.5762551208945;9401.399;1400.08331951672;5.503;1.3401496185128
125;584.822;75.6451337231955;9359.863;1211.1776880297;5.528;1.25185302651709
126;606.829;61.5007571416821;9711.128;981.119641682908;5.262;1.03696480171701
127;629.465;44.1137468936838;10071.058;706.184137400459;4.954;0.796909028685209
128;621.876;50.7120524530415;9950.028;812.864513136083;4.8;0.773873374655042
129;621.064;48.0837422004557;9938.655;771.293476988494;4.973;0.803928479405967
130;628.774;39.745815427537;10055.883;633.865954742013;4.798;0.757981530117983
131;632.126;47.4178648190742;10115.517;760.534322342529;5.036;0.91533818886792
132;612.903;58.4447487889205;9806.544;931.723302984308;5.076;0.889878643411567
133;604.417;62.7910501664059;9671.76;1002.76201573454;5.309;0.933567887194073
134;615.784;67.0300450842758;9850.662;1072.7981980671;5.107;1.08223888305679
135;648.417;23.4093819012796;10373.786;373.726506103049;4.55;0.673899102240092
136;649.808;8.19696992796863;10398.812;131.836662260479;4.569;0.241223962325468
137;629.76;47.586307694546;10075.759;767.428118268389;4.785;0.698917019395007
138;643.327;23.6812787028068;10297.027;376.83282051992;4.63;0.424994117606343
139;637.202;36.8881091410221;10189.225;593.342200677629;4.83;0.708209008697295
140;635.802;22.6625606673236;10176.713;360.867147799575;4.821;0.492045729582118
141;614.631;53.0119234606713;9828.193;845.881075353377;5.216;1.09385739472748
142;610.352;73.7099889838538;9771.856;1175.19273034002;5.483;1.59741697749836
143;612.561;52.4507853992684;9799.568;834.436261769601;5.14;0.849541052568981
144;634.498;38.9096260069415;10150.042;620.896559401027;4.891;1.11545013335424
145;632.728;49.9307954673263;10128.043;802.595351681643;4.804;0.846359261779538
146;654.249;17.0698204149898;10464.562;273.891484562793;4.462;0.345768708821373
147;626.3;43.9138930180422;10020.078;704.884280585137;5.013;0.774468204641094
148;620.702;44.9525478254565;9932.546;721.314766023835;5.169;0.831413856030795
149;632.927;56.4889775177425;10129.245;908.298332897824;5.099;1.21739434859868
150;588.026;88.5278151995174;9404.404;1410.97335371864;6.135;2.23157007508167
151;615.565;50.6105811565136;9849.646;812.863045798042;5.24;1.13846387733647
152;596.619;71.4679668732785;9544.884;1145.46983911581;5.633;1.36786731812701
153;629.409;47.7486721176615;10073.846;763.889108447012;4.852;0.759576197626008
154;619.168;53.637336212754;9904.997;864.516033339463;5.006;0.802884798710249
155;615.893;59.9773310593261;9854.792;955.605565458867;5.111;1.04974711240374
156;612.26;41.4437300444834;9795.746;660.052774711195;5.092;0.821995133805545
157;599.859;79.8015799906244;9600.34;1273.98014523774;5.518;1.73590783165466
158;530.612;108.460653676806;8489.617;1732.12014888719;6.977;2.65750277516318
159;550.759;76.6033010320042;8807.83;1228.18926675004;5.817;1.44682445376072
160;605.648;54.5613441549979;9692.752;870.014771263109;5.401;1.12300890468419
161;611.346;60.5881227964691;9783.505;965.853535669368;5.299;1.29806355776595
162;620.905;46.9987187591323;9933.875;756.232105867643;5.197;1.06406813691605
163;620.575;53.2855585032187;9930.179;857.200611997584;5.318;1.28581336126205
164;585.447;91.9919223682169;9364.251;1468.73602446763;5.179;1.01608513422843
165;624.291;60.408340558237;9988.656;974.147392782026;4.999;0.997120353818936
166;628.258;51.0401721783929;10052.231;812.414195302464;5.233;1.16735641515349
167;613.792;63.0062166456612;9818.868;1011.47780317513;5.242;1.05987546438249
168;645.851;29.2689311215853;10335.796;466.656929257454;4.735;0.63674563210124
169;642.904;18.5431007115881;10287.278;300.451530460396;4.712;0.642383063288561
170;628.673;36.0829863093392;10061.073;574.79475244734;4.833;0.500820327063511
171;648.623;41.8095163928037;10375.064;669.3226189395;4.506;0.651739211648337
172;629.849;53.9335345494818;10076.399;862.665060813886;4.947;1.0360120655668
173;638.644;46.9072041801675;10221.101;749.682562494983;4.645;0.798376477609401
174;617.111;68.1553449774841;9869.461;1091.8802592542;5.088;1.18274088455587
175;605.495;54.4785969441195;9690.137;871.554882070551;5.064;0.760541912060075
176;631.074;38.9696366932008;10095.784;621.260588870711;4.761;0.567599330514048
177;625.636;58.7618997650686;10007.968;941.247076158;4.952;1.17049391284193
178;628.462;53.6124809722514;10058.106;859.616412037362;4.928;1.01763254664933
179;629.593;54.9215336730497;10074.685;877.511056172531;1.945;2.25354942257764
180;665.831;72.1047006026637;10654.502;1153.54031298263;4.295;0.810114189481952
181;678.58;69.5011437315976;10852.915;1109.72517908941;4.118;0.789123564468833
182;694.423;65.9395853869284;11113.071;1058.6298070662;3.978;0.763960731975144
183;707.699;39.1821358402019;11321.406;626.378629204436;3.729;0.330951658101295
184;682.296;54.4313950216239;10920.754;867.909343908674;4.047;0.579690434628692
185;683.412;57.7614438531449;10931.319;928.523111628913;4.031;0.583874130271239
186;703.586;45.4958119391222;11258.452;728.94583067329;3.958;0.630552139002003
187;724.503;13.4240843635641;11591.049;210.579281195917;3.584;0.083330666623971
188;719.682;29.0731442400049;11516.089;459.97279537928;3.791;0.342854196415909
189;704.716;60.2773126806426;11273.46;963.384825456604;3.759;0.423023640001359
190;693.793;66.8619151759813;11103.79;1070.95573099918;3.822;0.581391434405422
191;674.01;70.9696013797457;10783.072;1135.45038451531;4.139;0.708173001462212
192;673.277;76.5282033044023;10773.918;1226.00556247352;3.995;0.672015624818353
193;652.609;114.957537504071;10438.85;1839.2081673318;5.945;5.26508167078157
194;729.058;12.7908864430937;11666.31;202.892017684273;3.537;0.122723265927842
195;711.579;39.5814096388711;11384.446;634.593002958589;3.743;0.34403633529033
196;663.568;141.654987473086;10617.395;2264.1510415838;6.874;9.16724844214446
197;685.074;64.3560448132131;10960.665;1032.96916479874;3.959;0.556335330533662
198;707.778;43.378393884513;11327.155;695.782679537956;3.924;0.648185158731673
199;723.229;31.3190984704209;11571.06;503.475535969765;3.625;0.329097250064462
200;730.176;6.59734522362967;11682.699;105.986776953745;3.555;0.0849999999999689
201;730.122;9.27117123129244;11680.627;146.561080103119;3.574;0.114908659377778
202;721.699;19.4056169445898;11548.275;309.699015957441;3.683;0.233368806827289
203;712.603;42.154754429364;11401.853;673.000158262214;3.782;0.673718041913678
204;708.603;25.1496918668972;11338.141;406.754077728829;3.874;0.504126968134017
205;725.793;15.4629868072149;11608.807;247.375006783183;3.599;0.114843371598018
206;711.6;30.0743325777963;11387.095;481.336108499079;3.872;0.598828857020105
207;725.082;19.5619456087542;11604.221;308.355603368931;3.687;0.388871444053172
208;718.809;18.2952958161383;11500.736;296.693763641905;3.67;0.24223955085823
209;727.88;12.4828850831842;11644.766;199.782304581702;3.553;0.0798811617341617
210;726.418;9.5184334845755;11623.757;151.386129816982;3.6;0.108351280564634
211;735.102;6.53738449228383;11763.609;106.819589724997;3.516;0.058514955353257
212;735.418;6.16830252177065;11761.177;98.2587385478986;3.541;0.0739526875779114
213;731.879;12.9583767887738;11708.862;202.440307735512;3.554;0.102975725294817
214;710.22;27.3113902978209;11363.306;436.118786552451;3.764;0.327145227689473
215;713.094;53.2250646218474;11413.899;853.772638732936;3.724;0.49936359498866
216;732.91;9.58844617235527;11723.672;148.802963397757;3.514;0.0873155198117511
217;728.291;17.5231386743388;11650.76;282.96753467481;3.61;0.207797978815976
218;706.906;49.1880744083349;11313.797;784.448809739072;3.81;0.482389883807691
219;702.774;52.1028529353224;11244.987;838.998698998428;3.82;0.569543676990622
220;685.333;56.2070081128688;10963.647;899.102863036836;4.084;0.698329435152203
221;716.79;33.7652818735481;11471.94;535.197351226657;3.76;0.4394314508544
222;691.991;67.7251113620346;11064.935;1080.44315521225;3.937;0.661393226454582
223;709.208;59.7490105022683;11351.336;960.844155430006;3.833;0.651736910110207
224;721.301;25.8577371206376;11542.709;411.603435492221;3.668;0.309767654864092
225;715.798;45.8732860824251;11453.945;737.207117087819;3.666;0.374304688722967
226;728.114;14.02104004702;11648.588;225.330403044099;3.582;0.143164241345385
227;724.484;23.2818994929562;11589.535;375.699119515861;3.693;0.457406821112232
228;729.408;9.99090266191407;11668.126;158.281073296854;3.539;0.0891571646027295
229;719.608;32.825853774123;11517.62;528.603699362773;3.709;0.557251289814569
230;715.191;39.9502999863585;11441.278;639.491995724729;3.648;0.311794804318486
231;724.782;22.9864528799001;11598.3;367.525890761509;3.603;0.203914197642045
232;705.396;39.0064866913165;11287.137;621.027765177232;3.831;0.493587884778381
233;700.004;54.9270225298989;11199.461;879.119436577849;3.853;0.559411297705003
234;712.087;46.7164048381302;11392.986;751.706739549388;3.83;0.666258208204595
235;711.225;41.9403603346454;11379.708;672.888358894695;3.972;0.827403166539744
236;723.162;17.2014381956887;11574.778;276.748779502208;3.644;0.326226914892074
237;698.334;51.2205219028453;11169.836;819.627492940569;4.23;1.05556619877675
238;727.196;26.7018715448942;11635.346;424.630502818574;3.612;0.35555027773861
239;697.607;50.1589856456461;11159.005;807.726797342375;4.111;0.794650237525921
240;709.599;50.4207442329057;11352.58;806.182561247763;3.761;0.538821862956579
241;723.282;42.7797577833253;11573.718;679.880360663578;3.663;0.423581161054169
242;711.586;46.6032690269682;11388.571;753.337471541824;3.81;0.73143694191639
243;725.928;22.9764012847924;11613.617;369.734081633011;3.674;0.363213435874833
244;717.776;29.3043864293365;11485.718;472.906591449155;3.784;0.483367355124438
245;682.337;60.408145485522;10916.554;969.761220901347;4.202;0.775626198629211
246;685.986;77.3126389667304;10971.9;1237.58033088766;4.256;1.35705711007312
247;727.488;19.5068017880937;11640.714;311.179791573861;3.628;0.187552659271998
248;721.59;27.3960785515012;11545.834;440.095545289949;3.766;0.514668825556783
249;725.417;20.1800406590279;11607.482;328.208301077183;3.599;0.253158053397486
250;707.527;51.4067703809526;11320.618;823.502201354685;3.833;0.668566376659789
251;685.762;59.143472640689;10973.294;942.350472618332;4.165;0.856775933368811
252;692.512;65.6328342828499;11079.197;1049.386056302;3.924;0.577809657240165
253;704.105;54.8770149060626;11270.686;880.586589566321;3.978;0.775626198629209
254;689.902;70.3627504863196;11035.418;1126.93561308353;3.997;0.63798197466699
255;686.006;83.1142614958455;10973.069;1325.9797681296;4.419;1.92403456309912
256;731.279;9.45946557687819;11706.182;153.461402951883;3.567;0.105740247777272
257;713.513;40.2522762213524;11410.293;645.17541275298;3.812;0.435426227965197
258;714.503;59.6034188700622;11430.646;956.664284910885;3.828;0.880418082503988
259;718.903;49.5344821412313;11509.643;788.788774591145;3.676;0.481688696151364
260;691.296;72.7741215268174;11057.807;1164.1179809886;4.106;1.00424299848194
261;694.657;54.1018679991744;11115.701;863.255218709377;3.988;0.727774690409054
262;701.244;67.8835956914479;11220.911;1087.25133685318;3.928;0.756013227397511
263;719.402;37.1834715431447;11506.221;596.281639251934;3.636;0.318910645792824
264;717.404;41.2811134055276;11479.272;658.799530643449;3.657;0.335083571665338
265;716.188;40.7224242402154;11462.495;653.542230819885;3.707;0.449222661939482
266;712.015;35.6418670246108;11390.205;569.548200124408;3.711;0.33930664597086
267;723.793;23.7627363954589;11580.485;377.450335839017;3.704;0.498240905586845
268;680.201;135.837391718923;10882.473;2180.04381277097;6.883;9.78692091518063
269;708.811;58.1834272710032;11339.894;925.726621203037;3.824;0.716061449877032
270;703.492;49.4388132543649;11257.591;794.985394097926;3.979;0.776188765700714
271;725.397;40.9804565738348;11606.861;654.109350146422;3.596;0.298904667076308
272;710.299;42.144757313337;11362.482;672.294753196838;3.73;0.43609631963593
273;706.814;50.7903735367227;11308.324;812.531089979955;3.867;0.667608418161427
274;710.585;33.6082267458415;11372.384;538.02419914347;3.683;0.228868958139795
275;698.703;50.598505126141;11176.838;811.923761024408;3.907;0.546187696675787
276;702.304;48.3929123322818;11235.562;781.599633889348;3.872;0.53461762036057
277;707.085;33.8003290664438;11315.284;537.148679570242;3.753;0.268479049461963
278;710.814;42.5195357923864;11371.283;678.104209823943;3.806;0.504305462988459
279;720.894;46.7141323798269;11535.814;750.446583098357;3.667;0.575239949933936
280;712.233;37.6619983670539;11397.817;602.184337110347;3.726;0.347942523989234
281;715.358;39.5901853494006;11444.017;634.883258371966;3.691;0.35415956855632
282;708.358;61.8561851070695;11334.528;988.196209351141;3.781;0.637533528530065
283;716.268;41.4847600451044;11458.702;665.121089183032;3.74;0.584054791950207
284;720.892;26.098830165351;11537.387;421.390162772027;3.603;0.199602104197319
285;728.401;10.4368409492454;11654.829;165.397994875963;3.503;0.124020159651558
286;682.001;134.537460021364;10909.701;2151.711666239;6.616;9.03517703202322
287;732.144;13.517864624267;11714.23;215.470922121728;3.555;0.149415527974823
288;704.439;48.3643727241431;11275.72;774.902011250425;3.82;0.567996478862326
289;700.479;50.1537367401469;11205.193;800.148814347056;3.967;0.57680239250544
290;700.219;64.2192320804288;11199.892;1034.32597462117;3.964;0.670778652015697
291;710.096;32.4204750736345;11362.435;517.435173239144;3.819;0.561434769140635
292;725.66;11.2490399590323;11608.925;175.689410110724;3.607;0.128378347083925
293;737.258;11.7327147753553;11795.243;179.770214665795;3.477;0.0796303962064455
294;740.19;9.60577014091491;11844.248;157.819932948779;3.464;0.095310020459549
295;705.497;64.9283341923994;11290.952;1039.45865872384;3.806;0.63364343285479
296;710.717;52.0565385038223;11366.473;830.470178875192;3.81;0.607552466870148
297;728.984;14.9093850979801;11668.743;236.984211585991;3.61;0.20961870145576
298;736.014;5.65790279165056;11771.714;89.2130504130439;3.504;0.0731026675299823
299;731.83;14.0620297254716;11713.671;219.994299764913;3.517;0.121741529479451
300;729.465;8.89351926966495;11670.643;139.826838915302;3.573;0.0911098238391613
301;724.213;20.4188026338499;11588.415;327.417301902337;3.703;0.415404622025319
302;724.496;40.8787847666711;11589.021;658.187016879675;3.649;0.411933247019468
303;736.692;7.20540602602085;11785.769;114.632847251749;3.511;0.115451288429366
304;731.396;15.7563410727218;11704.627;251.755515691255;3.571;0.20786774641583
305;725.205;18.9343889523768;11601.855;297.913592145495;3.654;0.274634302300347
306;726.974;19.459455388065;11633.588;310.038510440192;3.668;0.418922427186699
307;732.94;13.6403409048373;11723.207;213.411040251072;3.511;0.120619235613557
308;718.193;36.0926602095216;11496.585;572.732859320086;3.844;0.697656075727861
309;726.697;10.1621946940512;11626.161;165.759852645329;3.581;0.160464949443783
310;722.108;42.7046266345936;11554.422;682.116408918592;3.56;0.265480696096728
311;720.203;45.225932837255;11519.946;725.577146114727;3.715;0.459309264004115
312;729.575;18.5376175653713;11676.492;289.047105081428;3.697;0.424712844166501
313;725.618;16.4168923977748;11605.615;259.01123393591;3.681;0.321976707232061
314;728.474;11.7181544622006;11654.626;185.326699760134;3.57;0.166072273423341
315;733.725;8.70521941136806;11741.998;136.751615625022;3.509;0.0684762732630601
316;732.793;10.3579969588838;11726.494;163.176324520595;3.583;0.182211415668713
317;728.085;11.3241884919002;11645.657;183.374162959052;3.563;0.135576546644314
318;730.613;9.28950703751595;11694.093;149.356360028534;3.554;0.0950999474237467
319;711.291;35.7531378902633;11382.768;573.414713393389;3.892;0.594488015017964
320;725.038;20.0644784631924;11599.228;323.686446728901;3.671;0.2617804423558
321;710.764;50.3035671100964;11366.528;804.21006506761;3.812;0.503006958202368
322;724.291;11.0789868219086;11593.87;176.894766231321;3.559;0.0662495283001923
323;718.7;20.7219598493932;11500.578;331.203542004012;3.739;0.267673308344334
324;728.205;8.53126163004135;11647.614;133.923516545946;3.579;0.0995439601382243
325;721.485;29.6193890045019;11544.862;472.679045522403;3.624;0.256405928168595
326;712.292;58.1457934506004;11398.458;934.49556266255;3.677;0.340030880950543
327;714.94;42.4799809321958;11435.949;682.053399836794;3.799;0.57044631649262
328;693.811;61.0162182456446;11101.456;975.51256447262;3.879;0.543423407666617
329;707.579;51.8752043754992;11321.653;827.844936676547;3.766;0.446053808413292
330;694.615;58.5740839023535;11113.371;936.39949447285;3.922;0.647484362745544
331;703.093;57.5061577659289;11251.816;919.507156874809;3.884;0.583698552336734
332;708.793;47.3905201596275;11340.388;759.350256190135;3.835;0.634999999999995
333;730.421;24.2704851414252;11687.04;389.866191942892;3.679;0.635443939305429
334;708.132;35.784504411828;11330.202;567.964574085374;3.893;0.545381517838664
335;711.985;52.486614722231;11388.441;839.415591973969;3.847;0.63672678599223
336;702.442;61.4303856084261;11239.066;980.590712460585;3.828;0.505169278559174
337;726.972;10.1071853648839;11632.261;160.278559043178;3.553;0.075239617223918
338;735.277;13.7968648975068;11762.052;225.413236470435;3.534;0.107536040470152
339;727.095;26.4542855696387;11637.615;421.20428911039;3.675;0.548201605251207
340;723.161;36.4043721137976;11571.283;586.194676571705;3.75;0.684397545290746
341;727.543;16.1054463148387;11639.595;259.78528873861;3.595;0.170425936993165
342;722.876;15.505016736525;11566.812;244.15313042429;3.676;0.327572892651379
343;726.812;14.9138082326452;11626.474;239.046211398654;3.622;0.177076254760486
344;733.122;17.2346939630573;11730.648;272.211342886305;3.528;0.125682138746912
345;709.9;50.9131051891364;11357.494;814.235543294451;3.83;0.587588291238003
346;730.886;23.6354852710875;11697.877;375.606910826973;3.607;0.243189226735064
347;732.604;11.8971435227151;11719.19;187.331702762811;3.521;0.106343782140723
348;731.502;8.78241971212048;11707.627;138.596533004984;3.586;0.137054733592101
349;723.397;17.5381002677;11573.054;279.558260410945;3.567;0.102279030108821
350;732.484;13.4905242300028;11717.563;217.991466028037;3.509;0.101730034896269
351;737.193;12.2500726936499;11791.975;194.998179029863;3.502;0.096104110213888
352;727.622;8.65877797381785;11646.068;136.789217031101;3.574;0.128078101172675
353;737.001;13.9572851586561;11791.405;229.232416653896;3.524;0.161009316500607
354;731.102;13.9652732160861;11697.268;219.671654147802;3.542;0.117541482039307
355;741.383;9.79832031524457;11863.731;157.252804645868;3.483;0.0875271386485492
356;721.587;33.0087306784168;11543.391;522.518534531564;3.786;0.642949453689788
357;716.229;51.3176672209475;11459.565;824.809242967721;3.963;1.2935768241585
358;728.981;22.1460255802263;11665.123;349.795685309268;3.664;0.487610500297111
359;730.753;14.7867968471932;11688.942;236.847943660114;1.868;1.25281922079764
360;650.575;36.290952935958;10413.504;581.730466267692;4.941;0.826104714912096
361;639.876;44.2204643123508;10237.522;707.34768567939;4.92;0.787540475150325
362;627.244;48.685664666304;10037.077;781.292762542299;4.954;0.817926647077838
363;608.156;58.6073367762088;9728.291;936.532888460931;5.276;0.937360122898344
364;606.357;58.5708574378069;9702.922;937.248076101512;5.271;1.02898445080574
365;608.632;73.1172854802473;9735.122;1171.13191369547;5.13;1.18459275702665
366;605.172;76.5095476133542;9686.677;1223.67773160298;5.365;1.25182466823434
367;617.433;60.3401645755132;9879.512;964.646668058326;4.836;0.752093079345903
368;616.302;83.9457904602735;9852.854;1342.94383489556;4.902;1.14756960573205
369;596.318;107.809469973653;9548.082;1728.82824318554;6.458;4.64041118867714
370;627.42;50.8314670258481;10037.224;815.778563584531;4.911;0.72970473480717
371;609.376;73.4593851321943;9747.728;1174.64976696716;5.25;1.30851060370178
372;646.197;39.6826735616445;10342.172;629.974458875904;4.7;0.762666375291319
373;620.428;51.1561081005971;9927.857;820.734031730743;5.118;0.957452870902791
374;621.557;84.6000743557591;9944.077;1351.29558390494;5.001;1.50601759617874
375;636.75;72.9743815321515;10186.195;1165.6923787625;5.883;4.48805314139661
376;657.937;19.9335822420296;10528.784;317.123919160985;4.621;0.651911803850794
377;643.693;58.5714070259544;10298.806;934.216234767933;4.653;0.932363126684015
378;619.886;66.1706190389669;9917.751;1060.36364868331;5.105;1.04628151087554
379;647.021;20.9146988742371;10351.446;334.631515766238;4.757;0.44382541612665
380;652.503;30.2609015232539;10441.842;480.545339958655;4.423;0.530943499818956
381;647.047;56.7877733407479;10348.442;907.123898602628;4.602;0.835928226584076
382;660.131;19.6355272147209;10568.101;315.985312457751;4.518;0.659845436447055
383;661.153;9.20003157603671;10572.849;146.958759687775;4.267;0.241993801573506
384;644.195;51.5795626677867;10310.728;827.875409416194;4.621;0.907991740050537
385;654.354;11.9790944565902;10469.167;192.475741279334;4.464;0.373796736208327
386;639.65;65.6829166526577;10230.99;1050.70916250885;4.746;1.2777808888851
387;662.799;19.7900174077751;10608.968;320.988950302048;4.378;0.482385737765955
388;640.766;54.4730025241878;10252.462;869.475602036065;4.715;0.934272444204577
389;614.861;57.0815519147812;9833.674;913.856396948654;5.275;0.962873304230626
390;644.42;30.7389056408993;10311.106;489.36751776553;4.754;0.708042371613456
391;652.249;32.3822353922632;10436.495;520.758629582868;4.609;0.707381792245179
392;607.261;117.642880995834;9720.06;1880.28286520406;6.859;6.6220653122723
393;644.1;17.7864487742755;10303.128;286.141619300687;4.749;0.524660842830862
394;642.569;50.8447099411528;10283.782;813.896489042687;4.679;0.916236323226708
395;633.768;55.0095771298035;10135.317;877.130580222242;4.713;0.833403263732508
396;644.372;39.5641594881012;10313.426;630.666513415749;4.656;0.605511354146224
397;636.156;37.5569850227634;10173.119;596.746782571131;4.863;0.544977981206575
398;613.059;48.3903160663375;9813.345;779.794435800219;5.235;0.85377104659271
399;619.479;72.566733762792;9908.455;1158.77378061684;5.005;1.05224759443773
400;613.717;71.6294605661673;9822.178;1148.23569444431;5.09;1.0822938602801
401;638.165;47.1653983869517;10212.855;755.309903274793;4.812;0.836155487932716
402;622.796;69.0914931377228;9963.014;1102.43984480063;5.039;1.17691503516609
403;651.142;21.3413724019835;10417.257;344.580791514857;4.752;0.541106274219768
404;667.781;12.4732341034586;10686.182;202.027076789204;4.263;0.296649624978698
405;630.82;55.2825066363674;10094.007;885.815151406305;5.072;1.1161433599677
406;633.67;49.7858501986276;10139.738;798.690082620268;5.053;0.720805799088767
407;631.44;43.2369346739584;10101.63;693.207335203529;4.958;0.965565119502556
408;641.972;46.1170957021369;10272.547;738.845682264564;4.839;0.780774615366043
409;618.569;57.2552106711696;9892.602;916.000794626306;5.068;0.962068604622354
410;621.922;56.3843630450848;9953.147;898.48259215245;5.141;0.996036645912186
411;621.01;64.3454531416165;9934.778;1030.49539718331;5.184;1.31150447959586
412;606.023;67.7106886761609;9697.262;1080.05480223735;5.443;0.965650557914193
413;619.754;58.1975073693035;9914.878;937.88765459194;5.005;0.723481167688561
414;618.846;64.1910793179248;9903.606;1025.09132806986;5.157;1.12276489079415
415;612.188;67.3478091403128;9793.598;1078.44665420036;5.154;1.26243574093892
416;606.519;72.2359135679767;9706.811;1152.08553262724;5.296;1.09852810614931
417;623.075;51.3590319710167;9967.695;822.220500574524;5.116;1.03280395041847
418;629.912;70.918786904458;10078.312;1130.25046805388;4.871;1.05838036640897
419;615.104;61.6691827738942;9842.689;989.159528564019;5.085;0.836866178071506
420;636.2;50.1877586668329;10182.01;800.9375225197;4.802;0.853074439893723
421;643.381;24.2987322508787;10291.703;387.426762757851;4.752;0.703786899565483
422;623.799;57.8884491846174;9981.005;925.59121640443;5.236;1.40724695771566
423;615.974;50.8194923626741;9856.795;813.14448212175;5.121;1.03460572200235
424;619.373;57.7629166593941;9905.877;921.633139584824;5.158;1.14581673927378
425;645.612;27.1686211648672;10334.103;431.973316954854;4.728;0.859893016601485
426;631.241;52.3911081100595;10096.582;836.594979088454;5.035;0.889407105885709
427;625.797;61.8216551137233;10011.436;990.767500316793;5.018;0.990311062242574
428;606.787;87.2182552049735;9710.007;1396.20696069781;5.573;2.3824191486806
429;619.402;89.6035878522728;9913.405;1434.93291025922;5.308;2.4707318753762
430;640.095;27.9581019563216;10240.003;443.422131992722;4.669;0.38949839537539
431;625.373;59.1430447390062;10005.949;950.207072352655;4.978;1.19876436383469
432;649.978;47.3715631576598;10396.946;754.454705322979;4.548;0.711404245137746
433;599.039;76.0094656539566;9586.33;1219.89071119507;5.562;1.05312677299555
434;611.668;57.2440171196969;9784.883;916.216848284851;5.079;1.03907121988822
435;624.591;51.9168784597063;9997.542;832.856462396727;4.948;0.872018348430807
436;633.384;40.972861799;10130.256;656.071964333177;4.905;0.788736331101851
437;630.621;44.020769972819;10089.724;702.413707428885;5.035;1.16794905710823
438;598.225;76.9933381858457;9573.895;1231.85118014516;5.318;1.13607042035254
439;651.853;21.3395735899279;10430.162;342.385513998495;4.64;0.44108956006689
440;629.496;44.3315407356881;10068.715;710.604191026891;5.13;1.23925784242021
441;649.633;44.6098265071719;10395.352;708.421868490819;4.6;0.734370478709489
442;656.558;23.1378883219712;10506.535;374.213259552655;4.358;0.504555249700162
443;637.381;36.5617922016979;10198.605;588.307189047471;4.782;0.687427087042692
444;635.118;57.9713273610331;10159.763;920.391634643096;4.756;0.72001666647377
445;618.044;74.8264345268434;9891.001;1200.58688972894;5.039;0.995614885384908
446;636.661;33.2020913347321;10183.279;528.579322778529;4.859;0.719742314998913
447;623.75;52.4270155549597;9984.5;835.153025139702;4.977;0.818242629053265
448;603.061;68.7479700718505;9646.081;1099.25119972143;5.497;1.01699606685572
449;589.41;62.1805527476249;9429.474;997.895311785763;5.762;1.34297282176521
450;625.962;67.132141601473;10016.982;1068.46338423738;4.879;1.08584022765782
451;632.548;32.2613005937445;10124.045;516.769469749295;5.052;0.635858474819674
452;626.263;66.3199395430964;10017.304;1060.60159447551;4.831;0.737813662112598
453;632.049;62.908426375168;10113.479;1003.13623193912;4.738;0.986973150597317
454;644.19;41.1899220683887;10305.964;655.303871271919;4.87;0.852596035646423
455;643.375;36.1031794306264;10292.6;571.756653043952;4.693;0.56042929973369
456;632.356;52.3759406979963;10119.876;834.293778008701;5.064;0.815060733933368
457;596.366;132.468394736254;9539.947;2121.52518637441;8.865;11.5269738006122
458;637.494;42.6563278306978;10200.812;685.298424086891;4.813;0.656232428336179
459;641.81;44.8889291473979;10271.265;718.400850378795;4.731;0.897334385833955
460;622.635;61.9868431604648;9961.267;988.577858734966;5.072;1.01647233115319
461;636.469;33.0626821204809;10181.865;524.178421880364;4.796;0.686734300876248
462;621.46;52.4390331718667;9944.657;844.83872298862;5.121;0.922230448423817
463;623.958;47.3981355751476;9981.245;757.159359715658;4.912;0.952310873612181
464;606.095;73.4007714196513;9699.715;1179.15564172207;5.325;1.12823977947952
465;634.351;46.7844210074248;10148.527;743.621945857571;4.919;0.75721133113551
466;644.89;57.7612821879852;10319.94;926.198888295618;4.75;1.12166840019678
467;609.069;55.7168210597115;9743.915;896.356949582629;5.125;0.607046126748206
468;597.449;76.1019804538625;9557.795;1218.01108279233;5.502;1.39825462631096
469;628.201;56.1958755515026;10053.315;902.474694850247;4.805;1.09581248395882
470;639.26;19.2469524860441;10228.873;307.735139756609;4.742;0.622218611100639
471;624.643;73.9484010712873;9991.897;1184.90426429353;4.974;1.1401684086134
472;623.813;64.44697836982;9982.412;1030.21841554886;4.934;0.970682234307397
473;612.27;66.4241344693316;9795.408;1062.34015154093;5.297;1.35346998489069
474;621.14;51.4426902484693;9937.036;823.999480572646;4.927;0.845092302651022
475;612.301;82.7452491022898;9799.816;1323.09797688756;5.222;1.3026419308467
476;603.553;52.4892610064174;9656.735;840.479840689237;5.354;0.772207226073409
477;618.569;52.919121770869;9895.407;845.312150345076;4.801;0.691584412779811
478;608.164;62.5169906825325;9725.436;1004.00804885419;5.372;1.0664033008201
479;593.949;64.8519570175018;9508.361;1036.16851369311;5.422;0.996873111283474
480;616.523;78.3546703202821;9863.856;1254.75105526317;5.22;1.25723506155372
481;595.977;85.8258301503692;9539.906;1371.85385135736;5.462;1.34437941073195
482;611.171;63.0050528846705;9777.212;1008.82242826775;4.961;1.02865397486229
483;625.185;54.7274973390881;9996.938;879.393902228122;4.945;0.774535344577633
484;613.672;78.5046456969277;9824.358;1259.06377715188;5.03;1.09873563699372
485;635.804;49.7171811751234;10171.275;794.230302824704;4.902;0.792714324331285
486;612.644;66.5221125942342;9801.605;1064.36019312308;5.306;1.27210219715241
487;615.163;76.9539879473441;9844.205;1231.59572989884;5.297;1.45186810695738
488;628.544;60.1093370783611;10053.912;956.69962151973;4.96;0.971853898484747
489;659.624;30.2630061956829;10551.571;484.18778395269;4.564;0.880036362885079
490;639.337;54.9418334331873;10229.307;875.620777803388;4.622;0.929524609679587
491;651.086;23.7302297502556;10421.368;381.078606793974;4.582;0.601345158789854
492;655.702;24.1264037104607;10490.123;383.297779984444;4.548;0.644434635940684
493;633.279;47.412626050454;10131.339;759.733064180445;4.983;1.03097090162623
494;631.811;75.0883068726408;10115.095;1200.68062488115;4.749;1.20862276993279
495;631.649;57.4419594808541;10102.677;922.563207049262;4.881;0.959275247257006
496;649.106;21.1489537329861;10383.476;341.533373602014;4.747;0.605195009893507
497;636.817;41.5147205338072;10191.958;660.914130773425;4.838;0.830467338310182
498;604.776;81.3630206174775;9679.419;1302.24004490302;5.357;1.6406830894478
499;657.895;21.0433662943934;10524.242;334.065539192599;4.377;0.37884165557657
500;633.768;51.7717432196363;10137.878;826.927958927496;4.8;0.851034664393878
501;640.046;33.4063725058571;10243.337;532.59032105458;4.73;0.5851837318313
502;643.114;30.3046139061401;10287.308;482.328047241677;4.599;0.438530500649606
503;644.289;44.6816889676295;10306.935;715.256459897395;4.576;0.700531226998482
504;629.298;54.6110365768669;10068.448;874.245781949214;5.115;0.833333666666597
505;617.241;51.9171180729452;9880.527;832.082193933401;5.21;0.824463461895071
506;615.466;57.4001099650513;9844.048;914.906896638117;5.148;0.953381350772077
507;646.596;39.2282230543276;10348.238;632.059239546418;4.641;0.660052270657408
508;621.358;46.1388902770766;9940.913;739.294900402396;4.957;0.976770699806254
509;608.585;76.9468691045971;9734.785;1223.58211945296;5.582;2.00976516041054
510;634.26;55.7616470344976;10151.662;898.379224479284;5.118;1.61032791691631
511;618.741;71.7789940651156;9899.455;1151.53464587263;5.17;1.31568233248
512;648.762;37.0261979684649;10381.607;593.790728625002;4.627;0.619436033824318
513;632.999;74.8873725603989;10125.885;1195.24565315462;4.868;1.3494576688433
514;633.117;57.4813604658068;10130.944;921.233400134848;4.712;0.822408657541976
515;619.127;68.9455408347773;9903.01;1102.32339884447;4.954;1.06248011746103
516;623.763;55.494313771773;9983.905;889.895520049958;4.942;0.883468165810173
517;618.093;46.4524845514195;9888.592;744.793661597642;5.417;1.14516418036891
518;623.615;62.787875143215;9975.972;1006.96181978067;4.937;1.22098361987375
519;611.657;91.0707985086331;9786.83;1454.20777340791;5.649;2.51925961345789
520;633.272;60.925020279029;10133.662;971.249130509775;4.999;1.36502344302214
521;622.384;77.7232432673776;9954.845;1249.49733658979;5.322;2.36443143271274
522;608.698;82.8023968010583;9741.071;1319.99546123046;5.576;1.80124512490666
523;627.708;49.0403011410014;10043.739;784.97115272413;5.33;1.34050736663399
524;629.331;73.1997185035578;10067.487;1171.41845628321;5.158;1.60389401146086
525;649.066;42.0488647171356;10386.678;669.854928768932;4.529;0.821625827247414
526;662.729;17.156160089023;10602.784;273.201575954498;4.301;0.412224453423132
527;648.623;36.8132468141579;10381.684;583.527059478835;4.634;0.647999999999996
528;637.794;47.8426533963152;10200.994;765.866091757526;4.942;0.762401469043703
529;624.311;69.6830740495864;9989.703;1111.98869052747;4.959;1.15040384213544
530;626.415;61.2988352662599;10021.531;984.24607180775;4.898;0.910799648660449
531;650.097;39.1181101409558;10403.249;622.791892857462;4.526;0.538204422129735
532;625.961;64.2772185848145;10012.781;1026.42598195342;5.031;1.00134359737305
533;616.287;53.9551096838842;9861.195;861.528603230895;5.204;0.919926083987187
534;598.783;75.3173689197917;9586.293;1205.58067972285;5.334;1.00874377321497
535;602.938;55.2036505676946;9640.189;889.106118013472;5.553;0.957768761236243
536;616.662;69.4663447721268;9871.4;1109.46738267515;4.775;0.794446348094065
537;625.205;53.7917458816869;10002.39;857.247356776318;4.841;0.850028823040721
538;620.513;66.5834459982361;9926.617;1066.29020037747;4.908;1.03884358784179
539;615.748;77.8499596403239;9854.273;1251.20658407834;1.847;1.93453896316409
540;203.863;12.3410364637657;3246.067;200.844214706324;7.311;3.48630018787826
541;195.759;12.3636826633492;3133.962;199.046075058015;6.893;2.72473136290534
542;193.101;7.24292958684498;3091.915;126.093595892097;6.511;1.5286690289268
543;190.756;7.73887356144269;3047.903;124.063406534713;7.905;2.88297849454345
544;192.731;15.3257100651159;3086.595;242.427022761493;6.951;2.15502877010958
545;193.211;14.1239070019598;3093.101;220.046345638827;8.844;3.05242264439249
546;194.289;12.8573266661462;3104.812;206.717088930743;8.311;2.71598030184315
547;200.809;16.922175657994;3213.32;274.318288599206;6.811;2.90646675535778
548;187.805;13.6005898769135;3004.274;212.274036905131;7.886;2.1644269449441
549;195.8;14.1453200741445;3138.188;231.576876945858;8.056;3.09916827552168
550;194.894;11.2579307157223;3110.111;173.431417940932;6.275;1.63898291632341
551;188.301;16.4806410372898;3015.417;262.780795418918;7.457;2.41022426342447
552;186.3;24.7677637262634;2978.9;400.910307026394;26.686;60.3849781319825
553;194.501;12.5249794011807;3114.319;200.597429766689;7.213;1.80865723673669
554;194.588;10.7743164980428;3117.421;176.609097129793;7.692;2.60848538427954
555;196.009;14.2217329816027;3133.067;224.868415881378;7.209;2.7624280986118
556;179.906;23.0332651615007;2882.584;378.703573423858;13.835;22.0838213405199
557;191.701;13.7985734407584;3062.498;218.084653141845;6.202;1.20438199920125
558;192.191;15.8142995102533;3078.864;252.110760230496;6.254;1.32530902056841
559;200.009;14.6016659665941;3195.034;234.83887302574;6.715;1.83373525897279
560;200.097;14.356971860389;3204.283;232.267775984954;6.472;1.12122968209015
561;191.507;14.7843715118365;3064.426;240.558584182726;7.564;2.15819924937435
562;194.093;4.50068228160917;3107.986;71.1896114893267;6.995;1.985120903119
563;191.299;10.2712593677698;3054.778;168.061928454966;8.107;3.58378584739658
564;198.897;13.7592020480841;3184.178;217.935423637373;6.776;1.82752947992638
565;196.599;8.84416694776849;3142.259;142.955316826617;11.058;10.7909293390329
566;196.103;12.4834122338408;3146.24;203.524420647739;7.408;2.15391643291934
567;195.804;13.4222883294914;3130.144;205.174454608756;8.586;2.72083149055578
568;193.502;15.9621494793149;3089.323;259.513162057339;8.933;2.65628707032956
569;189.398;11.1496042979114;3029.762;178.524067777996;7.215;2.06428316855997
570;193.502;10.0207832029231;3104.241;154.141430670017;7.429;2.23901965154395
571;202.395;11.9303137008206;3233.513;190.637228003872;6.811;1.69665229201507
572;191.107;9.03054488942938;3060.704;147.399644924948;6.871;2.55368537607905
573;198.892;12.6109664974574;3180.678;196.352703663587;7.488;2.4691447912182
574;194.204;11.2885120365793;3106.285;182.189141567214;7.314;2.86051114313509
575;199.3;15.5284918778353;3187.889;247.445590724506;8.794;2.47214158170603
576;195.597;17.1033230981584;3131.453;270.016317471737;8.214;3.03778603591498
577;193.004;16.7945254175281;3088.354;268.985824689703;6.81;1.67613841910506
578;194.691;16.4425961757866;3116.658;265.610486457141;7.258;1.77300197405417
579;193.7;11.3861442112772;3100.296;181.260092419704;8.258;2.56898345654463
580;196.805;10.3601276536539;3146.604;169.417435360117;7.006;1.45809601878614
581;195.998;7.04145553135185;3138.475;118.276580712345;6.748;1.6288879642259
582;192.603;12.1391309820762;3074.639;193.438642078049;7.638;2.67891321248002
583;195.083;5.76017716741442;3126.122;97.7613921545832;6.982;2.13131321020633
584;194.317;14.9412951580508;3108.378;243.833800478937;7.777;4.26838154339558
585;186.359;12.8362630465416;2985.67;208.298255201534;7.193;2.10289823814658
586;191.149;15.4183607753873;3051.577;247.77953620306;6.701;1.73850194132765
587;194.396;13.1167604232139;3111.63;212.456958982283;8.574;3.10081021670144
588;193.503;12.3581285395486;3096.071;201.629104518677;7.833;1.94992846022617
589;190.001;7.23396080995695;3046.22;109.029725854923;8.289;1.45748722121327
590;191.781;13.5799966494841;3064.315;213.343692770606;7.474;1.30400306748106
591;198.818;10.5122326838778;3187.195;165.184552198438;9.071;4.0667491931517
592;193.201;11.8617759631516;3084.489;196.350817795595;8.769;4.45438761223134
593;200.701;16.0458333844023;3208.509;255.260414653352;7.007;1.89496728203946
594;190.697;12.9000992631842;3050.929;207.696054196988;7.323;1.77971935989919
595;201.698;14.4852040372233;3228.046;228.800982742641;7.444;1.37001605830004
596;187.205;7.6880533947165;3000.885;121.572660269477;7.818;2.14855207058149
597;192.983;13.8116914604984;3086.837;220.858923073081;9.329;6.10055972841837
598;199.361;8.38162329146367;3191.269;134.47050423419;7.118;1.76811651199801
599;194.751;11.597811388361;3111.31;186.564972918282;9.618;7.39780345778394
600;199.002;16.430098478098;3190.02;264.82283402305;7.407;2.67269919744067
601;187.778;12.3912128542771;3001.151;202.666207664229;7.578;2.9049743544479
602;197.229;12.7718389044022;3156.247;204.046630506352;7.953;2.60121913725084
603;196.1;12.203443776246;3133.787;199.428196805253;7.691;2.19975657744215
604;191.773;12.861020993685;3069.75;204.872995048156;7.741;3.06426320671055
605;193.036;6.74950842654498;3091.104;107.73176116633;7.148;1.65141636179372
606;190.272;15.7539308110708;3038.963;247.798022229801;7.528;3.05310923486206
607;193.528;11.9802335536498;3097.635;194.40686897588;9.018;4.38738373065316
608;190.495;14.8453718377143;3047.111;229.555387366533;8.188;2.86944175755494
609;196.606;16.2974514572064;3150.693;259.511073407284;7.414;3.39105057467446
610;189.696;13.3697308873438;3036.655;205.762922279498;9.119;2.32275461467629
611;193.393;14.5473166254124;3090.294;236.974176913867;9.501;4.424415102587
612;193.308;11.9680481282457;3093.123;197.804878506571;7.024;2.86261139521242
613;202.6;9.73067726317133;3239.786;155.27053037843;7.733;2.33100429000034
614;192.814;11.4925499346309;3088.412;186.127238243095;6.738;1.40765620802809
615;196.7;15.9094889924225;3149.581;254.748401033243;9.27;8.82767579830615
616;187.686;14.5065655480544;2999.872;235.843100123791;7.57;2.56052728944646
617;194.601;16.0128351331047;3110.929;254.876781737755;7.404;2.11843904797849
618;191.898;14.8644446919485;3074.659;239.660595027631;7.241;1.74616980846652
619;189.298;10.7461321413801;3025.478;174.546149530726;6.678;1.75473530767464
620;184.889;20.6189036808459;2961.647;329.359548853529;8.9;7.05697668977304
621;197.613;11.7770939114876;3158.103;184.818363538364;8.116;2.49406976646604
622;195.501;12.984957027268;3134.71;206.116777434542;7.542;2.98317548930666
623;200.198;8.52835716888045;3197.063;136.758208093688;9.102;4.82411193899976
624;186.132;11.6049220591951;2974.308;181.663227308113;7.407;2.13540183572086
625;193.185;10.9028053729306;3097.675;169.631044697012;7.901;2.32016141679841
626;198.309;9.0944691433862;3166.94;141.8681518171;8.617;2.98475141343462
627;195.283;16.0487912628958;3130.346;259.010701910171;6.636;1.49699164994331
628;190.116;9.56810451447987;3039.141;158.091187259123;7.733;2.99445170273291
629;195.399;11.362697259014;3127.474;183.840359507909;7.22;2.46714815120617
630;192.998;10.4362970444503;3087.472;164.518382243436;7.235;1.85868905414542
631;194.203;10.9172103121631;3107.069;176.12639310735;6.952;1.32786896943938
632;183.599;24.4585209896264;2937.172;391.059397682759;25.535;57.1279909063849
633;193.398;17.7134326430537;3096.171;287.143367551814;6.202;1.43106114474539
634;195.103;15.6337954764668;3118.808;246.710893144178;8.064;1.8439750540612
635;193.303;15.9333788318738;3093.128;252.601011510247;8.687;2.72519375457966
636;197.301;13.959996024355;3157.127;222.387368438494;7.673;1.64088421285599
637;197.398;20.2739191080561;3153.959;326.297603100298;8.481;3.94222132813468
638;194.306;15.4223371769652;3113.387;247.195381431363;7.649;2.048591955466
639;193.1;15.7809397692279;3091.01;248.045806777704;6.735;1.77694259896036
640;192.174;11.5981715800377;3071.887;186.911950931451;6.239;0.907540081759484
641;189.223;16.1636883476513;3029.567;260.607742212313;6.962;2.0117743412222
642;191.49;8.97967705432649;3068.959;145.759543663539;6.324;1.55962303137649
643;194.497;12.3292660365494;3107.538;201.861914922054;8.403;2.99594742944531
644;192.709;18.7969595679728;3081.657;302.586165779268;7.915;2.07573240086481
645;184.375;18.4343316938802;2952.695;291.677523962673;12.771;20.1625159392373
646;191.552;15.4647358852328;3064.143;247.080129109967;9.096;6.36986530469837
647;196.5;12.787187337331;3142.778;203.67706934261;7.915;2.52100079333585
648;193.803;8.8844426386805;3100.829;135.412597231561;7.441;2.56943359517229
649;193.904;19.7132667003722;3103.369;314.511496815304;8.441;3.69697295094244
650;190.395;14.0472867486926;3044.208;225.844499769194;6.538;1.18752515762824
651;193.703;8.46475640523693;3101.752;135.438953170786;6.411;1.29016626835459
652;192.202;17.7314764190692;3077.956;289.869379797174;7.33;1.39127998619976
653;195.394;14.5999631506385;3125.716;231.366656940884;7.581;2.81615145189317
654;194.307;16.9532858467024;3107.795;272.039354147529;7.565;3.48779658237117
655;197.498;10.486185006951;3157.88;163.38938233557;6.104;1.97811627565217
656;195.597;9.02139906001285;3126.038;145.536134674536;8.39;5.58548296926953
657;192.602;10.1218415320532;3083.126;161.664179409043;6.322;1.74552456298959
658;187.7;14.9105352016622;3002.403;239.350142554797;6.864;1.57416771660456
659;190.301;10.7655686798238;3048.932;173.329041928935;6.775;1.5690203950236
660;198.991;16.8887024072305;3178.272;267.378404730077;7.821;3.2907003813778
661;188.288;11.2073697181806;3013.816;176.004305583702;7.498;3.14968506362144
662;204.013;10.8459753365008;3265.674;172.151472500231;7.063;1.88974627926608
663;190.508;9.33532623961296;3044.411;150.932492754217;6.543;2.07978388300323
664;188.79;9.75444514054927;3024.666;159.343895157607;6.144;0.795678326963857
665;189.892;8.2584754040929;3040.465;131.997962578965;6.69;1.01322258166703
666;193.016;18.7192768022699;3087.276;292.308173241873;8.117;2.82310130884458
667;194.003;8.99722407190149;3102.657;140.666809806012;8.03;1.93767902398721
668;193.596;11.966242685154;3101.616;188.869913813728;7.371;1.91562235317925
669;193.299;12.2376741662783;3092.073;194.415955057718;6.767;1.38449304801433
670;197.604;14.3631272360861;3163.975;233.289413186707;7.415;2.03430209162749
671;197.999;14.0782111434656;3164.389;222.809363378198;8.643;4.72652737218352
672;192.4;13.4202131130618;3075.512;216.415529424298;6.303;1.33024847303052
673;194.318;8.61597446607123;3111.196;136.786683357705;6.321;1.53216480836756
674;191.012;9.88449978501724;3055.97;155.368116870861;6.19;1.22911350167509
675;196.26;7.53151777532312;3139.371;121.91020748485;7.548;2.00755473150796
676;202.405;12.0088361217896;3239.81;186.60486917548;6.5;1.41908421173657
677;192.901;13.3667613504541;3087.474;219.928505755853;6.787;1.11987543950209
678;197.898;13.4222813262129;3162.465;212.929236613958;7.304;1.96722749065785
679;196.7;6.52764275983336;3152.63;105.912372742747;7.408;2.78004963984458
680;197.189;12.8292357137899;3149.447;201.440084345203;7.604;3.77024455440227
681;197.107;9.29931078091246;3152.413;146.953803016468;7.233;1.50543050321162
682;196.202;10.0472541522546;3144.333;159.596029151729;8.097;2.20168594490677
683;194.203;14.2242370972928;3104.529;224.830656159256;6.471;0.888025337476347
684;194.696;15.1624530996803;3119.743;243.119275091467;6.788;2.58939297905899
685;194.697;14.6977665310075;3109.766;235.08430909781;7.008;1.4386299037626
686;196.305;13.2025469133799;3143.886;211.213351907502;6.623;1.30878607877682
687;187;15.2306283521068;2989.809;248.111662178545;7.772;2.08560686611835
688;190.492;10.1453524335038;3048.601;162.113302134653;6.652;1.61597524733518
689;193.006;7.55248859648263;3088.386;123.985125494977;7.353;3.71207772009154
690;197;18.8195680077943;3148.687;301.280110696013;6.781;1.34519478143501
691;187.294;8.1307947950984;2997.83;130.474864629172;7.48;1.64617131550759
692;192.96;15.4379616530167;3090.276;244.289069022752;7.821;3.93084583773009
693;195.353;11.8560499745905;3124.719;192.405341529286;7.563;3.25694043543937
694;187.099;13.4354846953878;2993.381;214.738008533647;7.23;2.08836778370095
695;189.826;19.2200281997713;3037.456;303.503693855604;6.416;1.41626409966503
696;191.453;14.3153756849059;3066.026;230.797008524801;6.955;1.30692195635394
697;192.893;16.8459146679544;3085.314;269.405913342672;6.16;1.39597277910423
698;191.498;17.9806756269059;3067.475;289.693354195429;7.127;2.03193528440254
699;198.508;12.9863911846211;3174.342;202.918067840206;6.57;2.82158466114345
700;199.102;11.6442327355644;3180.835;183.723770277545;7.647;2.15505011542655
701;197.603;10.0472225515314;3162.843;158.167476305971;8.052;3.65707478731294
702;200.9;15.9795513078431;3219.112;254.397610122424;7.409;1.71379374488298
703;196.303;11.297620147624;3134.261;183.924600989097;6.843;1.61748601230428
704;191.097;10.5713150080772;3060.238;170.182137593819;6.835;1.79744958204674
705;188.995;8.61987383898435;3020.442;138.031705473775;6.153;1.22611622613845
706;205.303;13.9053342642308;3285.053;221.916502768484;6.319;1.17778138888335
707;195.8;12.4521556366756;3136.908;195.708581968186;7.711;2.06540286627089
708;192.359;10.1363143696321;3077.439;164.599484291408;6.216;1.82076467452551
709;188.639;16.1976229428891;3022.726;263.257608824516;26.623;59.1883552820992
710;194.327;14.7134251960581;3105.425;233.816626493923;7.389;2.04381726189011
711;197.766;10.6280940906639;3165.662;176.095611404711;6.283;1.51423280904886
712;194.073;11.7321498882346;3100.168;186.791217341722;7.165;1.59753716701679
713;190.034;14.6594851205629;3041.044;235.310216063825;8.249;2.66944357497963
714;189.989;22.5031226499788;3040.487;357.880993601225;9.759;9.34072422245727
715;204.006;11.3745225833881;3266.267;182.308484007194;7.639;4.19691184086585
716;189.611;9.48741635009199;3036.589;145.421697930529;6.818;1.77636032380821
717;189.702;6.41353381530003;3034.323;109.406909932592;6.165;0.850873081017378
718;198.297;15.4895429564592;3170.053;250.51720452097;8.852;4.26463785097867
719;191.629;12.6703689370125;3063.561;200.653588826598;0.89;2.67
720;194.156;10.3179030815371;3111.376;164.001101837762;14.567;13.8951459510147
721;193.206;11.2100760033108;3085.998;176.653867254579;9.762;1.94945530854134
722;185.983;12.2681042137732;2983.625;195.846320938135;11.724;6.50553026278412
723;194.213;10.2322539550186;3106.121;158.528400953896;10.615;2.8750313041774
724;193.61;11.4292851919974;3095.555;187.930189445443;9.974;2.67402019438897
725;191.868;13.6642378492176;3071.176;223.801237941165;10.38;3.35633133048571
726;197.325;11.9929106141926;3152.616;190.673897804599;9.868;2.11559826054003
727;187.106;8.73218552253694;2994.398;138.867837442656;11.509;2.33345430638786
728;197.271;17.0376967046604;3156.527;268.880487207606;16.809;18.2673788212759
729;190.421;10.8871203263307;3046.232;172.105952354949;31.422;66.7239399016575
730;198.207;9.77389589672343;3173.5;151.254818038971;9.837;3.58469538454804
731;197.506;18.5748470787783;3158.723;301.653834951586;9.357;1.99933513949012
732;181.503;14.2211167283024;2902.528;232.076222297774;10.396;2.91769840799216
733;187.059;14.6765734761218;2998.572;237.937912943689;12.886;7.85758767052586
734;192.411;11.3877209748043;3074.37;178.631140566254;12.073;4.57194936542389
735;189.772;15.1389265141225;3039.155;239.661819164009;10.13;2.92675588322634
736;190.532;13.7611473358871;3045.79;220.763650721752;10.252;2.34500234541461
737;192.896;12.3814475728803;3090.25;201.256941793308;9.447;2.69990759101122
738;186.058;11.5871245786002;2975.723;179.743681004366;9.675;2.31419208364387
739;196.434;14.803551060472;3143.017;239.190116729356;9.826;3.07672618216181
740;189.116;14.1816749363397;3025.256;220.77367869381;9.561;2.17520780616473
741;196.436;12.3044522023531;3141.852;193.087079671318;10.036;2.64353626795624
742;191.765;17.3967780062863;3064.114;281.964069562065;11.183;3.66646982804987
743;195.989;12.3918533319274;3138.701;198.034351234829;12.989;4.51280721945886
744;190.311;13.5534397479019;3047.288;218.414043770087;9.17;1.32430359057129
745;191.356;10.6784869714771;3060.991;171.967442526199;10.621;1.94130085252133
746;197.047;14.811212003074;3151.153;233.914775465336;10.94;4.58160888771619
747;196.507;15.4908760565697;3146.32;252.048743658831;9.296;2.24952083786748
748;188.326;12.6755072482328;3006.499;197.931959443141;10.105;2.82789409278353
749;186.684;13.630401461439;2997.463;214.887783089226;10.033;3.33135723091955
750;192.747;10.9335081744149;3080.576;177.531291224953;11.892;4.39280957930116
751;188.348;15.4367061253361;3013.282;244.215501792991;10.203;1.91234960192953
752;189.542;15.3317851537258;3032.973;245.823223233683;9.698;4.26609610768441
753;184.94;7.80021666365739;2959.722;118.848682348607;10.031;1.70014969929121
754;204.106;18.1272668651395;3260.195;286.796406018282;10.653;1.41034782943783
755;196.989;9.72293829045636;3156.318;153.42522809499;11.12;3.0951672006533
756;191.808;14.7408756863356;3069.821;237.018749825817;10.434;1.95739214262242
757;197.598;15.7103652408209;3157.054;249.745792004583;10.841;2.73895764844949
758;191.912;11.8843121803495;3073.913;191.919369478435;9.459;1.66177886615518
759;189.022;12.831150221239;3022.344;202.011647644388;9.916;4.37564212430587
760;189.582;10.9573370852594;3037.519;177.905987951504;11.824;5.33725060307271
761;190.095;8.35250770727028;3035.236;132.000016606059;9.887;2.10026212649755
762;195.54;12.5711017814665;3131.341;195.628277171277;10.52;3.3658579886858
763;189.139;12.3571594227797;3032.949;200.74084788354;9.491;1.98456771111494
764;185.048;11.8120428377142;2950.685;192.630885179398;9.188;1.74229618607171
765;195.761;12.3016132681858;3134.374;195.890311562361;10.231;3.05187303143496
766;190.688;7.84277603913266;3054.282;122.238149184283;9.115;2.44414095338219
767;185.606;10.1950833248191;2967.809;155.738535144644;12.861;9.30396737956448
768;196.1;16.5209454935242;3139.881;264.678851835576;10.537;3.57586087536973
769;194.079;10.4243440561025;3099.185;167.522979513261;10.267;2.21081907898407
770;194.207;11.9124523503771;3107.908;189.597550975743;9.963;2.68792131581265
771;196.01;14.6285344447079;3143.262;234.393417177194;11.16;3.69745588208974
772;188.212;17.8960173222983;3010.486;288.033960088044;9.361;4.01315947851565
773;180.181;12.5550375945279;2879.2;201.385089021009;9.584;1.91179078353255
774;194.307;13.5804875096592;3110.318;218.60623851116;9.414;3.07001042343508
775;189.711;14.2444883727007;3033.87;228.909941767494;10.183;3.35442707477744
776;190.099;13.2469131876073;3044.29;211.507808886575;9.107;1.44625758424977
777;197.998;15.259170881801;3164.169;244.760407846118;9.58;2.61801451485662
778;185.999;13.8746664464412;2976.003;220.899922410585;9.112;2.54967370461399
779;189.555;12.6909221493162;3036.395;194.47349990423;10.033;2.11141682289405
780;188.657;10.5325628884905;3013.643;166.012553203073;9.86;2.51682339467829
781;198.744;15.7937349604201;3180.381;251.809085795174;10.325;3.34727127672676
782;197.933;10.4546822524647;3175.852;173.153468218229;10.529;2.75132858815518
783;192.095;9.7978051113512;3070.639;156.9492684564;9.784;0.807517182479713
784;193.624;17.8342161027617;3094.498;289.208188258906;11.154;2.7018482562868
785;193.699;14.4697003769944;3099.893;237.566805764196;10.797;3.89935904989525
786;189.708;14.1078395227617;3035.045;220.983439255062;11.355;5.03992509864978
787;190.088;13.5862774887011;3045.696;219.71209548862;24.266;28.9567543761382
788;190.196;14.478569818874;3038.061;231.285969027527;10.928;3.50560921952233
789;187.339;17.934838415776;2998.022;285.937992746679;10.431;3.15989382733028
790;190.393;9.97857409653349;3047.404;159.669914586311;11.665;4.23954537657047
791;188.989;12.5433061431184;3020.923;203.92185219098;10.083;3.33792465463198
792;182.601;14.7212651969865;2925.017;230.827804696485;18.427;26.4964684627971
793;185.312;13.4192054906395;2963.617;214.715590214129;10.093;4.04978530295126
794;185.789;13.8464338008019;2970.92;215.448179523521;11.407;4.80692843716234
795;193.806;12.5419657151505;3106.203;191.847879010942;9.752;3.55985898597122
796;191.899;16.6869394737324;3068.472;265.084660016381;10.958;3.36911204919041
797;192.302;17.0877533924155;3077.132;265.908849901617;10.029;2.46178573397443
798;185.493;10.839979750904;2964.595;167.594186489269;11.59;4.4881934004675
799;191.187;10.6799401215549;3059.701;173.934271059502;10.549;2.18229901709183
800;190.143;13.5305698697431;3043.193;219.246768598771;13.085;6.94007384686935
801;194.141;16.6650595258461;3107.042;260.875098305684;12.687;8.67547583709389
802;184.232;11.2813206673679;2950.834;180.897933277307;11.474;5.37773223580349
803;190.21;12.814618215148;3039.149;209.044456967886;11.315;8.57646809590055
804;193.684;15.3848303208061;3101.857;243.502613252919;12.421;10.0229301603872
805;191.73;10.7256738716035;3064.275;175.145491706182;11.419;4.72967113021614
806;188.092;8.56290231171665;3010.495;141.087220984039;12.864;5.63574875238419
807;188.599;13.4306913075984;3017.277;208.194451657589;14.79;8.72548909803915
808;189.701;14.8110488825068;3037.111;231.300618176869;12.264;5.84477578697421
809;184.583;13.4724593523229;2956.623;216.178965028974;10.863;3.68700705179688
810;201.3;12.0799718542718;3219.379;192.53820360906;11.366;3.25366316634036
811;198.744;10.8615875451066;3175.421;175.522422923677;11.564;3.10612684866539
812;187.455;16.7285697236796;3004.997;271.277392130271;11.036;4.03811886897848
813;195.94;16.8609798054559;3129.459;273.077481658594;11.575;4.61932733198244
814;197.52;14.8857495612412;3163.512;234.363263708286;9.673;2.06619965153419
815;187.144;8.81895027766881;2993.069;138.988298388757;12.301;5.6146886823759
816;195.931;16.2909204466783;3132.589;261.214494140354;11.397;4.01325566093166
817;186.235;15.0998246678562;2980.872;239.714711847219;11.443;3.55967428285229
818;190.611;10.0648769987516;3049.88;162.756216286818;10.657;3.38649981544367
819;192.898;13.2428107288446;3085.875;211.6724385578;10.902;3.23369386306125
820;189.854;16.2196511676422;3044.549;257.216494239778;11.978;5.68869545678093
821;194.605;24.8550611546221;3107.766;396.583144906584;17.494;12.2996871504929
822;190.65;24.3276065407183;3047.09;391.862092119154;19.305;29.2224294849008
823;185.271;14.7375577691826;2966.619;239.427296666445;11.023;3.73284891202416
824;190.915;11.9021739610878;3055.132;193.238356844599;10.586;1.75174884044488
825;196.408;11.5253388670353;3142.791;184.404072213719;11.296;4.26112238735288
826;181.606;10.0159554711472;2909.512;162.074200402158;10.956;3.46996311219587
827;185.501;10.6459996712381;2966.21;169.917112675562;10.292;4.30374906331677
828;192.27;4.24799717513953;3075.218;69.2050327360708;9.775;3.12250300240047
829;197.032;16.1119892005919;3149.906;259.786545848701;12.602;6.99686758485538
830;199.398;16.4383945688136;3191.161;262.398381757589;10.137;2.43234886478071
831;191.493;13.0353964650103;3064.488;214.687575085277;10.625;3.72304781059818
832;191.935;12.7492315454698;3067.172;202.273552883219;10.768;3.73841891713595
833;189.576;11.6200449224608;3035.413;186.788257717125;13.633;7.54887680386956
834;194.599;17.1459986294178;3113.601;268.41889514154;11.466;4.39664462971479
835;196.996;13.802767258778;3154.724;219.614257651917;11.084;5.56313257077341
836;194.416;10.4173213447606;3107.153;169.559274948323;11.641;7.85875874422927
837;191.5;8.45578027150669;3071.619;139.241451978206;9.272;2.75815808103886
838;191.283;13.1466840305835;3050.801;210.128672981577;10.924;4.39048106703582
839;191.724;15.1583931866147;3073.164;245.786058603823;9.868;3.95032859392734
840;198.393;13.3300105401309;3176.383;212.978079109089;8.927;2.62253713033772
841;187.305;6.26752782203665;2993.302;99.6260886314386;9.226;2.49830822758122
842;199.883;14.0151967877729;3194.238;223.850755674394;8.635;2.24319080775577
843;191.079;14.321525372669;3059.357;229.233033180214;10.76;3.61056228308001
844;198.735;13.1059278572716;3184.488;205.372579708188;9.21;2.42334479593804
845;190.843;17.4038714371254;3053.804;283.352984709892;12.916;7.91255104248939
846;187.454;13.8802717552652;2995.351;226.678828585737;10.068;4.97298662777208
847;193.696;6.0223071990725;3098.03;99.2437951712911;9.411;2.34083937936802
848;197.875;8.77243210290034;3166.822;139.739367667097;9.866;3.86664247118866
849;192.935;13.5481122301227;3091.674;219.248985502786;11.92;6.04424354241289
850;186.589;15.1751464243349;2981.542;237.341980011966;14.282;10.0011267365232
851;191.699;11.3029026802849;3065.496;178.23495892782;8.249;2.26467856438834
852;194.108;15.1286032402204;3106.597;239.665097753094;8.659;3.34395110610188
853;192.796;11.0797934998808;3084.553;180.61725344219;13.831;10.2308029499155
854;189.333;12.85311483649;3029.937;202.683772959242;9.705;2.11184871617262
855;188.976;8.11122333560137;3028.816;128.735966707066;10.97;2.93052213777681
856;194.094;18.2190044733516;3099.024;296.351601959567;10.03;2.77624206437407
857;191.505;16.4764469774283;3066.781;260.447814598243;10.29;3.52477517013496
858;197.479;20.1297786624694;3161.786;325.366428637008;9.226;2.34635547179024
859;196.61;9.18616133104587;3143.241;151.555918818762;10.716;3.52841097379543
860;191.019;5.28089471586007;3059.221;82.41300885784;8.791;1.8775646460242
861;188.995;14.7845569767919;3020.467;233.841938328005;12.017;5.38456692780394
862;196.503;10.613445293589;3147.623;171.080802081945;9.234;2.45487352016352
863;194.282;12.7071757680462;3104.493;204.449071558177;10.153;3.68458695107064
864;187.81;9.27702538532675;3008.144;152.612280252931;9.974;2.95538220878451
865;190.935;14.0292111324908;3053.254;224.187869618321;10.528;2.80835467845498
866;192.083;14.1512784228137;3071.828;222.188856192202;11.522;3.3472729198558
867;188.254;13.8845311047944;3010.756;221.929668552898;10.496;2.40973110533105
868;191.237;12.9498409642739;3059.573;203.238432588434;10.852;4.39895396656978
869;197.881;11.4143746653068;3166.619;181.955389007856;10.429;1.60230739872224
870;193.415;14.2358247038938;3094.734;231.808401107463;10.611;2.46060744532727
871;190.105;21.3325456755636;3046.088;340.374665061901;11.979;2.21351959557624
872;199.566;7.55470078825146;3191.156;127.79818044089;8.966;1.86636652348889
873;190.635;13.3926690767748;3047.987;221.802383262668;9.294;2.42254081492965
874;194.894;12.0080474682604;3118.306;192.852647127276;12.556;4.42019501832216
875;184.48;8.65643113528889;2951.396;140.441284898697;10.774;4.58412521643988
876;193.314;19.0783071576071;3097.77;306.35880470455;10.425;2.52134983689292
877;184.294;5.70235600431939;2945.528;94.8913487943038;10.94;5.20971016468287
878;185.916;11.4824136835422;2973.741;185.974105802395;13.16;6.28109226170099
879;188.693;12.5827668260996;3020.578;199.743612703887;15.092;10.4117153245755
880;190.412;13.8728027449398;3048.298;217.513821804506;12.172;5.42577515199441
881;199.594;10.5696472978056;3189.688;171.197112463958;12.51;5.56019603970939
882;183.817;12.282218895623;2943.49;194.025980116066;13.745;4.86485405742043
883;181.548;13.8548863582492;2907.477;223.579632571928;12.042;3.47103673273562
884;193.545;14.7049401562875;3091.918;233.886602001902;22.877;37.4124955195453
885;198.781;7.18749253912695;3182.102;122.277871734835;12.732;5.9318610907539
886;182.819;13.9417835659575;2928.304;222.052035442153;11.534;1.22004262220629
887;200.388;7.01611259886825;3202.328;115.004388159741;13.306;5.28400832701843
888;189.096;11.4221628424743;3026.901;182.310402799732;11.201;3.55282830995251
889;194.321;15.8407780427608;3109.143;251.347773137148;12.189;6.13675068745667
890;194.982;10.9165258209736;3124.808;178.867112058087;11.156;2.26270280858976
891;188.747;10.890894407715;3013.437;168.432488971108;12.486;4.12228383302266
892;187.961;11.7130008537527;3007.588;185.683080801677;12.315;4.46524411426744
893;183.261;12.5561263532983;2931.859;197.59748472337;11.262;3.53366891488152
894;187.384;9.00093795112511;2999.611;143.888906205447;10.128;2.2847485638468
895;194.165;11.0498952483724;3104.859;179.351591375715;11.701;5.4639719069556
896;195.193;14.1621905438387;3124.079;230.437992373213;11.716;4.28302042955669
897;193.066;14.979058181341;3092.966;237.462955982606;13.622;4.7949177260929
898;198.412;14.3185905730974;3170.291;228.545604309068;12.648;5.27345200035044
899;191.354;9.98519423947296;3062.243;154.670412105874;12.812;3.48727630106936
