<?xml version="1.0" encoding="utf-8" standalone="no"?>
<!DOCTYPE svg PUBLIC "-//W3C//DTD SVG 1.1//EN"
  "http://www.w3.org/Graphics/SVG/1.1/DTD/svg11.dtd">
<!-- Created with matplotlib (https://matplotlib.org/) -->
<svg height="288pt" version="1.1" viewBox="0 0 432 288" width="432pt" xmlns="http://www.w3.org/2000/svg" xmlns:xlink="http://www.w3.org/1999/xlink">
 <defs>
  <style type="text/css">
*{stroke-linecap:butt;stroke-linejoin:round;}
  </style>
 </defs>
 <g id="figure_1">
  <g id="patch_1">
   <path d="M 0 288 
L 432 288 
L 432 0 
L 0 0 
z
" style="fill:#ffffff;"/>
  </g>
  <g id="axes_1">
   <g id="patch_2">
    <path d="M 54 252 
L 388.8 252 
L 388.8 34.56 
L 54 34.56 
z
" style="fill:#ffffff;"/>
   </g>
   <g id="matplotlib.axis_1">
    <g id="xtick_1">
     <g id="line2d_1">
      <defs>
       <path d="M 0 0 
L 0 3.5 
" id="m74b90590b9" style="stroke:#000000;stroke-width:0.8;"/>
      </defs>
      <g>
       <use style="stroke:#000000;stroke-width:0.8;" x="83.052893" xlink:href="#m74b90590b9" y="252"/>
      </g>
     </g>
     <g id="text_1">
      <!-- φ1 -->
      <defs>
       <path d="M 40.484375 47.40625 
Q 37.3125 47.40625 37.3125 40.328125 
L 37.3125 6.84375 
Q 41.9375 6.84375 46.578125 11.921875 
Q 50.734375 16.453125 50.734375 27.34375 
Q 50.734375 37.5 46.53125 42.96875 
Q 43.109375 47.40625 40.484375 47.40625 
z
M 40.484375 55.078125 
Q 47.3125 55.078125 53.515625 48.640625 
Q 60.203125 41.75 60.203125 27.34375 
Q 60.203125 14.109375 53.515625 6.25 
Q 47.21875 -1.171875 37.3125 -1.171875 
L 37.3125 -20.796875 
L 28.375 -20.796875 
L 28.375 -1.21875 
Q 18.65625 -1.21875 12.109375 6.25 
Q 5.46875 13.875 5.46875 27.296875 
Q 5.46875 41.265625 12.109375 48.390625 
Q 17.09375 53.71875 25.203125 55.078125 
L 25.203125 47.125 
Q 21.96875 46 19.140625 42.1875 
Q 14.9375 36.578125 14.9375 27.296875 
Q 14.9375 17.4375 19.140625 11.8125 
Q 22.90625 6.78125 28.375 6.78125 
L 28.375 40.328125 
Q 28.375 55.078125 40.484375 55.078125 
z
" id="DejaVuSans-966"/>
       <path d="M 12.40625 8.296875 
L 28.515625 8.296875 
L 28.515625 63.921875 
L 10.984375 60.40625 
L 10.984375 69.390625 
L 28.421875 72.90625 
L 38.28125 72.90625 
L 38.28125 8.296875 
L 54.390625 8.296875 
L 54.390625 0 
L 12.40625 0 
z
" id="DejaVuSans-49"/>
      </defs>
      <g transform="translate(76.573205 266.598437)scale(0.1 -0.1)">
       <use xlink:href="#DejaVuSans-966"/>
       <use x="65.966797" xlink:href="#DejaVuSans-49"/>
      </g>
     </g>
    </g>
    <g id="xtick_2">
     <g id="line2d_2">
      <g>
       <use style="stroke:#000000;stroke-width:0.8;" x="117.639669" xlink:href="#m74b90590b9" y="252"/>
      </g>
     </g>
     <g id="text_2">
      <!-- φ2 -->
      <defs>
       <path d="M 19.1875 8.296875 
L 53.609375 8.296875 
L 53.609375 0 
L 7.328125 0 
L 7.328125 8.296875 
Q 12.9375 14.109375 22.625 23.890625 
Q 32.328125 33.6875 34.8125 36.53125 
Q 39.546875 41.84375 41.421875 45.53125 
Q 43.3125 49.21875 43.3125 52.78125 
Q 43.3125 58.59375 39.234375 62.25 
Q 35.15625 65.921875 28.609375 65.921875 
Q 23.96875 65.921875 18.8125 64.3125 
Q 13.671875 62.703125 7.8125 59.421875 
L 7.8125 69.390625 
Q 13.765625 71.78125 18.9375 73 
Q 24.125 74.21875 28.421875 74.21875 
Q 39.75 74.21875 46.484375 68.546875 
Q 53.21875 62.890625 53.21875 53.421875 
Q 53.21875 48.921875 51.53125 44.890625 
Q 49.859375 40.875 45.40625 35.40625 
Q 44.1875 33.984375 37.640625 27.21875 
Q 31.109375 20.453125 19.1875 8.296875 
z
" id="DejaVuSans-50"/>
      </defs>
      <g transform="translate(111.159982 266.598437)scale(0.1 -0.1)">
       <use xlink:href="#DejaVuSans-966"/>
       <use x="65.966797" xlink:href="#DejaVuSans-50"/>
      </g>
     </g>
    </g>
    <g id="xtick_3">
     <g id="line2d_3">
      <g>
       <use style="stroke:#000000;stroke-width:0.8;" x="152.226446" xlink:href="#m74b90590b9" y="252"/>
      </g>
     </g>
     <g id="text_3">
      <!-- φ3 -->
      <defs>
       <path d="M 40.578125 39.3125 
Q 47.65625 37.796875 51.625 33 
Q 55.609375 28.21875 55.609375 21.1875 
Q 55.609375 10.40625 48.1875 4.484375 
Q 40.765625 -1.421875 27.09375 -1.421875 
Q 22.515625 -1.421875 17.65625 -0.515625 
Q 12.796875 0.390625 7.625 2.203125 
L 7.625 11.71875 
Q 11.71875 9.328125 16.59375 8.109375 
Q 21.484375 6.890625 26.8125 6.890625 
Q 36.078125 6.890625 40.9375 10.546875 
Q 45.796875 14.203125 45.796875 21.1875 
Q 45.796875 27.640625 41.28125 31.265625 
Q 36.765625 34.90625 28.71875 34.90625 
L 20.21875 34.90625 
L 20.21875 43.015625 
L 29.109375 43.015625 
Q 36.375 43.015625 40.234375 45.921875 
Q 44.09375 48.828125 44.09375 54.296875 
Q 44.09375 59.90625 40.109375 62.90625 
Q 36.140625 65.921875 28.71875 65.921875 
Q 24.65625 65.921875 20.015625 65.03125 
Q 15.375 64.15625 9.8125 62.3125 
L 9.8125 71.09375 
Q 15.4375 72.65625 20.34375 73.4375 
Q 25.25 74.21875 29.59375 74.21875 
Q 40.828125 74.21875 47.359375 69.109375 
Q 53.90625 64.015625 53.90625 55.328125 
Q 53.90625 49.265625 50.4375 45.09375 
Q 46.96875 40.921875 40.578125 39.3125 
z
" id="DejaVuSans-51"/>
      </defs>
      <g transform="translate(145.746759 266.598437)scale(0.1 -0.1)">
       <use xlink:href="#DejaVuSans-966"/>
       <use x="65.966797" xlink:href="#DejaVuSans-51"/>
      </g>
     </g>
    </g>
    <g id="xtick_4">
     <g id="line2d_4">
      <g>
       <use style="stroke:#000000;stroke-width:0.8;" x="186.813223" xlink:href="#m74b90590b9" y="252"/>
      </g>
     </g>
     <g id="text_4">
      <!-- φ4 -->
      <defs>
       <path d="M 37.796875 64.3125 
L 12.890625 25.390625 
L 37.796875 25.390625 
z
M 35.203125 72.90625 
L 47.609375 72.90625 
L 47.609375 25.390625 
L 58.015625 25.390625 
L 58.015625 17.1875 
L 47.609375 17.1875 
L 47.609375 0 
L 37.796875 0 
L 37.796875 17.1875 
L 4.890625 17.1875 
L 4.890625 26.703125 
z
" id="DejaVuSans-52"/>
      </defs>
      <g transform="translate(180.333536 266.598437)scale(0.1 -0.1)">
       <use xlink:href="#DejaVuSans-966"/>
       <use x="65.966797" xlink:href="#DejaVuSans-52"/>
      </g>
     </g>
    </g>
    <g id="xtick_5">
     <g id="line2d_5">
      <g>
       <use style="stroke:#000000;stroke-width:0.8;" x="221.4" xlink:href="#m74b90590b9" y="252"/>
      </g>
     </g>
     <g id="text_5">
      <!-- φ5 -->
      <defs>
       <path d="M 10.796875 72.90625 
L 49.515625 72.90625 
L 49.515625 64.59375 
L 19.828125 64.59375 
L 19.828125 46.734375 
Q 21.96875 47.46875 24.109375 47.828125 
Q 26.265625 48.1875 28.421875 48.1875 
Q 40.625 48.1875 47.75 41.5 
Q 54.890625 34.8125 54.890625 23.390625 
Q 54.890625 11.625 47.5625 5.09375 
Q 40.234375 -1.421875 26.90625 -1.421875 
Q 22.3125 -1.421875 17.546875 -0.640625 
Q 12.796875 0.140625 7.71875 1.703125 
L 7.71875 11.625 
Q 12.109375 9.234375 16.796875 8.0625 
Q 21.484375 6.890625 26.703125 6.890625 
Q 35.15625 6.890625 40.078125 11.328125 
Q 45.015625 15.765625 45.015625 23.390625 
Q 45.015625 31 40.078125 35.4375 
Q 35.15625 39.890625 26.703125 39.890625 
Q 22.75 39.890625 18.8125 39.015625 
Q 14.890625 38.140625 10.796875 36.28125 
z
" id="DejaVuSans-53"/>
      </defs>
      <g transform="translate(214.920313 266.598437)scale(0.1 -0.1)">
       <use xlink:href="#DejaVuSans-966"/>
       <use x="65.966797" xlink:href="#DejaVuSans-53"/>
      </g>
     </g>
    </g>
    <g id="xtick_6">
     <g id="line2d_6">
      <g>
       <use style="stroke:#000000;stroke-width:0.8;" x="255.986777" xlink:href="#m74b90590b9" y="252"/>
      </g>
     </g>
     <g id="text_6">
      <!-- φ6 -->
      <defs>
       <path d="M 33.015625 40.375 
Q 26.375 40.375 22.484375 35.828125 
Q 18.609375 31.296875 18.609375 23.390625 
Q 18.609375 15.53125 22.484375 10.953125 
Q 26.375 6.390625 33.015625 6.390625 
Q 39.65625 6.390625 43.53125 10.953125 
Q 47.40625 15.53125 47.40625 23.390625 
Q 47.40625 31.296875 43.53125 35.828125 
Q 39.65625 40.375 33.015625 40.375 
z
M 52.59375 71.296875 
L 52.59375 62.3125 
Q 48.875 64.0625 45.09375 64.984375 
Q 41.3125 65.921875 37.59375 65.921875 
Q 27.828125 65.921875 22.671875 59.328125 
Q 17.53125 52.734375 16.796875 39.40625 
Q 19.671875 43.65625 24.015625 45.921875 
Q 28.375 48.1875 33.59375 48.1875 
Q 44.578125 48.1875 50.953125 41.515625 
Q 57.328125 34.859375 57.328125 23.390625 
Q 57.328125 12.15625 50.6875 5.359375 
Q 44.046875 -1.421875 33.015625 -1.421875 
Q 20.359375 -1.421875 13.671875 8.265625 
Q 6.984375 17.96875 6.984375 36.375 
Q 6.984375 53.65625 15.1875 63.9375 
Q 23.390625 74.21875 37.203125 74.21875 
Q 40.921875 74.21875 44.703125 73.484375 
Q 48.484375 72.75 52.59375 71.296875 
z
" id="DejaVuSans-54"/>
      </defs>
      <g transform="translate(249.507089 266.598437)scale(0.1 -0.1)">
       <use xlink:href="#DejaVuSans-966"/>
       <use x="65.966797" xlink:href="#DejaVuSans-54"/>
      </g>
     </g>
    </g>
    <g id="xtick_7">
     <g id="line2d_7">
      <g>
       <use style="stroke:#000000;stroke-width:0.8;" x="290.573554" xlink:href="#m74b90590b9" y="252"/>
      </g>
     </g>
     <g id="text_7">
      <!-- φ7 -->
      <defs>
       <path d="M 8.203125 72.90625 
L 55.078125 72.90625 
L 55.078125 68.703125 
L 28.609375 0 
L 18.3125 0 
L 43.21875 64.59375 
L 8.203125 64.59375 
z
" id="DejaVuSans-55"/>
      </defs>
      <g transform="translate(284.093866 266.598437)scale(0.1 -0.1)">
       <use xlink:href="#DejaVuSans-966"/>
       <use x="65.966797" xlink:href="#DejaVuSans-55"/>
      </g>
     </g>
    </g>
    <g id="xtick_8">
     <g id="line2d_8">
      <g>
       <use style="stroke:#000000;stroke-width:0.8;" x="325.160331" xlink:href="#m74b90590b9" y="252"/>
      </g>
     </g>
     <g id="text_8">
      <!-- φ8 -->
      <defs>
       <path d="M 31.78125 34.625 
Q 24.75 34.625 20.71875 30.859375 
Q 16.703125 27.09375 16.703125 20.515625 
Q 16.703125 13.921875 20.71875 10.15625 
Q 24.75 6.390625 31.78125 6.390625 
Q 38.8125 6.390625 42.859375 10.171875 
Q 46.921875 13.96875 46.921875 20.515625 
Q 46.921875 27.09375 42.890625 30.859375 
Q 38.875 34.625 31.78125 34.625 
z
M 21.921875 38.8125 
Q 15.578125 40.375 12.03125 44.71875 
Q 8.5 49.078125 8.5 55.328125 
Q 8.5 64.0625 14.71875 69.140625 
Q 20.953125 74.21875 31.78125 74.21875 
Q 42.671875 74.21875 48.875 69.140625 
Q 55.078125 64.0625 55.078125 55.328125 
Q 55.078125 49.078125 51.53125 44.71875 
Q 48 40.375 41.703125 38.8125 
Q 48.828125 37.15625 52.796875 32.3125 
Q 56.78125 27.484375 56.78125 20.515625 
Q 56.78125 9.90625 50.3125 4.234375 
Q 43.84375 -1.421875 31.78125 -1.421875 
Q 19.734375 -1.421875 13.25 4.234375 
Q 6.78125 9.90625 6.78125 20.515625 
Q 6.78125 27.484375 10.78125 32.3125 
Q 14.796875 37.15625 21.921875 38.8125 
z
M 18.3125 54.390625 
Q 18.3125 48.734375 21.84375 45.5625 
Q 25.390625 42.390625 31.78125 42.390625 
Q 38.140625 42.390625 41.71875 45.5625 
Q 45.3125 48.734375 45.3125 54.390625 
Q 45.3125 60.0625 41.71875 63.234375 
Q 38.140625 66.40625 31.78125 66.40625 
Q 25.390625 66.40625 21.84375 63.234375 
Q 18.3125 60.0625 18.3125 54.390625 
z
" id="DejaVuSans-56"/>
      </defs>
      <g transform="translate(318.680643 266.598437)scale(0.1 -0.1)">
       <use xlink:href="#DejaVuSans-966"/>
       <use x="65.966797" xlink:href="#DejaVuSans-56"/>
      </g>
     </g>
    </g>
    <g id="xtick_9">
     <g id="line2d_9">
      <g>
       <use style="stroke:#000000;stroke-width:0.8;" x="359.747107" xlink:href="#m74b90590b9" y="252"/>
      </g>
     </g>
     <g id="text_9">
      <!-- φ9 -->
      <defs>
       <path d="M 10.984375 1.515625 
L 10.984375 10.5 
Q 14.703125 8.734375 18.5 7.8125 
Q 22.3125 6.890625 25.984375 6.890625 
Q 35.75 6.890625 40.890625 13.453125 
Q 46.046875 20.015625 46.78125 33.40625 
Q 43.953125 29.203125 39.59375 26.953125 
Q 35.25 24.703125 29.984375 24.703125 
Q 19.046875 24.703125 12.671875 31.3125 
Q 6.296875 37.9375 6.296875 49.421875 
Q 6.296875 60.640625 12.9375 67.421875 
Q 19.578125 74.21875 30.609375 74.21875 
Q 43.265625 74.21875 49.921875 64.515625 
Q 56.59375 54.828125 56.59375 36.375 
Q 56.59375 19.140625 48.40625 8.859375 
Q 40.234375 -1.421875 26.421875 -1.421875 
Q 22.703125 -1.421875 18.890625 -0.6875 
Q 15.09375 0.046875 10.984375 1.515625 
z
M 30.609375 32.421875 
Q 37.25 32.421875 41.125 36.953125 
Q 45.015625 41.5 45.015625 49.421875 
Q 45.015625 57.28125 41.125 61.84375 
Q 37.25 66.40625 30.609375 66.40625 
Q 23.96875 66.40625 20.09375 61.84375 
Q 16.21875 57.28125 16.21875 49.421875 
Q 16.21875 41.5 20.09375 36.953125 
Q 23.96875 32.421875 30.609375 32.421875 
z
" id="DejaVuSans-57"/>
      </defs>
      <g transform="translate(353.26742 266.598437)scale(0.1 -0.1)">
       <use xlink:href="#DejaVuSans-966"/>
       <use x="65.966797" xlink:href="#DejaVuSans-57"/>
      </g>
     </g>
    </g>
    <g id="text_10">
     <!-- Phases -->
     <defs>
      <path d="M 19.671875 64.796875 
L 19.671875 37.40625 
L 32.078125 37.40625 
Q 38.96875 37.40625 42.71875 40.96875 
Q 46.484375 44.53125 46.484375 51.125 
Q 46.484375 57.671875 42.71875 61.234375 
Q 38.96875 64.796875 32.078125 64.796875 
z
M 9.8125 72.90625 
L 32.078125 72.90625 
Q 44.34375 72.90625 50.609375 67.359375 
Q 56.890625 61.8125 56.890625 51.125 
Q 56.890625 40.328125 50.609375 34.8125 
Q 44.34375 29.296875 32.078125 29.296875 
L 19.671875 29.296875 
L 19.671875 0 
L 9.8125 0 
z
" id="DejaVuSans-80"/>
      <path d="M 54.890625 33.015625 
L 54.890625 0 
L 45.90625 0 
L 45.90625 32.71875 
Q 45.90625 40.484375 42.875 44.328125 
Q 39.84375 48.1875 33.796875 48.1875 
Q 26.515625 48.1875 22.3125 43.546875 
Q 18.109375 38.921875 18.109375 30.90625 
L 18.109375 0 
L 9.078125 0 
L 9.078125 75.984375 
L 18.109375 75.984375 
L 18.109375 46.1875 
Q 21.34375 51.125 25.703125 53.5625 
Q 30.078125 56 35.796875 56 
Q 45.21875 56 50.046875 50.171875 
Q 54.890625 44.34375 54.890625 33.015625 
z
" id="DejaVuSans-104"/>
      <path d="M 34.28125 27.484375 
Q 23.390625 27.484375 19.1875 25 
Q 14.984375 22.515625 14.984375 16.5 
Q 14.984375 11.71875 18.140625 8.90625 
Q 21.296875 6.109375 26.703125 6.109375 
Q 34.1875 6.109375 38.703125 11.40625 
Q 43.21875 16.703125 43.21875 25.484375 
L 43.21875 27.484375 
z
M 52.203125 31.203125 
L 52.203125 0 
L 43.21875 0 
L 43.21875 8.296875 
Q 40.140625 3.328125 35.546875 0.953125 
Q 30.953125 -1.421875 24.3125 -1.421875 
Q 15.921875 -1.421875 10.953125 3.296875 
Q 6 8.015625 6 15.921875 
Q 6 25.140625 12.171875 29.828125 
Q 18.359375 34.515625 30.609375 34.515625 
L 43.21875 34.515625 
L 43.21875 35.40625 
Q 43.21875 41.609375 39.140625 45 
Q 35.0625 48.390625 27.6875 48.390625 
Q 23 48.390625 18.546875 47.265625 
Q 14.109375 46.140625 10.015625 43.890625 
L 10.015625 52.203125 
Q 14.9375 54.109375 19.578125 55.046875 
Q 24.21875 56 28.609375 56 
Q 40.484375 56 46.34375 49.84375 
Q 52.203125 43.703125 52.203125 31.203125 
z
" id="DejaVuSans-97"/>
      <path d="M 44.28125 53.078125 
L 44.28125 44.578125 
Q 40.484375 46.53125 36.375 47.5 
Q 32.28125 48.484375 27.875 48.484375 
Q 21.1875 48.484375 17.84375 46.4375 
Q 14.5 44.390625 14.5 40.28125 
Q 14.5 37.15625 16.890625 35.375 
Q 19.28125 33.59375 26.515625 31.984375 
L 29.59375 31.296875 
Q 39.15625 29.25 43.1875 25.515625 
Q 47.21875 21.78125 47.21875 15.09375 
Q 47.21875 7.46875 41.1875 3.015625 
Q 35.15625 -1.421875 24.609375 -1.421875 
Q 20.21875 -1.421875 15.453125 -0.5625 
Q 10.6875 0.296875 5.421875 2 
L 5.421875 11.28125 
Q 10.40625 8.6875 15.234375 7.390625 
Q 20.0625 6.109375 24.8125 6.109375 
Q 31.15625 6.109375 34.5625 8.28125 
Q 37.984375 10.453125 37.984375 14.40625 
Q 37.984375 18.0625 35.515625 20.015625 
Q 33.0625 21.96875 24.703125 23.78125 
L 21.578125 24.515625 
Q 13.234375 26.265625 9.515625 29.90625 
Q 5.8125 33.546875 5.8125 39.890625 
Q 5.8125 47.609375 11.28125 51.796875 
Q 16.75 56 26.8125 56 
Q 31.78125 56 36.171875 55.265625 
Q 40.578125 54.546875 44.28125 53.078125 
z
" id="DejaVuSans-115"/>
      <path d="M 56.203125 29.59375 
L 56.203125 25.203125 
L 14.890625 25.203125 
Q 15.484375 15.921875 20.484375 11.0625 
Q 25.484375 6.203125 34.421875 6.203125 
Q 39.59375 6.203125 44.453125 7.46875 
Q 49.3125 8.734375 54.109375 11.28125 
L 54.109375 2.78125 
Q 49.265625 0.734375 44.1875 -0.34375 
Q 39.109375 -1.421875 33.890625 -1.421875 
Q 20.796875 -1.421875 13.15625 6.1875 
Q 5.515625 13.8125 5.515625 26.8125 
Q 5.515625 40.234375 12.765625 48.109375 
Q 20.015625 56 32.328125 56 
Q 43.359375 56 49.78125 48.890625 
Q 56.203125 41.796875 56.203125 29.59375 
z
M 47.21875 32.234375 
Q 47.125 39.59375 43.09375 43.984375 
Q 39.0625 48.390625 32.421875 48.390625 
Q 24.90625 48.390625 20.390625 44.140625 
Q 15.875 39.890625 15.1875 32.171875 
z
" id="DejaVuSans-101"/>
     </defs>
     <g transform="translate(203.866406 280.276563)scale(0.1 -0.1)">
      <use xlink:href="#DejaVuSans-80"/>
      <use x="60.302734" xlink:href="#DejaVuSans-104"/>
      <use x="123.681641" xlink:href="#DejaVuSans-97"/>
      <use x="184.960938" xlink:href="#DejaVuSans-115"/>
      <use x="237.060547" xlink:href="#DejaVuSans-101"/>
      <use x="298.583984" xlink:href="#DejaVuSans-115"/>
     </g>
    </g>
   </g>
   <g id="matplotlib.axis_2">
    <g id="ytick_1">
     <g id="line2d_10">
      <path clip-path="url(#pd9f483cd15)" d="M 54 252 
L 388.8 252 
" style="fill:none;stroke:#b0b0b0;stroke-dasharray:2.96,1.28;stroke-dashoffset:0;stroke-width:0.8;"/>
     </g>
     <g id="line2d_11">
      <defs>
       <path d="M 0 0 
L -3.5 0 
" id="mc6a3038a7f" style="stroke:#000000;stroke-width:0.8;"/>
      </defs>
      <g>
       <use style="stroke:#000000;stroke-width:0.8;" x="54" xlink:href="#mc6a3038a7f" y="252"/>
      </g>
     </g>
     <g id="text_11">
      <!-- 0 -->
      <defs>
       <path d="M 31.78125 66.40625 
Q 24.171875 66.40625 20.328125 58.90625 
Q 16.5 51.421875 16.5 36.375 
Q 16.5 21.390625 20.328125 13.890625 
Q 24.171875 6.390625 31.78125 6.390625 
Q 39.453125 6.390625 43.28125 13.890625 
Q 47.125 21.390625 47.125 36.375 
Q 47.125 51.421875 43.28125 58.90625 
Q 39.453125 66.40625 31.78125 66.40625 
z
M 31.78125 74.21875 
Q 44.046875 74.21875 50.515625 64.515625 
Q 56.984375 54.828125 56.984375 36.375 
Q 56.984375 17.96875 50.515625 8.265625 
Q 44.046875 -1.421875 31.78125 -1.421875 
Q 19.53125 -1.421875 13.0625 8.265625 
Q 6.59375 17.96875 6.59375 36.375 
Q 6.59375 54.828125 13.0625 64.515625 
Q 19.53125 74.21875 31.78125 74.21875 
z
" id="DejaVuSans-48"/>
      </defs>
      <g transform="translate(40.6375 255.799219)scale(0.1 -0.1)">
       <use xlink:href="#DejaVuSans-48"/>
      </g>
     </g>
    </g>
    <g id="ytick_2">
     <g id="line2d_12">
      <path clip-path="url(#pd9f483cd15)" d="M 54 208.512 
L 388.8 208.512 
" style="fill:none;stroke:#b0b0b0;stroke-dasharray:2.96,1.28;stroke-dashoffset:0;stroke-width:0.8;"/>
     </g>
     <g id="line2d_13">
      <g>
       <use style="stroke:#000000;stroke-width:0.8;" x="54" xlink:href="#mc6a3038a7f" y="208.512"/>
      </g>
     </g>
     <g id="text_12">
      <!-- 200000 -->
      <g transform="translate(8.825 212.311219)scale(0.1 -0.1)">
       <use xlink:href="#DejaVuSans-50"/>
       <use x="63.623047" xlink:href="#DejaVuSans-48"/>
       <use x="127.246094" xlink:href="#DejaVuSans-48"/>
       <use x="190.869141" xlink:href="#DejaVuSans-48"/>
       <use x="254.492188" xlink:href="#DejaVuSans-48"/>
       <use x="318.115234" xlink:href="#DejaVuSans-48"/>
      </g>
     </g>
    </g>
    <g id="ytick_3">
     <g id="line2d_14">
      <path clip-path="url(#pd9f483cd15)" d="M 54 165.024 
L 388.8 165.024 
" style="fill:none;stroke:#b0b0b0;stroke-dasharray:2.96,1.28;stroke-dashoffset:0;stroke-width:0.8;"/>
     </g>
     <g id="line2d_15">
      <g>
       <use style="stroke:#000000;stroke-width:0.8;" x="54" xlink:href="#mc6a3038a7f" y="165.024"/>
      </g>
     </g>
     <g id="text_13">
      <!-- 400000 -->
      <g transform="translate(8.825 168.823219)scale(0.1 -0.1)">
       <use xlink:href="#DejaVuSans-52"/>
       <use x="63.623047" xlink:href="#DejaVuSans-48"/>
       <use x="127.246094" xlink:href="#DejaVuSans-48"/>
       <use x="190.869141" xlink:href="#DejaVuSans-48"/>
       <use x="254.492188" xlink:href="#DejaVuSans-48"/>
       <use x="318.115234" xlink:href="#DejaVuSans-48"/>
      </g>
     </g>
    </g>
    <g id="ytick_4">
     <g id="line2d_16">
      <path clip-path="url(#pd9f483cd15)" d="M 54 121.536 
L 388.8 121.536 
" style="fill:none;stroke:#b0b0b0;stroke-dasharray:2.96,1.28;stroke-dashoffset:0;stroke-width:0.8;"/>
     </g>
     <g id="line2d_17">
      <g>
       <use style="stroke:#000000;stroke-width:0.8;" x="54" xlink:href="#mc6a3038a7f" y="121.536"/>
      </g>
     </g>
     <g id="text_14">
      <!-- 600000 -->
      <g transform="translate(8.825 125.335219)scale(0.1 -0.1)">
       <use xlink:href="#DejaVuSans-54"/>
       <use x="63.623047" xlink:href="#DejaVuSans-48"/>
       <use x="127.246094" xlink:href="#DejaVuSans-48"/>
       <use x="190.869141" xlink:href="#DejaVuSans-48"/>
       <use x="254.492188" xlink:href="#DejaVuSans-48"/>
       <use x="318.115234" xlink:href="#DejaVuSans-48"/>
      </g>
     </g>
    </g>
    <g id="ytick_5">
     <g id="line2d_18">
      <path clip-path="url(#pd9f483cd15)" d="M 54 78.048 
L 388.8 78.048 
" style="fill:none;stroke:#b0b0b0;stroke-dasharray:2.96,1.28;stroke-dashoffset:0;stroke-width:0.8;"/>
     </g>
     <g id="line2d_19">
      <g>
       <use style="stroke:#000000;stroke-width:0.8;" x="54" xlink:href="#mc6a3038a7f" y="78.048"/>
      </g>
     </g>
     <g id="text_15">
      <!-- 800000 -->
      <g transform="translate(8.825 81.847219)scale(0.1 -0.1)">
       <use xlink:href="#DejaVuSans-56"/>
       <use x="63.623047" xlink:href="#DejaVuSans-48"/>
       <use x="127.246094" xlink:href="#DejaVuSans-48"/>
       <use x="190.869141" xlink:href="#DejaVuSans-48"/>
       <use x="254.492188" xlink:href="#DejaVuSans-48"/>
       <use x="318.115234" xlink:href="#DejaVuSans-48"/>
      </g>
     </g>
    </g>
    <g id="ytick_6">
     <g id="line2d_20">
      <path clip-path="url(#pd9f483cd15)" d="M 54 34.56 
L 388.8 34.56 
" style="fill:none;stroke:#b0b0b0;stroke-dasharray:2.96,1.28;stroke-dashoffset:0;stroke-width:0.8;"/>
     </g>
     <g id="line2d_21">
      <g>
       <use style="stroke:#000000;stroke-width:0.8;" x="54" xlink:href="#mc6a3038a7f" y="34.56"/>
      </g>
     </g>
     <g id="text_16">
      <!-- 1000000 -->
      <g transform="translate(2.4625 38.359219)scale(0.1 -0.1)">
       <use xlink:href="#DejaVuSans-49"/>
       <use x="63.623047" xlink:href="#DejaVuSans-48"/>
       <use x="127.246094" xlink:href="#DejaVuSans-48"/>
       <use x="190.869141" xlink:href="#DejaVuSans-48"/>
       <use x="254.492188" xlink:href="#DejaVuSans-48"/>
       <use x="318.115234" xlink:href="#DejaVuSans-48"/>
       <use x="381.738281" xlink:href="#DejaVuSans-48"/>
      </g>
     </g>
    </g>
    <g id="text_17">
     <!-- Throughput (t/s) -->
     <defs>
      <path d="M -0.296875 72.90625 
L 61.375 72.90625 
L 61.375 64.59375 
L 35.5 64.59375 
L 35.5 0 
L 25.59375 0 
L 25.59375 64.59375 
L -0.296875 64.59375 
z
" id="DejaVuSans-84"/>
      <path d="M 41.109375 46.296875 
Q 39.59375 47.171875 37.8125 47.578125 
Q 36.03125 48 33.890625 48 
Q 26.265625 48 22.1875 43.046875 
Q 18.109375 38.09375 18.109375 28.8125 
L 18.109375 0 
L 9.078125 0 
L 9.078125 54.6875 
L 18.109375 54.6875 
L 18.109375 46.1875 
Q 20.953125 51.171875 25.484375 53.578125 
Q 30.03125 56 36.53125 56 
Q 37.453125 56 38.578125 55.875 
Q 39.703125 55.765625 41.0625 55.515625 
z
" id="DejaVuSans-114"/>
      <path d="M 30.609375 48.390625 
Q 23.390625 48.390625 19.1875 42.75 
Q 14.984375 37.109375 14.984375 27.296875 
Q 14.984375 17.484375 19.15625 11.84375 
Q 23.34375 6.203125 30.609375 6.203125 
Q 37.796875 6.203125 41.984375 11.859375 
Q 46.1875 17.53125 46.1875 27.296875 
Q 46.1875 37.015625 41.984375 42.703125 
Q 37.796875 48.390625 30.609375 48.390625 
z
M 30.609375 56 
Q 42.328125 56 49.015625 48.375 
Q 55.71875 40.765625 55.71875 27.296875 
Q 55.71875 13.875 49.015625 6.21875 
Q 42.328125 -1.421875 30.609375 -1.421875 
Q 18.84375 -1.421875 12.171875 6.21875 
Q 5.515625 13.875 5.515625 27.296875 
Q 5.515625 40.765625 12.171875 48.375 
Q 18.84375 56 30.609375 56 
z
" id="DejaVuSans-111"/>
      <path d="M 8.5 21.578125 
L 8.5 54.6875 
L 17.484375 54.6875 
L 17.484375 21.921875 
Q 17.484375 14.15625 20.5 10.265625 
Q 23.53125 6.390625 29.59375 6.390625 
Q 36.859375 6.390625 41.078125 11.03125 
Q 45.3125 15.671875 45.3125 23.6875 
L 45.3125 54.6875 
L 54.296875 54.6875 
L 54.296875 0 
L 45.3125 0 
L 45.3125 8.40625 
Q 42.046875 3.421875 37.71875 1 
Q 33.40625 -1.421875 27.6875 -1.421875 
Q 18.265625 -1.421875 13.375 4.4375 
Q 8.5 10.296875 8.5 21.578125 
z
M 31.109375 56 
z
" id="DejaVuSans-117"/>
      <path d="M 45.40625 27.984375 
Q 45.40625 37.75 41.375 43.109375 
Q 37.359375 48.484375 30.078125 48.484375 
Q 22.859375 48.484375 18.828125 43.109375 
Q 14.796875 37.75 14.796875 27.984375 
Q 14.796875 18.265625 18.828125 12.890625 
Q 22.859375 7.515625 30.078125 7.515625 
Q 37.359375 7.515625 41.375 12.890625 
Q 45.40625 18.265625 45.40625 27.984375 
z
M 54.390625 6.78125 
Q 54.390625 -7.171875 48.1875 -13.984375 
Q 42 -20.796875 29.203125 -20.796875 
Q 24.46875 -20.796875 20.265625 -20.09375 
Q 16.0625 -19.390625 12.109375 -17.921875 
L 12.109375 -9.1875 
Q 16.0625 -11.328125 19.921875 -12.34375 
Q 23.78125 -13.375 27.78125 -13.375 
Q 36.625 -13.375 41.015625 -8.765625 
Q 45.40625 -4.15625 45.40625 5.171875 
L 45.40625 9.625 
Q 42.625 4.78125 38.28125 2.390625 
Q 33.9375 0 27.875 0 
Q 17.828125 0 11.671875 7.65625 
Q 5.515625 15.328125 5.515625 27.984375 
Q 5.515625 40.671875 11.671875 48.328125 
Q 17.828125 56 27.875 56 
Q 33.9375 56 38.28125 53.609375 
Q 42.625 51.21875 45.40625 46.390625 
L 45.40625 54.6875 
L 54.390625 54.6875 
z
" id="DejaVuSans-103"/>
      <path d="M 18.109375 8.203125 
L 18.109375 -20.796875 
L 9.078125 -20.796875 
L 9.078125 54.6875 
L 18.109375 54.6875 
L 18.109375 46.390625 
Q 20.953125 51.265625 25.265625 53.625 
Q 29.59375 56 35.59375 56 
Q 45.5625 56 51.78125 48.09375 
Q 58.015625 40.1875 58.015625 27.296875 
Q 58.015625 14.40625 51.78125 6.484375 
Q 45.5625 -1.421875 35.59375 -1.421875 
Q 29.59375 -1.421875 25.265625 0.953125 
Q 20.953125 3.328125 18.109375 8.203125 
z
M 48.6875 27.296875 
Q 48.6875 37.203125 44.609375 42.84375 
Q 40.53125 48.484375 33.40625 48.484375 
Q 26.265625 48.484375 22.1875 42.84375 
Q 18.109375 37.203125 18.109375 27.296875 
Q 18.109375 17.390625 22.1875 11.75 
Q 26.265625 6.109375 33.40625 6.109375 
Q 40.53125 6.109375 44.609375 11.75 
Q 48.6875 17.390625 48.6875 27.296875 
z
" id="DejaVuSans-112"/>
      <path d="M 18.3125 70.21875 
L 18.3125 54.6875 
L 36.8125 54.6875 
L 36.8125 47.703125 
L 18.3125 47.703125 
L 18.3125 18.015625 
Q 18.3125 11.328125 20.140625 9.421875 
Q 21.96875 7.515625 27.59375 7.515625 
L 36.8125 7.515625 
L 36.8125 0 
L 27.59375 0 
Q 17.1875 0 13.234375 3.875 
Q 9.28125 7.765625 9.28125 18.015625 
L 9.28125 47.703125 
L 2.6875 47.703125 
L 2.6875 54.6875 
L 9.28125 54.6875 
L 9.28125 70.21875 
z
" id="DejaVuSans-116"/>
      <path id="DejaVuSans-32"/>
      <path d="M 31 75.875 
Q 24.46875 64.65625 21.28125 53.65625 
Q 18.109375 42.671875 18.109375 31.390625 
Q 18.109375 20.125 21.3125 9.0625 
Q 24.515625 -2 31 -13.1875 
L 23.1875 -13.1875 
Q 15.875 -1.703125 12.234375 9.375 
Q 8.59375 20.453125 8.59375 31.390625 
Q 8.59375 42.28125 12.203125 53.3125 
Q 15.828125 64.359375 23.1875 75.875 
z
" id="DejaVuSans-40"/>
      <path d="M 25.390625 72.90625 
L 33.6875 72.90625 
L 8.296875 -9.28125 
L 0 -9.28125 
z
" id="DejaVuSans-47"/>
      <path d="M 8.015625 75.875 
L 15.828125 75.875 
Q 23.140625 64.359375 26.78125 53.3125 
Q 30.421875 42.28125 30.421875 31.390625 
Q 30.421875 20.453125 26.78125 9.375 
Q 23.140625 -1.703125 15.828125 -13.1875 
L 8.015625 -13.1875 
Q 14.5 -2 17.703125 9.0625 
Q 20.90625 20.125 20.90625 31.390625 
Q 20.90625 42.671875 17.703125 53.65625 
Q 14.5 64.65625 8.015625 75.875 
z
" id="DejaVuSans-41"/>
     </defs>
     <g transform="translate(-3.617188 184.170625)rotate(-90)scale(0.1 -0.1)">
      <use xlink:href="#DejaVuSans-84"/>
      <use x="61.083984" xlink:href="#DejaVuSans-104"/>
      <use x="124.462891" xlink:href="#DejaVuSans-114"/>
      <use x="165.544922" xlink:href="#DejaVuSans-111"/>
      <use x="226.726562" xlink:href="#DejaVuSans-117"/>
      <use x="290.105469" xlink:href="#DejaVuSans-103"/>
      <use x="353.582031" xlink:href="#DejaVuSans-104"/>
      <use x="416.960938" xlink:href="#DejaVuSans-112"/>
      <use x="480.4375" xlink:href="#DejaVuSans-117"/>
      <use x="543.816406" xlink:href="#DejaVuSans-116"/>
      <use x="583.025391" xlink:href="#DejaVuSans-32"/>
      <use x="614.8125" xlink:href="#DejaVuSans-40"/>
      <use x="653.826172" xlink:href="#DejaVuSans-116"/>
      <use x="693.035156" xlink:href="#DejaVuSans-47"/>
      <use x="726.726562" xlink:href="#DejaVuSans-115"/>
      <use x="778.826172" xlink:href="#DejaVuSans-41"/>
     </g>
    </g>
   </g>
   <g id="patch_3">
    <path d="M 54 252 
L 54 34.56 
" style="fill:none;stroke:#000000;stroke-linecap:square;stroke-linejoin:miter;stroke-width:0.8;"/>
   </g>
   <g id="patch_4">
    <path d="M 388.8 252 
L 388.8 34.56 
" style="fill:none;stroke:#000000;stroke-linecap:square;stroke-linejoin:miter;stroke-width:0.8;"/>
   </g>
   <g id="patch_5">
    <path d="M 54 252 
L 388.8 252 
" style="fill:none;stroke:#000000;stroke-linecap:square;stroke-linejoin:miter;stroke-width:0.8;"/>
   </g>
   <g id="patch_6">
    <path d="M 54 34.56 
L 388.8 34.56 
" style="fill:none;stroke:#000000;stroke-linecap:square;stroke-linejoin:miter;stroke-width:0.8;"/>
   </g>
   <g id="legend_1">
    <g id="patch_7">
     <path d="M 395.8 203.4925 
L 435.548438 203.4925 
Q 437.548438 203.4925 437.548438 201.4925 
L 437.548438 85.0675 
Q 437.548438 83.0675 435.548438 83.0675 
L 395.8 83.0675 
Q 393.8 83.0675 393.8 85.0675 
L 393.8 201.4925 
Q 393.8 203.4925 395.8 203.4925 
z
" style="fill:#ffffff;opacity:0.8;stroke:#cccccc;stroke-linejoin:miter;"/>
    </g>
    <g id="patch_8">
     <path d="M 397.8 94.665938 
L 417.8 94.665938 
L 417.8 87.665938 
L 397.8 87.665938 
z
" style="fill:#1f77b4;"/>
    </g>
    <g id="text_18">
     <!-- A -->
     <defs>
      <path d="M 34.1875 63.1875 
L 20.796875 26.90625 
L 47.609375 26.90625 
z
M 28.609375 72.90625 
L 39.796875 72.90625 
L 67.578125 0 
L 57.328125 0 
L 50.6875 18.703125 
L 17.828125 18.703125 
L 11.1875 0 
L 0.78125 0 
z
" id="DejaVuSans-65"/>
     </defs>
     <g transform="translate(425.8 94.665938)scale(0.1 -0.1)">
      <use xlink:href="#DejaVuSans-65"/>
     </g>
    </g>
    <g id="patch_9">
     <path d="M 397.8 109.344063 
L 417.8 109.344063 
L 417.8 102.344063 
L 397.8 102.344063 
z
" style="fill:#ff7f0e;"/>
    </g>
    <g id="text_19">
     <!-- B -->
     <defs>
      <path d="M 19.671875 34.8125 
L 19.671875 8.109375 
L 35.5 8.109375 
Q 43.453125 8.109375 47.28125 11.40625 
Q 51.125 14.703125 51.125 21.484375 
Q 51.125 28.328125 47.28125 31.5625 
Q 43.453125 34.8125 35.5 34.8125 
z
M 19.671875 64.796875 
L 19.671875 42.828125 
L 34.28125 42.828125 
Q 41.5 42.828125 45.03125 45.53125 
Q 48.578125 48.25 48.578125 53.8125 
Q 48.578125 59.328125 45.03125 62.0625 
Q 41.5 64.796875 34.28125 64.796875 
z
M 9.8125 72.90625 
L 35.015625 72.90625 
Q 46.296875 72.90625 52.390625 68.21875 
Q 58.5 63.53125 58.5 54.890625 
Q 58.5 48.1875 55.375 44.234375 
Q 52.25 40.28125 46.1875 39.3125 
Q 53.46875 37.75 57.5 32.78125 
Q 61.53125 27.828125 61.53125 20.40625 
Q 61.53125 10.640625 54.890625 5.3125 
Q 48.25 0 35.984375 0 
L 9.8125 0 
z
" id="DejaVuSans-66"/>
     </defs>
     <g transform="translate(425.8 109.344063)scale(0.1 -0.1)">
      <use xlink:href="#DejaVuSans-66"/>
     </g>
    </g>
    <g id="patch_10">
     <path d="M 397.8 124.022188 
L 417.8 124.022188 
L 417.8 117.022188 
L 397.8 117.022188 
z
" style="fill:#2ca02c;"/>
    </g>
    <g id="text_20">
     <!-- C -->
     <defs>
      <path d="M 64.40625 67.28125 
L 64.40625 56.890625 
Q 59.421875 61.53125 53.78125 63.8125 
Q 48.140625 66.109375 41.796875 66.109375 
Q 29.296875 66.109375 22.65625 58.46875 
Q 16.015625 50.828125 16.015625 36.375 
Q 16.015625 21.96875 22.65625 14.328125 
Q 29.296875 6.6875 41.796875 6.6875 
Q 48.140625 6.6875 53.78125 8.984375 
Q 59.421875 11.28125 64.40625 15.921875 
L 64.40625 5.609375 
Q 59.234375 2.09375 53.4375 0.328125 
Q 47.65625 -1.421875 41.21875 -1.421875 
Q 24.65625 -1.421875 15.125 8.703125 
Q 5.609375 18.84375 5.609375 36.375 
Q 5.609375 53.953125 15.125 64.078125 
Q 24.65625 74.21875 41.21875 74.21875 
Q 47.75 74.21875 53.53125 72.484375 
Q 59.328125 70.75 64.40625 67.28125 
z
" id="DejaVuSans-67"/>
     </defs>
     <g transform="translate(425.8 124.022188)scale(0.1 -0.1)">
      <use xlink:href="#DejaVuSans-67"/>
     </g>
    </g>
    <g id="patch_11">
     <path d="M 397.8 138.700313 
L 417.8 138.700313 
L 417.8 131.700313 
L 397.8 131.700313 
z
" style="fill:#d62728;"/>
    </g>
    <g id="text_21">
     <!-- D -->
     <defs>
      <path d="M 19.671875 64.796875 
L 19.671875 8.109375 
L 31.59375 8.109375 
Q 46.6875 8.109375 53.6875 14.9375 
Q 60.6875 21.78125 60.6875 36.53125 
Q 60.6875 51.171875 53.6875 57.984375 
Q 46.6875 64.796875 31.59375 64.796875 
z
M 9.8125 72.90625 
L 30.078125 72.90625 
Q 51.265625 72.90625 61.171875 64.09375 
Q 71.09375 55.28125 71.09375 36.53125 
Q 71.09375 17.671875 61.125 8.828125 
Q 51.171875 0 30.078125 0 
L 9.8125 0 
z
" id="DejaVuSans-68"/>
     </defs>
     <g transform="translate(425.8 138.700313)scale(0.1 -0.1)">
      <use xlink:href="#DejaVuSans-68"/>
     </g>
    </g>
    <g id="patch_12">
     <path d="M 397.8 153.378438 
L 417.8 153.378438 
L 417.8 146.378438 
L 397.8 146.378438 
z
" style="fill:#9467bd;"/>
    </g>
    <g id="text_22">
     <!-- E -->
     <defs>
      <path d="M 9.8125 72.90625 
L 55.90625 72.90625 
L 55.90625 64.59375 
L 19.671875 64.59375 
L 19.671875 43.015625 
L 54.390625 43.015625 
L 54.390625 34.71875 
L 19.671875 34.71875 
L 19.671875 8.296875 
L 56.78125 8.296875 
L 56.78125 0 
L 9.8125 0 
z
" id="DejaVuSans-69"/>
     </defs>
     <g transform="translate(425.8 153.378438)scale(0.1 -0.1)">
      <use xlink:href="#DejaVuSans-69"/>
     </g>
    </g>
    <g id="patch_13">
     <path d="M 397.8 168.056563 
L 417.8 168.056563 
L 417.8 161.056563 
L 397.8 161.056563 
z
" style="fill:#8c564b;"/>
    </g>
    <g id="text_23">
     <!-- F -->
     <defs>
      <path d="M 9.8125 72.90625 
L 51.703125 72.90625 
L 51.703125 64.59375 
L 19.671875 64.59375 
L 19.671875 43.109375 
L 48.578125 43.109375 
L 48.578125 34.8125 
L 19.671875 34.8125 
L 19.671875 0 
L 9.8125 0 
z
" id="DejaVuSans-70"/>
     </defs>
     <g transform="translate(425.8 168.056563)scale(0.1 -0.1)">
      <use xlink:href="#DejaVuSans-70"/>
     </g>
    </g>
    <g id="patch_14">
     <path d="M 397.8 182.734688 
L 417.8 182.734688 
L 417.8 175.734688 
L 397.8 175.734688 
z
" style="fill:#e377c2;"/>
    </g>
    <g id="text_24">
     <!-- G -->
     <defs>
      <path d="M 59.515625 10.40625 
L 59.515625 29.984375 
L 43.40625 29.984375 
L 43.40625 38.09375 
L 69.28125 38.09375 
L 69.28125 6.78125 
Q 63.578125 2.734375 56.6875 0.65625 
Q 49.8125 -1.421875 42 -1.421875 
Q 24.90625 -1.421875 15.25 8.5625 
Q 5.609375 18.5625 5.609375 36.375 
Q 5.609375 54.25 15.25 64.234375 
Q 24.90625 74.21875 42 74.21875 
Q 49.125 74.21875 55.546875 72.453125 
Q 61.96875 70.703125 67.390625 67.28125 
L 67.390625 56.78125 
Q 61.921875 61.421875 55.765625 63.765625 
Q 49.609375 66.109375 42.828125 66.109375 
Q 29.4375 66.109375 22.71875 58.640625 
Q 16.015625 51.171875 16.015625 36.375 
Q 16.015625 21.625 22.71875 14.15625 
Q 29.4375 6.6875 42.828125 6.6875 
Q 48.046875 6.6875 52.140625 7.59375 
Q 56.25 8.5 59.515625 10.40625 
z
" id="DejaVuSans-71"/>
     </defs>
     <g transform="translate(425.8 182.734688)scale(0.1 -0.1)">
      <use xlink:href="#DejaVuSans-71"/>
     </g>
    </g>
    <g id="patch_15">
     <path d="M 397.8 197.412813 
L 417.8 197.412813 
L 417.8 190.412813 
L 397.8 190.412813 
z
" style="fill:#7f7f7f;"/>
    </g>
    <g id="text_25">
     <!-- H -->
     <defs>
      <path d="M 9.8125 72.90625 
L 19.671875 72.90625 
L 19.671875 43.015625 
L 55.515625 43.015625 
L 55.515625 72.90625 
L 65.375 72.90625 
L 65.375 0 
L 55.515625 0 
L 55.515625 34.71875 
L 19.671875 34.71875 
L 19.671875 0 
L 9.8125 0 
z
" id="DejaVuSans-72"/>
     </defs>
     <g transform="translate(425.8 197.412813)scale(0.1 -0.1)">
      <use xlink:href="#DejaVuSans-72"/>
     </g>
    </g>
   </g>
   <g id="patch_16">
    <path clip-path="url(#pd9f483cd15)" d="M 69.218182 252 
L 96.887603 252 
L 96.887603 213.32044 
L 69.218182 213.32044 
z
" style="fill:#1f77b4;"/>
   </g>
   <g id="patch_17">
    <path clip-path="url(#pd9f483cd15)" d="M 103.804959 252 
L 131.47438 252 
L 131.47438 214.084185 
L 103.804959 214.084185 
z
" style="fill:#1f77b4;"/>
   </g>
   <g id="patch_18">
    <path clip-path="url(#pd9f483cd15)" d="M 138.391736 252 
L 166.061157 252 
L 166.061157 206.90873 
L 138.391736 206.90873 
z
" style="fill:#1f77b4;"/>
   </g>
   <g id="patch_19">
    <path clip-path="url(#pd9f483cd15)" d="M 172.978512 252 
L 200.647934 252 
L 200.647934 244.761809 
L 172.978512 244.761809 
z
" style="fill:#1f77b4;"/>
   </g>
   <g id="patch_20">
    <path clip-path="url(#pd9f483cd15)" d="M 207.565289 252 
L 235.234711 252 
L 235.234711 208.224788 
L 207.565289 208.224788 
z
" style="fill:#1f77b4;"/>
   </g>
   <g id="patch_21">
    <path clip-path="url(#pd9f483cd15)" d="M 242.152066 252 
L 269.821488 252 
L 269.821488 246.679061 
L 242.152066 246.679061 
z
" style="fill:#1f77b4;"/>
   </g>
   <g id="patch_22">
    <path clip-path="url(#pd9f483cd15)" d="M 276.738843 252 
L 304.408264 252 
L 304.408264 246.874959 
L 276.738843 246.874959 
z
" style="fill:#1f77b4;"/>
   </g>
   <g id="patch_23">
    <path clip-path="url(#pd9f483cd15)" d="M 311.32562 252 
L 338.995041 252 
L 338.995041 246.666369 
L 311.32562 246.666369 
z
" style="fill:#1f77b4;"/>
   </g>
   <g id="patch_24">
    <path clip-path="url(#pd9f483cd15)" d="M 345.912397 252 
L 373.581818 252 
L 373.581818 209.030534 
L 345.912397 209.030534 
z
" style="fill:#1f77b4;"/>
   </g>
   <g id="patch_25">
    <path clip-path="url(#pd9f483cd15)" d="M 69.218182 213.32044 
L 96.887603 213.32044 
L 96.887603 213.32044 
L 69.218182 213.32044 
z
" style="fill:url(#h2fb585d55c);"/>
   </g>
   <g id="patch_26">
    <path clip-path="url(#pd9f483cd15)" d="M 103.804959 214.084185 
L 131.47438 214.084185 
L 131.47438 214.084185 
L 103.804959 214.084185 
z
" style="fill:url(#h2fb585d55c);"/>
   </g>
   <g id="patch_27">
    <path clip-path="url(#pd9f483cd15)" d="M 138.391736 206.90873 
L 166.061157 206.90873 
L 166.061157 201.844446 
L 138.391736 201.844446 
z
" style="fill:url(#h2fb585d55c);"/>
   </g>
   <g id="patch_28">
    <path clip-path="url(#pd9f483cd15)" d="M 172.978512 244.761809 
L 200.647934 244.761809 
L 200.647934 244.761809 
L 172.978512 244.761809 
z
" style="fill:url(#h2fb585d55c);"/>
   </g>
   <g id="patch_29">
    <path clip-path="url(#pd9f483cd15)" d="M 207.565289 208.224788 
L 235.234711 208.224788 
L 235.234711 208.178467 
L 207.565289 208.178467 
z
" style="fill:url(#h2fb585d55c);"/>
   </g>
   <g id="patch_30">
    <path clip-path="url(#pd9f483cd15)" d="M 242.152066 246.679061 
L 269.821488 246.679061 
L 269.821488 246.679061 
L 242.152066 246.679061 
z
" style="fill:url(#h2fb585d55c);"/>
   </g>
   <g id="patch_31">
    <path clip-path="url(#pd9f483cd15)" d="M 276.738843 246.874959 
L 304.408264 246.874959 
L 304.408264 246.874959 
L 276.738843 246.874959 
z
" style="fill:url(#h2fb585d55c);"/>
   </g>
   <g id="patch_32">
    <path clip-path="url(#pd9f483cd15)" d="M 311.32562 246.666369 
L 338.995041 246.666369 
L 338.995041 246.666369 
L 311.32562 246.666369 
z
" style="fill:url(#h2fb585d55c);"/>
   </g>
   <g id="patch_33">
    <path clip-path="url(#pd9f483cd15)" d="M 345.912397 209.030534 
L 373.581818 209.030534 
L 373.581818 209.025387 
L 345.912397 209.025387 
z
" style="fill:url(#h2fb585d55c);"/>
   </g>
   <g id="patch_34">
    <path clip-path="url(#pd9f483cd15)" d="M 69.218182 213.32044 
L 96.887603 213.32044 
L 96.887603 183.317658 
L 69.218182 183.317658 
z
" style="fill:#ff7f0e;"/>
   </g>
   <g id="patch_35">
    <path clip-path="url(#pd9f483cd15)" d="M 103.804959 214.084185 
L 131.47438 214.084185 
L 131.47438 183.650826 
L 103.804959 183.650826 
z
" style="fill:#ff7f0e;"/>
   </g>
   <g id="patch_36">
    <path clip-path="url(#pd9f483cd15)" d="M 138.391736 201.844446 
L 166.061157 201.844446 
L 166.061157 163.506691 
L 138.391736 163.506691 
z
" style="fill:#ff7f0e;"/>
   </g>
   <g id="patch_37">
    <path clip-path="url(#pd9f483cd15)" d="M 172.978512 244.761809 
L 200.647934 244.761809 
L 200.647934 233.547611 
L 172.978512 233.547611 
z
" style="fill:#ff7f0e;"/>
   </g>
   <g id="patch_38">
    <path clip-path="url(#pd9f483cd15)" d="M 207.565289 208.178467 
L 235.234711 208.178467 
L 235.234711 168.774133 
L 207.565289 168.774133 
z
" style="fill:#ff7f0e;"/>
   </g>
   <g id="patch_39">
    <path clip-path="url(#pd9f483cd15)" d="M 242.152066 246.679061 
L 269.821488 246.679061 
L 269.821488 241.415177 
L 242.152066 241.415177 
z
" style="fill:#ff7f0e;"/>
   </g>
   <g id="patch_40">
    <path clip-path="url(#pd9f483cd15)" d="M 276.738843 246.874959 
L 304.408264 246.874959 
L 304.408264 210.849506 
L 276.738843 210.849506 
z
" style="fill:#ff7f0e;"/>
   </g>
   <g id="patch_41">
    <path clip-path="url(#pd9f483cd15)" d="M 311.32562 246.666369 
L 338.995041 246.666369 
L 338.995041 207.674712 
L 311.32562 207.674712 
z
" style="fill:#ff7f0e;"/>
   </g>
   <g id="patch_42">
    <path clip-path="url(#pd9f483cd15)" d="M 345.912397 209.025387 
L 373.581818 209.025387 
L 373.581818 203.723856 
L 345.912397 203.723856 
z
" style="fill:#ff7f0e;"/>
   </g>
   <g id="patch_43">
    <path clip-path="url(#pd9f483cd15)" d="M 69.218182 183.317658 
L 96.887603 183.317658 
L 96.887603 183.317658 
L 69.218182 183.317658 
z
" style="fill:url(#h69f11f4b46);"/>
   </g>
   <g id="patch_44">
    <path clip-path="url(#pd9f483cd15)" d="M 103.804959 183.650826 
L 131.47438 183.650826 
L 131.47438 183.650826 
L 103.804959 183.650826 
z
" style="fill:url(#h69f11f4b46);"/>
   </g>
   <g id="patch_45">
    <path clip-path="url(#pd9f483cd15)" d="M 138.391736 163.506691 
L 166.061157 163.506691 
L 166.061157 163.300521 
L 138.391736 163.300521 
z
" style="fill:url(#h69f11f4b46);"/>
   </g>
   <g id="patch_46">
    <path clip-path="url(#pd9f483cd15)" d="M 172.978512 233.547611 
L 200.647934 233.547611 
L 200.647934 233.547611 
L 172.978512 233.547611 
z
" style="fill:url(#h69f11f4b46);"/>
   </g>
   <g id="patch_47">
    <path clip-path="url(#pd9f483cd15)" d="M 207.565289 168.774133 
L 235.234711 168.774133 
L 235.234711 168.714633 
L 207.565289 168.714633 
z
" style="fill:url(#h69f11f4b46);"/>
   </g>
   <g id="patch_48">
    <path clip-path="url(#pd9f483cd15)" d="M 242.152066 241.415177 
L 269.821488 241.415177 
L 269.821488 241.415177 
L 242.152066 241.415177 
z
" style="fill:url(#h69f11f4b46);"/>
   </g>
   <g id="patch_49">
    <path clip-path="url(#pd9f483cd15)" d="M 276.738843 210.849506 
L 304.408264 210.849506 
L 304.408264 210.849506 
L 276.738843 210.849506 
z
" style="fill:url(#h69f11f4b46);"/>
   </g>
   <g id="patch_50">
    <path clip-path="url(#pd9f483cd15)" d="M 311.32562 207.674712 
L 338.995041 207.674712 
L 338.995041 207.674712 
L 311.32562 207.674712 
z
" style="fill:url(#h69f11f4b46);"/>
   </g>
   <g id="patch_51">
    <path clip-path="url(#pd9f483cd15)" d="M 345.912397 203.723856 
L 373.581818 203.723856 
L 373.581818 203.723856 
L 345.912397 203.723856 
z
" style="fill:url(#h69f11f4b46);"/>
   </g>
   <g id="patch_52">
    <path clip-path="url(#pd9f483cd15)" d="M 69.218182 183.317658 
L 96.887603 183.317658 
L 96.887603 157.994948 
L 69.218182 157.994948 
z
" style="fill:#2ca02c;"/>
   </g>
   <g id="patch_53">
    <path clip-path="url(#pd9f483cd15)" d="M 103.804959 183.650826 
L 131.47438 183.650826 
L 131.47438 155.194273 
L 103.804959 155.194273 
z
" style="fill:#2ca02c;"/>
   </g>
   <g id="patch_54">
    <path clip-path="url(#pd9f483cd15)" d="M 138.391736 163.300521 
L 166.061157 163.300521 
L 166.061157 145.041834 
L 138.391736 145.041834 
z
" style="fill:#2ca02c;"/>
   </g>
   <g id="patch_55">
    <path clip-path="url(#pd9f483cd15)" d="M 172.978512 233.547611 
L 200.647934 233.547611 
L 200.647934 198.711931 
L 172.978512 198.711931 
z
" style="fill:#2ca02c;"/>
   </g>
   <g id="patch_56">
    <path clip-path="url(#pd9f483cd15)" d="M 207.565289 168.714633 
L 235.234711 168.714633 
L 235.234711 132.292457 
L 207.565289 132.292457 
z
" style="fill:#2ca02c;"/>
   </g>
   <g id="patch_57">
    <path clip-path="url(#pd9f483cd15)" d="M 242.152066 241.415177 
L 269.821488 241.415177 
L 269.821488 209.396174 
L 242.152066 209.396174 
z
" style="fill:#2ca02c;"/>
   </g>
   <g id="patch_58">
    <path clip-path="url(#pd9f483cd15)" d="M 276.738843 210.849506 
L 304.408264 210.849506 
L 304.408264 176.025488 
L 276.738843 176.025488 
z
" style="fill:#2ca02c;"/>
   </g>
   <g id="patch_59">
    <path clip-path="url(#pd9f483cd15)" d="M 311.32562 207.674712 
L 338.995041 207.674712 
L 338.995041 202.455165 
L 311.32562 202.455165 
z
" style="fill:#2ca02c;"/>
   </g>
   <g id="patch_60">
    <path clip-path="url(#pd9f483cd15)" d="M 345.912397 203.723856 
L 373.581818 203.723856 
L 373.581818 169.919864 
L 345.912397 169.919864 
z
" style="fill:#2ca02c;"/>
   </g>
   <g id="patch_61">
    <path clip-path="url(#pd9f483cd15)" d="M 69.218182 157.994948 
L 96.887603 157.994948 
L 96.887603 157.994948 
L 69.218182 157.994948 
z
" style="fill:url(#h6748529660);"/>
   </g>
   <g id="patch_62">
    <path clip-path="url(#pd9f483cd15)" d="M 103.804959 155.194273 
L 131.47438 155.194273 
L 131.47438 155.194273 
L 103.804959 155.194273 
z
" style="fill:url(#h6748529660);"/>
   </g>
   <g id="patch_63">
    <path clip-path="url(#pd9f483cd15)" d="M 138.391736 145.041834 
L 166.061157 145.041834 
L 166.061157 145.041834 
L 138.391736 145.041834 
z
" style="fill:url(#h6748529660);"/>
   </g>
   <g id="patch_64">
    <path clip-path="url(#pd9f483cd15)" d="M 172.978512 198.711931 
L 200.647934 198.711931 
L 200.647934 198.392832 
L 172.978512 198.392832 
z
" style="fill:url(#h6748529660);"/>
   </g>
   <g id="patch_65">
    <path clip-path="url(#pd9f483cd15)" d="M 207.565289 132.292457 
L 235.234711 132.292457 
L 235.234711 131.583148 
L 207.565289 131.583148 
z
" style="fill:url(#h6748529660);"/>
   </g>
   <g id="patch_66">
    <path clip-path="url(#pd9f483cd15)" d="M 242.152066 209.396174 
L 269.821488 209.396174 
L 269.821488 209.396174 
L 242.152066 209.396174 
z
" style="fill:url(#h6748529660);"/>
   </g>
   <g id="patch_67">
    <path clip-path="url(#pd9f483cd15)" d="M 276.738843 176.025488 
L 304.408264 176.025488 
L 304.408264 175.997784 
L 276.738843 175.997784 
z
" style="fill:url(#h6748529660);"/>
   </g>
   <g id="patch_68">
    <path clip-path="url(#pd9f483cd15)" d="M 311.32562 202.455165 
L 338.995041 202.455165 
L 338.995041 202.455165 
L 311.32562 202.455165 
z
" style="fill:url(#h6748529660);"/>
   </g>
   <g id="patch_69">
    <path clip-path="url(#pd9f483cd15)" d="M 345.912397 169.919864 
L 373.581818 169.919864 
L 373.581818 169.919712 
L 345.912397 169.919712 
z
" style="fill:url(#h6748529660);"/>
   </g>
   <g id="patch_70">
    <path clip-path="url(#pd9f483cd15)" d="M 69.218182 157.994948 
L 96.887603 157.994948 
L 96.887603 131.337001 
L 69.218182 131.337001 
z
" style="fill:#d62728;"/>
   </g>
   <g id="patch_71">
    <path clip-path="url(#pd9f483cd15)" d="M 103.804959 155.194273 
L 131.47438 155.194273 
L 131.47438 126.458152 
L 103.804959 126.458152 
z
" style="fill:#d62728;"/>
   </g>
   <g id="patch_72">
    <path clip-path="url(#pd9f483cd15)" d="M 138.391736 145.041834 
L 166.061157 145.041834 
L 166.061157 133.773875 
L 138.391736 133.773875 
z
" style="fill:#d62728;"/>
   </g>
   <g id="patch_73">
    <path clip-path="url(#pd9f483cd15)" d="M 172.978512 198.392832 
L 200.647934 198.392832 
L 200.647934 193.250247 
L 172.978512 193.250247 
z
" style="fill:#d62728;"/>
   </g>
   <g id="patch_74">
    <path clip-path="url(#pd9f483cd15)" d="M 207.565289 131.583148 
L 235.234711 131.583148 
L 235.234711 126.328619 
L 207.565289 126.328619 
z
" style="fill:#d62728;"/>
   </g>
   <g id="patch_75">
    <path clip-path="url(#pd9f483cd15)" d="M 242.152066 209.396174 
L 269.821488 209.396174 
L 269.821488 174.819041 
L 242.152066 174.819041 
z
" style="fill:#d62728;"/>
   </g>
   <g id="patch_76">
    <path clip-path="url(#pd9f483cd15)" d="M 276.738843 175.997784 
L 304.408264 175.997784 
L 304.408264 170.754151 
L 276.738843 170.754151 
z
" style="fill:#d62728;"/>
   </g>
   <g id="patch_77">
    <path clip-path="url(#pd9f483cd15)" d="M 311.32562 202.455165 
L 338.995041 202.455165 
L 338.995041 167.984572 
L 311.32562 167.984572 
z
" style="fill:#d62728;"/>
   </g>
   <g id="patch_78">
    <path clip-path="url(#pd9f483cd15)" d="M 345.912397 169.919712 
L 373.581818 169.919712 
L 373.581818 135.60125 
L 345.912397 135.60125 
z
" style="fill:#d62728;"/>
   </g>
   <g id="patch_79">
    <path clip-path="url(#pd9f483cd15)" d="M 69.218182 131.337001 
L 96.887603 131.337001 
L 96.887603 131.337001 
L 69.218182 131.337001 
z
" style="fill:url(#h4cee433ef5);"/>
   </g>
   <g id="patch_80">
    <path clip-path="url(#pd9f483cd15)" d="M 103.804959 126.458152 
L 131.47438 126.458152 
L 131.47438 126.458152 
L 103.804959 126.458152 
z
" style="fill:url(#h4cee433ef5);"/>
   </g>
   <g id="patch_81">
    <path clip-path="url(#pd9f483cd15)" d="M 138.391736 133.773875 
L 166.061157 133.773875 
L 166.061157 133.773875 
L 138.391736 133.773875 
z
" style="fill:url(#h4cee433ef5);"/>
   </g>
   <g id="patch_82">
    <path clip-path="url(#pd9f483cd15)" d="M 172.978512 193.250247 
L 200.647934 193.250247 
L 200.647934 193.250247 
L 172.978512 193.250247 
z
" style="fill:url(#h4cee433ef5);"/>
   </g>
   <g id="patch_83">
    <path clip-path="url(#pd9f483cd15)" d="M 207.565289 126.328619 
L 235.234711 126.328619 
L 235.234711 126.328619 
L 207.565289 126.328619 
z
" style="fill:url(#h4cee433ef5);"/>
   </g>
   <g id="patch_84">
    <path clip-path="url(#pd9f483cd15)" d="M 242.152066 174.819041 
L 269.821488 174.819041 
L 269.821488 174.464695 
L 242.152066 174.464695 
z
" style="fill:url(#h4cee433ef5);"/>
   </g>
   <g id="patch_85">
    <path clip-path="url(#pd9f483cd15)" d="M 276.738843 170.754151 
L 304.408264 170.754151 
L 304.408264 170.754151 
L 276.738843 170.754151 
z
" style="fill:url(#h4cee433ef5);"/>
   </g>
   <g id="patch_86">
    <path clip-path="url(#pd9f483cd15)" d="M 311.32562 167.984572 
L 338.995041 167.984572 
L 338.995041 167.977727 
L 311.32562 167.977727 
z
" style="fill:url(#h4cee433ef5);"/>
   </g>
   <g id="patch_87">
    <path clip-path="url(#pd9f483cd15)" d="M 345.912397 135.60125 
L 373.581818 135.60125 
L 373.581818 135.60125 
L 345.912397 135.60125 
z
" style="fill:url(#h4cee433ef5);"/>
   </g>
   <g id="patch_88">
    <path clip-path="url(#pd9f483cd15)" d="M 69.218182 131.337001 
L 96.887603 131.337001 
L 96.887603 103.875314 
L 69.218182 103.875314 
z
" style="fill:#9467bd;"/>
   </g>
   <g id="patch_89">
    <path clip-path="url(#pd9f483cd15)" d="M 103.804959 126.458152 
L 131.47438 126.458152 
L 131.47438 98.866236 
L 103.804959 98.866236 
z
" style="fill:#9467bd;"/>
   </g>
   <g id="patch_90">
    <path clip-path="url(#pd9f483cd15)" d="M 138.391736 133.773875 
L 166.061157 133.773875 
L 166.061157 128.439542 
L 138.391736 128.439542 
z
" style="fill:#9467bd;"/>
   </g>
   <g id="patch_91">
    <path clip-path="url(#pd9f483cd15)" d="M 172.978512 193.250247 
L 200.647934 193.250247 
L 200.647934 161.947089 
L 172.978512 161.947089 
z
" style="fill:#9467bd;"/>
   </g>
   <g id="patch_92">
    <path clip-path="url(#pd9f483cd15)" d="M 207.565289 126.328619 
L 235.234711 126.328619 
L 235.234711 95.897017 
L 207.565289 95.897017 
z
" style="fill:#9467bd;"/>
   </g>
   <g id="patch_93">
    <path clip-path="url(#pd9f483cd15)" d="M 242.152066 174.464695 
L 269.821488 174.464695 
L 269.821488 143.153335 
L 242.152066 143.153335 
z
" style="fill:#9467bd;"/>
   </g>
   <g id="patch_94">
    <path clip-path="url(#pd9f483cd15)" d="M 276.738843 170.754151 
L 304.408264 170.754151 
L 304.408264 139.442791 
L 276.738843 139.442791 
z
" style="fill:#9467bd;"/>
   </g>
   <g id="patch_95">
    <path clip-path="url(#pd9f483cd15)" d="M 311.32562 167.977727 
L 338.995041 167.977727 
L 338.995041 136.883239 
L 311.32562 136.883239 
z
" style="fill:#9467bd;"/>
   </g>
   <g id="patch_96">
    <path clip-path="url(#pd9f483cd15)" d="M 345.912397 135.60125 
L 373.581818 135.60125 
L 373.581818 130.526483 
L 345.912397 130.526483 
z
" style="fill:#9467bd;"/>
   </g>
   <g id="patch_97">
    <path clip-path="url(#pd9f483cd15)" d="M 69.218182 103.875314 
L 96.887603 103.875314 
L 96.887603 103.875314 
L 69.218182 103.875314 
z
" style="fill:url(#h453631b812);"/>
   </g>
   <g id="patch_98">
    <path clip-path="url(#pd9f483cd15)" d="M 103.804959 98.866236 
L 131.47438 98.866236 
L 131.47438 98.866236 
L 103.804959 98.866236 
z
" style="fill:url(#h453631b812);"/>
   </g>
   <g id="patch_99">
    <path clip-path="url(#pd9f483cd15)" d="M 138.391736 128.439542 
L 166.061157 128.439542 
L 166.061157 128.439542 
L 138.391736 128.439542 
z
" style="fill:url(#h453631b812);"/>
   </g>
   <g id="patch_100">
    <path clip-path="url(#pd9f483cd15)" d="M 172.978512 161.947089 
L 200.647934 161.947089 
L 200.647934 143.686074 
L 172.978512 143.686074 
z
" style="fill:url(#h453631b812);"/>
   </g>
   <g id="patch_101">
    <path clip-path="url(#pd9f483cd15)" d="M 207.565289 95.897017 
L 235.234711 95.897017 
L 235.234711 95.839654 
L 207.565289 95.839654 
z
" style="fill:url(#h453631b812);"/>
   </g>
   <g id="patch_102">
    <path clip-path="url(#pd9f483cd15)" d="M 242.152066 143.153335 
L 269.821488 143.153335 
L 269.821488 127.68554 
L 242.152066 127.68554 
z
" style="fill:url(#h453631b812);"/>
   </g>
   <g id="patch_103">
    <path clip-path="url(#pd9f483cd15)" d="M 276.738843 139.442791 
L 304.408264 139.442791 
L 304.408264 126.927151 
L 276.738843 126.927151 
z
" style="fill:url(#h453631b812);"/>
   </g>
   <g id="patch_104">
    <path clip-path="url(#pd9f483cd15)" d="M 311.32562 136.883239 
L 338.995041 136.883239 
L 338.995041 130.355808 
L 311.32562 130.355808 
z
" style="fill:url(#h453631b812);"/>
   </g>
   <g id="patch_105">
    <path clip-path="url(#pd9f483cd15)" d="M 345.912397 130.526483 
L 373.581818 130.526483 
L 373.581818 130.526483 
L 345.912397 130.526483 
z
" style="fill:url(#h453631b812);"/>
   </g>
   <g id="patch_106">
    <path clip-path="url(#pd9f483cd15)" d="M 69.218182 103.875314 
L 96.887603 103.875314 
L 96.887603 83.100094 
L 69.218182 83.100094 
z
" style="fill:#8c564b;"/>
   </g>
   <g id="patch_107">
    <path clip-path="url(#pd9f483cd15)" d="M 103.804959 98.866236 
L 131.47438 98.866236 
L 131.47438 73.954531 
L 103.804959 73.954531 
z
" style="fill:#8c564b;"/>
   </g>
   <g id="patch_108">
    <path clip-path="url(#pd9f483cd15)" d="M 138.391736 128.439542 
L 166.061157 128.439542 
L 166.061157 117.791598 
L 138.391736 117.791598 
z
" style="fill:#8c564b;"/>
   </g>
   <g id="patch_109">
    <path clip-path="url(#pd9f483cd15)" d="M 172.978512 143.686074 
L 200.647934 143.686074 
L 200.647934 112.752816 
L 172.978512 112.752816 
z
" style="fill:#8c564b;"/>
   </g>
   <g id="patch_110">
    <path clip-path="url(#pd9f483cd15)" d="M 207.565289 95.839654 
L 235.234711 95.839654 
L 235.234711 90.557478 
L 207.565289 90.557478 
z
" style="fill:#8c564b;"/>
   </g>
   <g id="patch_111">
    <path clip-path="url(#pd9f483cd15)" d="M 242.152066 127.68554 
L 269.821488 127.68554 
L 269.821488 96.727405 
L 242.152066 96.727405 
z
" style="fill:#8c564b;"/>
   </g>
   <g id="patch_112">
    <path clip-path="url(#pd9f483cd15)" d="M 276.738843 126.927151 
L 304.408264 126.927151 
L 304.408264 96.53953 
L 276.738843 96.53953 
z
" style="fill:#8c564b;"/>
   </g>
   <g id="patch_113">
    <path clip-path="url(#pd9f483cd15)" d="M 311.32562 130.355808 
L 338.995041 130.355808 
L 338.995041 99.911251 
L 311.32562 99.911251 
z
" style="fill:#8c564b;"/>
   </g>
   <g id="patch_114">
    <path clip-path="url(#pd9f483cd15)" d="M 345.912397 130.526483 
L 373.581818 130.526483 
L 373.581818 99.811176 
L 345.912397 99.811176 
z
" style="fill:#8c564b;"/>
   </g>
   <g id="patch_115">
    <path clip-path="url(#pd9f483cd15)" d="M 69.218182 83.100094 
L 96.887603 83.100094 
L 96.887603 83.100094 
L 69.218182 83.100094 
z
" style="fill:url(#h20cfde9381);"/>
   </g>
   <g id="patch_116">
    <path clip-path="url(#pd9f483cd15)" d="M 103.804959 73.954531 
L 131.47438 73.954531 
L 131.47438 73.954531 
L 103.804959 73.954531 
z
" style="fill:url(#h20cfde9381);"/>
   </g>
   <g id="patch_117">
    <path clip-path="url(#pd9f483cd15)" d="M 138.391736 117.791598 
L 166.061157 117.791598 
L 166.061157 117.791598 
L 138.391736 117.791598 
z
" style="fill:url(#h20cfde9381);"/>
   </g>
   <g id="patch_118">
    <path clip-path="url(#pd9f483cd15)" d="M 172.978512 112.752816 
L 200.647934 112.752816 
L 200.647934 105.129411 
L 172.978512 105.129411 
z
" style="fill:url(#h20cfde9381);"/>
   </g>
   <g id="patch_119">
    <path clip-path="url(#pd9f483cd15)" d="M 207.565289 90.557478 
L 235.234711 90.557478 
L 235.234711 90.557478 
L 207.565289 90.557478 
z
" style="fill:url(#h20cfde9381);"/>
   </g>
   <g id="patch_120">
    <path clip-path="url(#pd9f483cd15)" d="M 242.152066 96.727405 
L 269.821488 96.727405 
L 269.821488 90.895714 
L 242.152066 90.895714 
z
" style="fill:url(#h20cfde9381);"/>
   </g>
   <g id="patch_121">
    <path clip-path="url(#pd9f483cd15)" d="M 276.738843 96.53953 
L 304.408264 96.53953 
L 304.408264 96.539339 
L 276.738843 96.539339 
z
" style="fill:url(#h20cfde9381);"/>
   </g>
   <g id="patch_122">
    <path clip-path="url(#pd9f483cd15)" d="M 311.32562 99.911251 
L 338.995041 99.911251 
L 338.995041 99.895151 
L 311.32562 99.895151 
z
" style="fill:url(#h20cfde9381);"/>
   </g>
   <g id="patch_123">
    <path clip-path="url(#pd9f483cd15)" d="M 345.912397 99.811176 
L 373.581818 99.811176 
L 373.581818 99.683917 
L 345.912397 99.683917 
z
" style="fill:url(#h20cfde9381);"/>
   </g>
   <g id="patch_124">
    <path clip-path="url(#pd9f483cd15)" d="M 69.218182 83.100094 
L 96.887603 83.100094 
L 96.887603 67.00544 
L 69.218182 67.00544 
z
" style="fill:#e377c2;"/>
   </g>
   <g id="patch_125">
    <path clip-path="url(#pd9f483cd15)" d="M 103.804959 73.954531 
L 131.47438 73.954531 
L 131.47438 68.761562 
L 103.804959 68.761562 
z
" style="fill:#e377c2;"/>
   </g>
   <g id="patch_126">
    <path clip-path="url(#pd9f483cd15)" d="M 138.391736 117.791598 
L 166.061157 117.791598 
L 166.061157 92.931414 
L 138.391736 92.931414 
z
" style="fill:#e377c2;"/>
   </g>
   <g id="patch_127">
    <path clip-path="url(#pd9f483cd15)" d="M 172.978512 105.129411 
L 200.647934 105.129411 
L 200.647934 100.021784 
L 172.978512 100.021784 
z
" style="fill:#e377c2;"/>
   </g>
   <g id="patch_128">
    <path clip-path="url(#pd9f483cd15)" d="M 207.565289 90.557478 
L 235.234711 90.557478 
L 235.234711 85.413726 
L 207.565289 85.413726 
z
" style="fill:#e377c2;"/>
   </g>
   <g id="patch_129">
    <path clip-path="url(#pd9f483cd15)" d="M 242.152066 90.895714 
L 269.821488 90.895714 
L 269.821488 85.762884 
L 242.152066 85.762884 
z
" style="fill:#e377c2;"/>
   </g>
   <g id="patch_130">
    <path clip-path="url(#pd9f483cd15)" d="M 276.738843 96.539339 
L 304.408264 96.539339 
L 304.408264 91.291275 
L 276.738843 91.291275 
z
" style="fill:#e377c2;"/>
   </g>
   <g id="patch_131">
    <path clip-path="url(#pd9f483cd15)" d="M 311.32562 99.895151 
L 338.995041 99.895151 
L 338.995041 76.506463 
L 311.32562 76.506463 
z
" style="fill:#e377c2;"/>
   </g>
   <g id="patch_132">
    <path clip-path="url(#pd9f483cd15)" d="M 345.912397 99.683917 
L 373.581818 99.683917 
L 373.581818 76.461186 
L 345.912397 76.461186 
z
" style="fill:#e377c2;"/>
   </g>
   <g id="patch_133">
    <path clip-path="url(#pd9f483cd15)" d="M 69.218182 67.00544 
L 96.887603 67.00544 
L 96.887603 67.00544 
L 69.218182 67.00544 
z
" style="fill:url(#hb631158508);"/>
   </g>
   <g id="patch_134">
    <path clip-path="url(#pd9f483cd15)" d="M 103.804959 68.761562 
L 131.47438 68.761562 
L 131.47438 68.761562 
L 103.804959 68.761562 
z
" style="fill:url(#hb631158508);"/>
   </g>
   <g id="patch_135">
    <path clip-path="url(#pd9f483cd15)" d="M 138.391736 92.931414 
L 166.061157 92.931414 
L 166.061157 89.328007 
L 138.391736 89.328007 
z
" style="fill:url(#hb631158508);"/>
   </g>
   <g id="patch_136">
    <path clip-path="url(#pd9f483cd15)" d="M 172.978512 100.021784 
L 200.647934 100.021784 
L 200.647934 100.021784 
L 172.978512 100.021784 
z
" style="fill:url(#hb631158508);"/>
   </g>
   <g id="patch_137">
    <path clip-path="url(#pd9f483cd15)" d="M 207.565289 85.413726 
L 235.234711 85.413726 
L 235.234711 85.413726 
L 207.565289 85.413726 
z
" style="fill:url(#hb631158508);"/>
   </g>
   <g id="patch_138">
    <path clip-path="url(#pd9f483cd15)" d="M 242.152066 85.762884 
L 269.821488 85.762884 
L 269.821488 85.762884 
L 242.152066 85.762884 
z
" style="fill:url(#hb631158508);"/>
   </g>
   <g id="patch_139">
    <path clip-path="url(#pd9f483cd15)" d="M 276.738843 91.291275 
L 304.408264 91.291275 
L 304.408264 91.291275 
L 276.738843 91.291275 
z
" style="fill:url(#hb631158508);"/>
   </g>
   <g id="patch_140">
    <path clip-path="url(#pd9f483cd15)" d="M 311.32562 76.506463 
L 338.995041 76.506463 
L 338.995041 76.506463 
L 311.32562 76.506463 
z
" style="fill:url(#hb631158508);"/>
   </g>
   <g id="patch_141">
    <path clip-path="url(#pd9f483cd15)" d="M 345.912397 76.461186 
L 373.581818 76.461186 
L 373.581818 76.461186 
L 345.912397 76.461186 
z
" style="fill:url(#hb631158508);"/>
   </g>
   <g id="patch_142">
    <path clip-path="url(#pd9f483cd15)" d="M 69.218182 67.00544 
L 96.887603 67.00544 
L 96.887603 50.291614 
L 69.218182 50.291614 
z
" style="fill:#7f7f7f;"/>
   </g>
   <g id="patch_143">
    <path clip-path="url(#pd9f483cd15)" d="M 103.804959 68.761562 
L 131.47438 68.761562 
L 131.47438 48.235219 
L 103.804959 48.235219 
z
" style="fill:#7f7f7f;"/>
   </g>
   <g id="patch_144">
    <path clip-path="url(#pd9f483cd15)" d="M 138.391736 89.328007 
L 166.061157 89.328007 
L 166.061157 80.567323 
L 138.391736 80.567323 
z
" style="fill:#7f7f7f;"/>
   </g>
   <g id="patch_145">
    <path clip-path="url(#pd9f483cd15)" d="M 172.978512 100.021784 
L 200.647934 100.021784 
L 200.647934 94.772522 
L 172.978512 94.772522 
z
" style="fill:#7f7f7f;"/>
   </g>
   <g id="patch_146">
    <path clip-path="url(#pd9f483cd15)" d="M 207.565289 85.413726 
L 235.234711 85.413726 
L 235.234711 66.604818 
L 207.565289 66.604818 
z
" style="fill:#7f7f7f;"/>
   </g>
   <g id="patch_147">
    <path clip-path="url(#pd9f483cd15)" d="M 242.152066 85.762884 
L 269.821488 85.762884 
L 269.821488 80.519664 
L 242.152066 80.519664 
z
" style="fill:#7f7f7f;"/>
   </g>
   <g id="patch_148">
    <path clip-path="url(#pd9f483cd15)" d="M 276.738843 91.291275 
L 304.408264 91.291275 
L 304.408264 72.398717 
L 276.738843 72.398717 
z
" style="fill:#7f7f7f;"/>
   </g>
   <g id="patch_149">
    <path clip-path="url(#pd9f483cd15)" d="M 311.32562 76.506463 
L 338.995041 76.506463 
L 338.995041 57.576689 
L 311.32562 57.576689 
z
" style="fill:#7f7f7f;"/>
   </g>
   <g id="patch_150">
    <path clip-path="url(#pd9f483cd15)" d="M 345.912397 76.461186 
L 373.581818 76.461186 
L 373.581818 55.760898 
L 345.912397 55.760898 
z
" style="fill:#7f7f7f;"/>
   </g>
   <g id="patch_151">
    <path clip-path="url(#pd9f483cd15)" d="M 69.218182 50.291614 
L 96.887603 50.291614 
L 96.887603 50.291614 
L 69.218182 50.291614 
z
" style="fill:url(#h2c0979a328);"/>
   </g>
   <g id="patch_152">
    <path clip-path="url(#pd9f483cd15)" d="M 103.804959 48.235219 
L 131.47438 48.235219 
L 131.47438 48.168998 
L 103.804959 48.168998 
z
" style="fill:url(#h2c0979a328);"/>
   </g>
   <g id="patch_153">
    <path clip-path="url(#pd9f483cd15)" d="M 138.391736 80.567323 
L 166.061157 80.567323 
L 166.061157 80.459623 
L 138.391736 80.459623 
z
" style="fill:url(#h2c0979a328);"/>
   </g>
   <g id="patch_154">
    <path clip-path="url(#pd9f483cd15)" d="M 172.978512 94.772522 
L 200.647934 94.772522 
L 200.647934 94.772522 
L 172.978512 94.772522 
z
" style="fill:url(#h2c0979a328);"/>
   </g>
   <g id="patch_155">
    <path clip-path="url(#pd9f483cd15)" d="M 207.565289 66.604818 
L 235.234711 66.604818 
L 235.234711 66.604818 
L 207.565289 66.604818 
z
" style="fill:url(#h2c0979a328);"/>
   </g>
   <g id="patch_156">
    <path clip-path="url(#pd9f483cd15)" d="M 242.152066 80.519664 
L 269.821488 80.519664 
L 269.821488 80.519664 
L 242.152066 80.519664 
z
" style="fill:url(#h2c0979a328);"/>
   </g>
   <g id="patch_157">
    <path clip-path="url(#pd9f483cd15)" d="M 276.738843 72.398717 
L 304.408264 72.398717 
L 304.408264 72.398717 
L 276.738843 72.398717 
z
" style="fill:url(#h2c0979a328);"/>
   </g>
   <g id="patch_158">
    <path clip-path="url(#pd9f483cd15)" d="M 311.32562 57.576689 
L 338.995041 57.576689 
L 338.995041 57.530957 
L 311.32562 57.530957 
z
" style="fill:url(#h2c0979a328);"/>
   </g>
   <g id="patch_159">
    <path clip-path="url(#pd9f483cd15)" d="M 345.912397 55.760898 
L 373.581818 55.760898 
L 373.581818 52.537685 
L 345.912397 52.537685 
z
" style="fill:url(#h2c0979a328);"/>
   </g>
  </g>
 </g>
 <defs>
  <clipPath id="pd9f483cd15">
   <rect height="217.44" width="334.8" x="54" y="34.56"/>
  </clipPath>
 </defs>
 <defs>
  <pattern height="72" id="h2fb585d55c" patternUnits="userSpaceOnUse" width="72" x="0" y="0">
   <rect fill="#1f77b4" height="73" width="73" x="0" y="0"/>
   <path d="M -36 36 
L 36 -36 
M -32 40 
L 40 -32 
M -28 44 
L 44 -28 
M -24 48 
L 48 -24 
M -20 52 
L 52 -20 
M -16 56 
L 56 -16 
M -12 60 
L 60 -12 
M -8 64 
L 64 -8 
M -4 68 
L 68 -4 
M 0 72 
L 72 0 
M 4 76 
L 76 4 
M 8 80 
L 80 8 
M 12 84 
L 84 12 
M 16 88 
L 88 16 
M 20 92 
L 92 20 
M 24 96 
L 96 24 
M 28 100 
L 100 28 
M 32 104 
L 104 32 
M 36 108 
L 108 36 
" style="fill:#000000;stroke:#000000;stroke-linecap:butt;stroke-linejoin:miter;stroke-width:1.0;"/>
  </pattern>
  <pattern height="72" id="h69f11f4b46" patternUnits="userSpaceOnUse" width="72" x="0" y="0">
   <rect fill="#ff7f0e" height="73" width="73" x="0" y="0"/>
   <path d="M -36 36 
L 36 -36 
M -32 40 
L 40 -32 
M -28 44 
L 44 -28 
M -24 48 
L 48 -24 
M -20 52 
L 52 -20 
M -16 56 
L 56 -16 
M -12 60 
L 60 -12 
M -8 64 
L 64 -8 
M -4 68 
L 68 -4 
M 0 72 
L 72 0 
M 4 76 
L 76 4 
M 8 80 
L 80 8 
M 12 84 
L 84 12 
M 16 88 
L 88 16 
M 20 92 
L 92 20 
M 24 96 
L 96 24 
M 28 100 
L 100 28 
M 32 104 
L 104 32 
M 36 108 
L 108 36 
" style="fill:#000000;stroke:#000000;stroke-linecap:butt;stroke-linejoin:miter;stroke-width:1.0;"/>
  </pattern>
  <pattern height="72" id="h6748529660" patternUnits="userSpaceOnUse" width="72" x="0" y="0">
   <rect fill="#2ca02c" height="73" width="73" x="0" y="0"/>
   <path d="M -36 36 
L 36 -36 
M -32 40 
L 40 -32 
M -28 44 
L 44 -28 
M -24 48 
L 48 -24 
M -20 52 
L 52 -20 
M -16 56 
L 56 -16 
M -12 60 
L 60 -12 
M -8 64 
L 64 -8 
M -4 68 
L 68 -4 
M 0 72 
L 72 0 
M 4 76 
L 76 4 
M 8 80 
L 80 8 
M 12 84 
L 84 12 
M 16 88 
L 88 16 
M 20 92 
L 92 20 
M 24 96 
L 96 24 
M 28 100 
L 100 28 
M 32 104 
L 104 32 
M 36 108 
L 108 36 
" style="fill:#000000;stroke:#000000;stroke-linecap:butt;stroke-linejoin:miter;stroke-width:1.0;"/>
  </pattern>
  <pattern height="72" id="h4cee433ef5" patternUnits="userSpaceOnUse" width="72" x="0" y="0">
   <rect fill="#d62728" height="73" width="73" x="0" y="0"/>
   <path d="M -36 36 
L 36 -36 
M -32 40 
L 40 -32 
M -28 44 
L 44 -28 
M -24 48 
L 48 -24 
M -20 52 
L 52 -20 
M -16 56 
L 56 -16 
M -12 60 
L 60 -12 
M -8 64 
L 64 -8 
M -4 68 
L 68 -4 
M 0 72 
L 72 0 
M 4 76 
L 76 4 
M 8 80 
L 80 8 
M 12 84 
L 84 12 
M 16 88 
L 88 16 
M 20 92 
L 92 20 
M 24 96 
L 96 24 
M 28 100 
L 100 28 
M 32 104 
L 104 32 
M 36 108 
L 108 36 
" style="fill:#000000;stroke:#000000;stroke-linecap:butt;stroke-linejoin:miter;stroke-width:1.0;"/>
  </pattern>
  <pattern height="72" id="h453631b812" patternUnits="userSpaceOnUse" width="72" x="0" y="0">
   <rect fill="#9467bd" height="73" width="73" x="0" y="0"/>
   <path d="M -36 36 
L 36 -36 
M -32 40 
L 40 -32 
M -28 44 
L 44 -28 
M -24 48 
L 48 -24 
M -20 52 
L 52 -20 
M -16 56 
L 56 -16 
M -12 60 
L 60 -12 
M -8 64 
L 64 -8 
M -4 68 
L 68 -4 
M 0 72 
L 72 0 
M 4 76 
L 76 4 
M 8 80 
L 80 8 
M 12 84 
L 84 12 
M 16 88 
L 88 16 
M 20 92 
L 92 20 
M 24 96 
L 96 24 
M 28 100 
L 100 28 
M 32 104 
L 104 32 
M 36 108 
L 108 36 
" style="fill:#000000;stroke:#000000;stroke-linecap:butt;stroke-linejoin:miter;stroke-width:1.0;"/>
  </pattern>
  <pattern height="72" id="h20cfde9381" patternUnits="userSpaceOnUse" width="72" x="0" y="0">
   <rect fill="#8c564b" height="73" width="73" x="0" y="0"/>
   <path d="M -36 36 
L 36 -36 
M -32 40 
L 40 -32 
M -28 44 
L 44 -28 
M -24 48 
L 48 -24 
M -20 52 
L 52 -20 
M -16 56 
L 56 -16 
M -12 60 
L 60 -12 
M -8 64 
L 64 -8 
M -4 68 
L 68 -4 
M 0 72 
L 72 0 
M 4 76 
L 76 4 
M 8 80 
L 80 8 
M 12 84 
L 84 12 
M 16 88 
L 88 16 
M 20 92 
L 92 20 
M 24 96 
L 96 24 
M 28 100 
L 100 28 
M 32 104 
L 104 32 
M 36 108 
L 108 36 
" style="fill:#000000;stroke:#000000;stroke-linecap:butt;stroke-linejoin:miter;stroke-width:1.0;"/>
  </pattern>
  <pattern height="72" id="hb631158508" patternUnits="userSpaceOnUse" width="72" x="0" y="0">
   <rect fill="#e377c2" height="73" width="73" x="0" y="0"/>
   <path d="M -36 36 
L 36 -36 
M -32 40 
L 40 -32 
M -28 44 
L 44 -28 
M -24 48 
L 48 -24 
M -20 52 
L 52 -20 
M -16 56 
L 56 -16 
M -12 60 
L 60 -12 
M -8 64 
L 64 -8 
M -4 68 
L 68 -4 
M 0 72 
L 72 0 
M 4 76 
L 76 4 
M 8 80 
L 80 8 
M 12 84 
L 84 12 
M 16 88 
L 88 16 
M 20 92 
L 92 20 
M 24 96 
L 96 24 
M 28 100 
L 100 28 
M 32 104 
L 104 32 
M 36 108 
L 108 36 
" style="fill:#000000;stroke:#000000;stroke-linecap:butt;stroke-linejoin:miter;stroke-width:1.0;"/>
  </pattern>
  <pattern height="72" id="h2c0979a328" patternUnits="userSpaceOnUse" width="72" x="0" y="0">
   <rect fill="#7f7f7f" height="73" width="73" x="0" y="0"/>
   <path d="M -36 36 
L 36 -36 
M -32 40 
L 40 -32 
M -28 44 
L 44 -28 
M -24 48 
L 48 -24 
M -20 52 
L 52 -20 
M -16 56 
L 56 -16 
M -12 60 
L 60 -12 
M -8 64 
L 64 -8 
M -4 68 
L 68 -4 
M 0 72 
L 72 0 
M 4 76 
L 76 4 
M 8 80 
L 80 8 
M 12 84 
L 84 12 
M 16 88 
L 88 16 
M 20 92 
L 92 20 
M 24 96 
L 96 24 
M 28 100 
L 100 28 
M 32 104 
L 104 32 
M 36 108 
L 108 36 
" style="fill:#000000;stroke:#000000;stroke-linecap:butt;stroke-linejoin:miter;stroke-width:1.0;"/>
  </pattern>
 </defs>
</svg>
